{"text_format":"1","workbook":"xlsx","n_sheets":2,"sheets":["18.11.20","17.11.20"],"not_rendered":{"charts":0,"images":1,"macros":1,"external_links":1,"defined_names":14,"comments":2,"pivot_tables":0},"unopened":[],"bounds":{"document_bytes":16777216,"sheet_cells":100000,"rows_first":2000,"rows_last":500,"rows_between":2000,"halvings":0,"cell_chars":16384,"cell_head_chars":4096},"cells_cut":0,"cells_raw":0,"read":"whole","date_system":"1900"}

{"sheet":"18.11.20","index":0,"n_rows":309,"n_cols":19,"rows_kept":309,"cut":false,"hidden":false,"merged":[[0,0,0,15],[0,16,2,16],[0,25,2,25]]}
["18.11.20",null,null,null,null,null,null,null,null,null,null,null,null,null,null,null,null,null,1]
[null,"Имена","Фамилия","Где садятся","Теплицы","Стройка","Азиз","Нефтянка","Никишова","Касатов","Генерал","Арташ","Сироп","Всего","Оплата","Долг"]
[{"$f":"SUM(S3:X3)-SUM(N4:N305)","v":-7},"134 Ж / 130 М",{"$f":"SUMPRODUCT(IF($N4:$N305=1,IF(RIGHT(A4:A305,1)=\"ж\",1,0),0))&\" жен / \"&SUMPRODUCT(IF($N4:$N305=1,IF(RIGHT(A4:A305,1)=\"м\",1,0),0))&\" муж\"","v":"5 жен / 2 муж"},{"$f":"IF(Y3-N3=0,\"0\",IF(Y3-N3>0,\"ещё \"&Y3-N3&\" Человек\",\"Лишних = \"&N3-Y3))","v":"Лишних = 7"},{"$f":"E306&\" / \"&SUMPRODUCT(IF(E4:E306=1,IF(RIGHT($A$4:$A306,1)=\"м\",1,0),0))&\"м\"","v":"4 / 1м"},{"$f":"F306&\" / \"&SUMPRODUCT(IF(F4:F306=1,IF(RIGHT($A$4:$A306,1)=\"м\",1,0),0))&\"м\"","v":"0 / 0м"},{"$f":"G306&\" / \"&SUMPRODUCT(IF(G4:G306=1,IF(RIGHT($A$4:$A306,1)=\"м\",1,0),0))&\"м\"","v":"3 / 1м"},{"$f":"H306&\" / \"&SUMPRODUCT(IF(H4:H306=1,IF(RIGHT($A$4:$A306,1)=\"м\",1,0),0))&\"м\"","v":"0 / 0м"},{"$f":"I306&\" / \"&SUMPRODUCT(IF(I4:I306=1,IF(RIGHT($A$4:$A306,1)=\"м\",1,0),0))&\"м\"","v":"0 / 0м"},{"$f":"J306&\" / \"&SUMPRODUCT(IF(J4:J306=1,IF(RIGHT($A$4:$A306,1)=\"м\",1,0),0))&\"м\"","v":"0 / 0м"},{"$f":"K306&\" / \"&SUMPRODUCT(IF(K4:K306=1,IF(RIGHT($A$4:$A306,1)=\"м\",1,0),0))&\"м\"","v":"0 / 0м"},{"$f":"L306&\" / \"&SUMPRODUCT(IF(L4:L306=1,IF(RIGHT($A$4:$A306,1)=\"м\",1,0),0))&\"м\"","v":"0 / 0м"},{"$f":"M306&\" / \"&SUMPRODUCT(IF(M4:M306=1,IF(RIGHT($A$4:$A306,1)=\"м\",1,0),0))&\"м\"","v":"0 / 0м"},{"$f":"SUM($N$4:$N305)","v":7}]
[{"$f":"ROW(A1)&\" \"&IFERROR(IF(VLOOKUP($B$4:$B71,[1]!Имя_Ж_Список,1,FALSE)=FALSE,\"\",\"\"),\"м\")&IFERROR(IF(VLOOKUP($B$4:$B71,[1]!Имя_М_Список,1,FALSE)=FALSE,\"\",\"\"),\"ж\")&IFERROR(IF(VLOOKUP($B$4:$B71,[1]Новенькие!$E$2:$E401,1,FALSE)=FALSE,\"\",\" н\"),\"\")","v":"1 м"},"Антон","Авдосеев(Мол)","Стоянка",null,null,null,null,null,null,null,null,null,{"$f":"IF(G4<>\"\",G4,IF(H4<>\"\",H4,IF(I4<>\"\",I4,IF(E4<>\"\",E4,IF(J4<>\"\",J4,IF(F4<>\"\",F4,IF(M4<>\"\",M4,IF(K4<>\"\",K4,IF(L4<>\"\",L4,\"\")))))))))","v":""}]
[{"$f":"ROW(A2)&\" \"&IFERROR(IF(VLOOKUP($B$4:$B72,[1]!Имя_Ж_Список,1,FALSE)=FALSE,\"\",\"\"),\"м\")&IFERROR(IF(VLOOKUP($B$4:$B72,[1]!Имя_М_Список,1,FALSE)=FALSE,\"\",\"\"),\"ж\")&IFERROR(IF(VLOOKUP($B$4:$B72,[1]Новенькие!$E$2:$E402,1,FALSE)=FALSE,\"\",\" н\"),\"\")","v":"2 м"},"Даниил","Алексеев(Мол)","Стоянка",null,null,null,null,null,null,null,null,null,""]
[{"$f":"ROW(A3)&\" \"&IFERROR(IF(VLOOKUP($B$4:$B73,[1]!Имя_Ж_Список,1,FALSE)=FALSE,\"\",\"\"),\"м\")&IFERROR(IF(VLOOKUP($B$4:$B73,[1]!Имя_М_Список,1,FALSE)=FALSE,\"\",\"\"),\"ж\")&IFERROR(IF(VLOOKUP($B$4:$B73,[1]Новенькие!$E$2:$E403,1,FALSE)=FALSE,\"\",\" н\"),\"\")","v":"3 м"},"Саша","Алекторов","Стоянка",null,null,1,null,null,null,null,null,null,1]
[{"$f":"ROW(A4)&\" \"&IFERROR(IF(VLOOKUP($B$4:$B74,[1]!Имя_Ж_Список,1,FALSE)=FALSE,\"\",\"\"),\"м\")&IFERROR(IF(VLOOKUP($B$4:$B74,[1]!Имя_М_Список,1,FALSE)=FALSE,\"\",\"\"),\"ж\")&IFERROR(IF(VLOOKUP($B$4:$B74,[1]Новенькие!$E$2:$E404,1,FALSE)=FALSE,\"\",\" н\"),\"\")","v":"4 ж"},"Дарья","Балашова(Мол)","Стоянка",null,null,1,null,null,null,null,null,null,1]
[{"$f":"ROW(A5)&\" \"&IFERROR(IF(VLOOKUP($B$4:$B75,[1]!Имя_Ж_Список,1,FALSE)=FALSE,\"\",\"\"),\"м\")&IFERROR(IF(VLOOKUP($B$4:$B75,[1]!Имя_М_Список,1,FALSE)=FALSE,\"\",\"\"),\"ж\")&IFERROR(IF(VLOOKUP($B$4:$B75,[1]Новенькие!$E$2:$E405,1,FALSE)=FALSE,\"\",\" н\"),\"\")","v":"5 ж"},"Оксана","Батманова","Стоянка",null,null,null,null,null,null,null,null,null,""]
[{"$f":"ROW(A6)&\" \"&IFERROR(IF(VLOOKUP($B$4:$B76,[1]!Имя_Ж_Список,1,FALSE)=FALSE,\"\",\"\"),\"м\")&IFERROR(IF(VLOOKUP($B$4:$B76,[1]!Имя_М_Список,1,FALSE)=FALSE,\"\",\"\"),\"ж\")&IFERROR(IF(VLOOKUP($B$4:$B76,[1]Новенькие!$E$2:$E406,1,FALSE)=FALSE,\"\",\" н\"),\"\")","v":"6 ж"},"Наташа","Батрова","Стоянка",null,null,null,null,null,null,null,null,null,""]
[{"$f":"ROW(A7)&\" \"&IFERROR(IF(VLOOKUP($B$4:$B77,[1]!Имя_Ж_Список,1,FALSE)=FALSE,\"\",\"\"),\"м\")&IFERROR(IF(VLOOKUP($B$4:$B77,[1]!Имя_М_Список,1,FALSE)=FALSE,\"\",\"\"),\"ж\")&IFERROR(IF(VLOOKUP($B$4:$B77,[1]Новенькие!$E$2:$E407,1,FALSE)=FALSE,\"\",\" н\"),\"\")","v":"7 м"},"Игорь","Бел Настенько","Стоянка",null,null,null,null,null,null,null,null,null,""]
[{"$f":"ROW(A8)&\" \"&IFERROR(IF(VLOOKUP($B$4:$B78,[1]!Имя_Ж_Список,1,FALSE)=FALSE,\"\",\"\"),\"м\")&IFERROR(IF(VLOOKUP($B$4:$B78,[1]!Имя_М_Список,1,FALSE)=FALSE,\"\",\"\"),\"ж\")&IFERROR(IF(VLOOKUP($B$4:$B78,[1]Новенькие!$E$2:$E408,1,FALSE)=FALSE,\"\",\" н\"),\"\")","v":"8 ж"},"Люда","Белякова","Стоянка",null,null,null,null,null,null,null,null,null,""]
[{"$f":"ROW(A9)&\" \"&IFERROR(IF(VLOOKUP($B$4:$B79,[1]!Имя_Ж_Список,1,FALSE)=FALSE,\"\",\"\"),\"м\")&IFERROR(IF(VLOOKUP($B$4:$B79,[1]!Имя_М_Список,1,FALSE)=FALSE,\"\",\"\"),\"ж\")&IFERROR(IF(VLOOKUP($B$4:$B79,[1]Новенькие!$E$2:$E409,1,FALSE)=FALSE,\"\",\" н\"),\"\")","v":"9 м"},"Артём","Бирюков(Мол)","Стоянка",null,null,null,null,null,null,null,null,null,""]
[{"$f":"ROW(A10)&\" \"&IFERROR(IF(VLOOKUP($B$4:$B80,[1]!Имя_Ж_Список,1,FALSE)=FALSE,\"\",\"\"),\"м\")&IFERROR(IF(VLOOKUP($B$4:$B80,[1]!Имя_М_Список,1,FALSE)=FALSE,\"\",\"\"),\"ж\")&IFERROR(IF(VLOOKUP($B$4:$B80,[1]Новенькие!$E$2:$E410,1,FALSE)=FALSE,\"\",\" н\"),\"\")","v":"10 м"},"Максим","Божановский(Мол)","Стоянка",null,null,null,null,null,null,null,null,null,""]
[{"$f":"ROW(A11)&\" \"&IFERROR(IF(VLOOKUP($B$4:$B81,[1]!Имя_Ж_Список,1,FALSE)=FALSE,\"\",\"\"),\"м\")&IFERROR(IF(VLOOKUP($B$4:$B81,[1]!Имя_М_Список,1,FALSE)=FALSE,\"\",\"\"),\"ж\")&IFERROR(IF(VLOOKUP($B$4:$B81,[1]Новенькие!$E$2:$E411,1,FALSE)=FALSE,\"\",\" н\"),\"\")","v":"11 ж"},"Надя","Болтунова","Стоянка",1,null,null,null,null,null,null,null,null,1]
[{"$f":"ROW(A12)&\" \"&IFERROR(IF(VLOOKUP($B$4:$B82,[1]!Имя_Ж_Список,1,FALSE)=FALSE,\"\",\"\"),\"м\")&IFERROR(IF(VLOOKUP($B$4:$B82,[1]!Имя_М_Список,1,FALSE)=FALSE,\"\",\"\"),\"ж\")&IFERROR(IF(VLOOKUP($B$4:$B82,[1]Новенькие!$E$2:$E412,1,FALSE)=FALSE,\"\",\" н\"),\"\")","v":"12 м"},"Артём","Братский(Канд)","Стоянка",null,null,null,null,null,null,null,null,null,""]
{"$rows_left_out":295}
{"sheet":"17.11.20","index":1,"n_rows":320,"n_cols":29,"rows_kept":320,"cut":false,"hidden":false,"merged":[[0,0,0,15],[0,16,2,16],[0,25,2,25]]}
["17.11.20",null,null,null,null,null,null,null,null,null,null,null,null,null,null,null,null,{"$f":"IF(SUM($S$4:$S305,$Q$4:$Q305)=COUNTIF($N$4:$N305,\"1\")+COUNTIF($N$4:$N305,\"-\"),\"\",\"Не срастухи\")&IF(N3<>N306,\"Работал у Двух\",)","v":""},306,1,1,{"$f":"SUM($V$4:$V305)","v":11},null,null,null,{"$f":"IF(SUMPRODUCT(($E$4:$E304=1)*($O$4:$O304=1000),$E$4:$E304)>0,SUMPRODUCT(($E$4:$E304=1)*($O$4:$O304=1000),$E$4:$E304)&\" + 200\",\"\")&\" \"&IF(SUMPRODUCT(($E$4:$E304=1)*($O$4:$O304=950),$E$4:$E304)>0,SUMPRODUCT(($E$4:$E304=1)*($O$4:$O304=950),$E$4:$E304)&\" + 150\",\"\")&\" \"&IF(SUMPRODUCT(($E$4:$E304=1)*($O$4:$O304=900),$E$4:$E304)>0,SUMPRODUCT(($E$4:$E304=1)*($O$4:$O304=900),$E$4:$E304)&\" + 100\",\"\")&\" \"&IF(SUMPRODUCT(($E$4:$E304=1)*($O$4:$O304=850),$E$4:$E304)>0,SUMPRODUCT(($E$4:$E304=1)*($O$4:$O304=850),$E$4:$E304)&\" + 50\",\"\")&\" \"&IF(SUMPRODUCT(($E$4:$E304=1)*($O$4:$O304=750),$E$4:$E304)>0,SUMPRODUCT(($E$4:$E304=1)*($O$4:$O304=750),$E$4:$E304)&\" = 750\",\"\")&\" \"&IF(SUMPRODUCT(($E$4:$E304=1)*($O$4:$O304=700),$E$4:$E304)>0,SUMPRODUCT(($E$4:$E304=1)*($O$4:$O304=800),$E$4:$E304)&\" = 700\",\"\")&\" \"&IF(SUMPRODUCT(($E$4:$E304=1)*($O$4:$O304=650),$E$4:$E304)>0,SUMPRODUCT(($E$4:$E304=1)*($O$4:$O304=650),$E$4:$E304)&\" = 650\",\"\")&\" \"&IF(SUMPRODUCT(($E$4:$E304=1)*($O$4:$O304=600),$E$4:$E304)>0,SUMPRODUCT(($E$4:$E304=1)*($O$4:$O304=600),$E$4:$E304)&\" = 600\",\"\")&\" \"&IF(SUMPRODUCT(($E$4:$E304=1)*($O$4:$O304=550),$E$4:$E304)>0,SUMPRODUCT(($E$4:$E304=1)*($O$4:$O304=550),$E$4:$E304)&\" = 550\",\"\")&\" \"&IF(SUMPRODUCT(($E$4:$E304=1)*($O$4:$O304=500),$E$4:$E304)>0,SUMPRODUCT(($E$4:$E304=1)*($O$4:$O304=500),$E$4:$E304)&\" = 500\",\"\")&\" \"&IF(SUMPRODUCT(($E$4:$E304=1)*($O$4:$O304=450),$E$4:$E304)>0,SUMPRODUCT(($E$4:$E304=1)*($O$4:$O304=450),$E$4:$E304)&\" = 450\",\"\")&\"\n\"&IF(SUMPRODUCT(($E$4:$E304=1)*($O$4:$O304=400),$E$4:$E304)>0,SUMPRODUCT(($E$4:$E304=1)*($O$4:$O304=400),$E$4:$E304)&\" = 400\",\"\")&\"  \"&IF(SUMPRODUCT(($E$4:$E304=1)*($O$4:$O304=350),$E$4:$E304)>0,SUMPRODUCT(($E$4:$E304=1)*($O$4:$O304=350),$E$4:$E304)&\" = 350\",\"\")&\" \"&IF(SUMPRODUCT(($E$4:$E304=1)*($O$4:$O304=300),$E$4:$E304)>0,SUMPRODUCT(($E$4:$E304=1)*($O$4:$O304=300),$E$4:$E304)&\" = 300\",\"\")&\" \"&IF(SUMPRODUCT(($E$4:$E304=1)*($O$4:$O304=250),$E$4:$E304)>0,SUMPRODUCT(($E$4:$E304=1)*($O$4:$O304=250),$E$4:$E304)&\" = 250\",\"\")&\" \"&IF(SUMPRODUCT(($E$4:$E304=1)*($O$4:$O304=200),$E$4:$E304)>0,SUMPRODUCT(($E$4:$E304=1)*($O$4:$O304=200),$E$4:$E304)&\" = 200\",\"\")&\" \"&IF(SUMPRODUCT(($E$4:$E304=1)*($O$4:$O304=100),$E$4:$E304)>0,SUMPRODUCT(($E$4:$E304=1)*($O$4:$O304=100),$E$4:$E304)&\" = 100\",\"\")","v":"          \n      "},{"$f":"E306","v":1}]
[null,"Имена","Фамилия","Где садятся","Теплицы","Стройка","Азиз","Нефтянка","Никишова","Касатов","Гениерал","Арташ","Сироп","Всего","Оплата","Долг",null,null,"Склад","Никишов","Теплицы","стройка","Арташ","Миша",{"$f":"SUM(--ISNUMBER(MATCH(IF(MATCH(Имена1,Имена1,)=ROW(Имена1)-3,Имена1),Имена2,)))","v":0},null,null,{"$f":"AA1*700","v":700}]
[{"$f":"SUM(S3:X3)-SUM(N4:N305)","v":-1},"134 Ж / 130 М",{"$f":"SUMPRODUCT(IF($N4:$N305=1,IF(RIGHT(A4:A305,1)=\"ж\",1,0),0))&\" жен / \"&SUMPRODUCT(IF($N4:$N305=1,IF(RIGHT(A4:A305,1)=\"м\",1,0),0))&\" муж\"","v":"8 жен / 4 муж"},{"$f":"IF(Y3-N3=0,\"0\",IF(Y3-N3>0,\"ещё \"&Y3-N3&\" Человек\",\"Лишних = \"&N3-Y3))","v":"Лишних = 1"},{"$f":"E306&\" / \"&SUMPRODUCT(IF(E4:E306=1,IF(RIGHT($A$4:$A306,1)=\"м\",1,0),0))&\"м\"","v":"1 / 1м"},{"$f":"F306&\" / \"&SUMPRODUCT(IF(F4:F306=1,IF(RIGHT($A$4:$A306,1)=\"м\",1,0),0))&\"м\"","v":"0 / 0м"},{"$f":"G306&\" / \"&SUMPRODUCT(IF(G4:G306=1,IF(RIGHT($A$4:$A306,1)=\"м\",1,0),0))&\"м\"","v":"0 / 0м"},{"$f":"H306&\" / \"&SUMPRODUCT(IF(H4:H306=1,IF(RIGHT($A$4:$A306,1)=\"м\",1,0),0))&\"м\"","v":"0 / 0м"},{"$f":"I306&\" / \"&SUMPRODUCT(IF(I4:I306=1,IF(RIGHT($A$4:$A306,1)=\"м\",1,0),0))&\"м\"","v":"11 / 3м"},{"$f":"J306&\" / \"&SUMPRODUCT(IF(J4:J306=1,IF(RIGHT($A$4:$A306,1)=\"м\",1,0),0))&\"м\"","v":"0 / 0м"},{"$f":"K306&\" / \"&SUMPRODUCT(IF(K4:K306=1,IF(RIGHT($A$4:$A306,1)=\"м\",1,0),0))&\"м\"","v":"0 / 0м"},{"$f":"L306&\" / \"&SUMPRODUCT(IF(L4:L306=1,IF(RIGHT($A$4:$A306,1)=\"м\",1,0),0))&\"м\"","v":"0 / 0м"},{"$f":"M306&\" / \"&SUMPRODUCT(IF(M4:M306=1,IF(RIGHT($A$4:$A306,1)=\"м\",1,0),0))&\"м\"","v":"0 / 0м"},{"$f":"SUM($N$4:$N305)","v":12},null,null,null,null,null,null,null,5,1,5,{"$f":"SUM(S3:X3)","v":11},null,{"$f":"SUMIF(E4:E305,\"1\",O4:O305)","v":800},{"$f":"AA1*200+AA3","v":1000},{"$f":"E309*700","v":140000}]
[{"$f":"ROW(A1)&\" \"&IFERROR(IF(VLOOKUP($B$4:$B71,[1]!Имя_Ж_Список,1,FALSE)=FALSE,\"\",\"\"),\"м\")&IFERROR(IF(VLOOKUP($B$4:$B71,[1]!Имя_М_Список,1,FALSE)=FALSE,\"\",\"\"),\"ж\")&IFERROR(IF(VLOOKUP($B$4:$B71,[1]Новенькие!$E$2:$E401,1,FALSE)=FALSE,\"\",\" н\"),\"\")","v":"1 м"},"Антон","Авдосеев(Мол)","Стоянка",null,null,null,null,null,null,null,null,null,{"$f":"IF(G4<>\"\",G4,IF(H4<>\"\",H4,IF(I4<>\"\",I4,IF(E4<>\"\",E4,IF(J4<>\"\",J4,IF(F4<>\"\",F4,IF(M4<>\"\",M4,IF(K4<>\"\",K4,IF(L4<>\"\",L4,\"\")))))))))","v":""},null,null,{"$f":"IF(N4=\"\",\"\",IF(AND(N4=1,S4=1),\"\",IF(N4=1,1,IF(N4=\"-\",\"-\",IF(N4=\"?\",\"?\",)))))","v":""},null,null,{"$f":"INDEX(INDIRECT(TEXT($A$1-1,\"ДД.ММ.гг\")&\"!B4:t500\"),MATCH($B4:$B446&$C4:$C446,INDIRECT(TEXT($A$1-1,\"ДД.ММ.гг\")&\"!$B4:B500\")&INDIRECT(TEXT($A$1-1,\"ДД.ММ.гг\")&\"!$c4:C500\"),0),17)&\"/\"&INDEX(INDIRECT(TEXT($A$1-1,\"ДД.ММ.гг\")&\"!B4:t500\"),MATCH($B4:$B446&$C4:$C446,INDIRECT(TEXT($A$1-1,\"ДД.ММ.гг\")&\"!$B4:B500\")&INDIRECT(TEXT($A$1-1,\"ДД.ММ.гг\")&\"!$c4:C500\"),0),15)","v":{"$error":"#REF!"}},{"$f":"INDEX(INDIRECT(TEXT($A$1-1,\"ДД.ММ.гг\")&\"!B4:s500\"), MATCH($B4:$B446&$C4:$C446,INDIRECT(TEXT($A$1-1,\"ДД.ММ.гг\")&\"!$B4:B500\")&INDIRECT(TEXT($A$1-1,\"ДД.ММ.гг\")&\"!$c4:C500\"),0),MATCH(\"Всего\",INDIRECT(TEXT($A$1-1,\"ДД.ММ.гг\")&\"!B2:t2\"),0))","v":{"$error":"#REF!"}},null,"Стоянка"]
[{"$f":"ROW(A2)&\" \"&IFERROR(IF(VLOOKUP($B$4:$B72,[1]!Имя_Ж_Список,1,FALSE)=FALSE,\"\",\"\"),\"м\")&IFERROR(IF(VLOOKUP($B$4:$B72,[1]!Имя_М_Список,1,FALSE)=FALSE,\"\",\"\"),\"ж\")&IFERROR(IF(VLOOKUP($B$4:$B72,[1]Новенькие!$E$2:$E402,1,FALSE)=FALSE,\"\",\" н\"),\"\")","v":"2 м"},"Даниил","Алексеев(Мол)","Стоянка",null,null,null,null,null,null,null,null,null,"",null,null,{"$f":"IF(N5=\"\",\"\",IF(AND(N5=1,S5=1),\"\",IF(N5=1,1,IF(N5=\"-\",\"-\",IF(N5=\"?\",\"?\",)))))","v":""},null,null,{"$f":"INDEX(INDIRECT(TEXT($A$1-1,\"ДД.ММ.гг\")&\"!B4:t500\"),MATCH($B5:$B447&$C5:$C447,INDIRECT(TEXT($A$1-1,\"ДД.ММ.гг\")&\"!$B4:B500\")&INDIRECT(TEXT($A$1-1,\"ДД.ММ.гг\")&\"!$c4:C500\"),0),17)&\"/\"&INDEX(INDIRECT(TEXT($A$1-1,\"ДД.ММ.гг\")&\"!B4:t500\"),MATCH($B5:$B447&$C5:$C447,INDIRECT(TEXT($A$1-1,\"ДД.ММ.гг\")&\"!$B4:B500\")&INDIRECT(TEXT($A$1-1,\"ДД.ММ.гг\")&\"!$c4:C500\"),0),15)","v":{"$error":"#REF!"}},{"$f":"INDEX(INDIRECT(TEXT($A$1-1,\"ДД.ММ.гг\")&\"!B4:s500\"), MATCH($B5:$B447&$C5:$C447,INDIRECT(TEXT($A$1-1,\"ДД.ММ.гг\")&\"!$B4:B500\")&INDIRECT(TEXT($A$1-1,\"ДД.ММ.гг\")&\"!$c4:C500\"),0),MATCH(\"Всего\",INDIRECT(TEXT($A$1-1,\"ДД.ММ.гг\")&\"!B2:t2\"),0))","v":{"$error":"#REF!"}},null,"Семь Гномов"]
[{"$f":"ROW(A3)&\" \"&IFERROR(IF(VLOOKUP($B$4:$B73,[1]!Имя_Ж_Список,1,FALSE)=FALSE,\"\",\"\"),\"м\")&IFERROR(IF(VLOOKUP($B$4:$B73,[1]!Имя_М_Список,1,FALSE)=FALSE,\"\",\"\"),\"ж\")&IFERROR(IF(VLOOKUP($B$4:$B73,[1]Новенькие!$E$2:$E403,1,FALSE)=FALSE,\"\",\" н\"),\"\")","v":"3 м"},"Саша","Алекторов","Стоянка",1,null,null,null,null,null,null,null,null,1,800,null,"",null,1,{"$f":"INDEX(INDIRECT(TEXT($A$1-1,\"ДД.ММ.гг\")&\"!B4:t500\"),MATCH($B6:$B448&$C6:$C448,INDIRECT(TEXT($A$1-1,\"ДД.ММ.гг\")&\"!$B4:B500\")&INDIRECT(TEXT($A$1-1,\"ДД.ММ.гг\")&\"!$c4:C500\"),0),17)&\"/\"&INDEX(INDIRECT(TEXT($A$1-1,\"ДД.ММ.гг\")&\"!B4:t500\"),MATCH($B6:$B448&$C6:$C448,INDIRECT(TEXT($A$1-1,\"ДД.ММ.гг\")&\"!$B4:B500\")&INDIRECT(TEXT($A$1-1,\"ДД.ММ.гг\")&\"!$c4:C500\"),0),15)","v":{"$error":"#REF!"}},{"$f":"INDEX(INDIRECT(TEXT($A$1-1,\"ДД.ММ.гг\")&\"!B4:s500\"), MATCH($B6:$B448&$C6:$C448,INDIRECT(TEXT($A$1-1,\"ДД.ММ.гг\")&\"!$B4:B500\")&INDIRECT(TEXT($A$1-1,\"ДД.ММ.гг\")&\"!$c4:C500\"),0),MATCH(\"Всего\",INDIRECT(TEXT($A$1-1,\"ДД.ММ.гг\")&\"!B2:t2\"),0))","v":{"$error":"#REF!"}},null,"Ткацкая"]
[{"$f":"ROW(A4)&\" \"&IFERROR(IF(VLOOKUP($B$4:$B74,[1]!Имя_Ж_Список,1,FALSE)=FALSE,\"\",\"\"),\"м\")&IFERROR(IF(VLOOKUP($B$4:$B74,[1]!Имя_М_Список,1,FALSE)=FALSE,\"\",\"\"),\"ж\")&IFERROR(IF(VLOOKUP($B$4:$B74,[1]Новенькие!$E$2:$E404,1,FALSE)=FALSE,\"\",\" н\"),\"\")","v":"4 ж"},"Дарья","Балашова(Мол)","Стоянка",null,null,null,null,null,null,null,null,null,"",null,null,"",null,null,{"$f":"INDEX(INDIRECT(TEXT($A$1-1,\"ДД.ММ.гг\")&\"!B4:t500\"),MATCH($B7:$B449&$C7:$C449,INDIRECT(TEXT($A$1-1,\"ДД.ММ.гг\")&\"!$B4:B500\")&INDIRECT(TEXT($A$1-1,\"ДД.ММ.гг\")&\"!$c4:C500\"),0),17)&\"/\"&INDEX(INDIRECT(TEXT($A$1-1,\"ДД.ММ.гг\")&\"!B4:t500\"),MATCH($B7:$B449&$C7:$C449,INDIRECT(TEXT($A$1-1,\"ДД.ММ.гг\")&\"!$B4:B500\")&INDIRECT(TEXT($A$1-1,\"ДД.ММ.гг\")&\"!$c4:C500\"),0),15)","v":{"$error":"#REF!"}},{"$f":"INDEX(INDIRECT(TEXT($A$1-1,\"ДД.ММ.гг\")&\"!B4:s500\"), MATCH($B7:$B449&$C7:$C449,INDIRECT(TEXT($A$1-1,\"ДД.ММ.гг\")&\"!$B4:B500\")&INDIRECT(TEXT($A$1-1,\"ДД.ММ.гг\")&\"!$c4:C500\"),0),MATCH(\"Всего\",INDIRECT(TEXT($A$1-1,\"ДД.ММ.гг\")&\"!B2:t2\"),0))","v":{"$error":"#REF!"}},null,"Керамика"]
[{"$f":"ROW(A5)&\" \"&IFERROR(IF(VLOOKUP($B$4:$B75,[1]!Имя_Ж_Список,1,FALSE)=FALSE,\"\",\"\"),\"м\")&IFERROR(IF(VLOOKUP($B$4:$B75,[1]!Имя_М_Список,1,FALSE)=FALSE,\"\",\"\"),\"ж\")&IFERROR(IF(VLOOKUP($B$4:$B75,[1]Новенькие!$E$2:$E405,1,FALSE)=FALSE,\"\",\" н\"),\"\")","v":"5 ж"},"Оксана","Батманова","Стоянка",null,null,null,null,null,null,null,null,null,"",null,null,"",null,null,{"$f":"INDEX(INDIRECT(TEXT($A$1-1,\"ДД.ММ.гг\")&\"!B4:t500\"),MATCH($B8:$B450&$C8:$C450,INDIRECT(TEXT($A$1-1,\"ДД.ММ.гг\")&\"!$B4:B500\")&INDIRECT(TEXT($A$1-1,\"ДД.ММ.гг\")&\"!$c4:C500\"),0),17)&\"/\"&INDEX(INDIRECT(TEXT($A$1-1,\"ДД.ММ.гг\")&\"!B4:t500\"),MATCH($B8:$B450&$C8:$C450,INDIRECT(TEXT($A$1-1,\"ДД.ММ.гг\")&\"!$B4:B500\")&INDIRECT(TEXT($A$1-1,\"ДД.ММ.гг\")&\"!$c4:C500\"),0),15)","v":{"$error":"#REF!"}},{"$f":"INDEX(INDIRECT(TEXT($A$1-1,\"ДД.ММ.гг\")&\"!B4:s500\"), MATCH($B8:$B450&$C8:$C450,INDIRECT(TEXT($A$1-1,\"ДД.ММ.гг\")&\"!$B4:B500\")&INDIRECT(TEXT($A$1-1,\"ДД.ММ.гг\")&\"!$c4:C500\"),0),MATCH(\"Всего\",INDIRECT(TEXT($A$1-1,\"ДД.ММ.гг\")&\"!B2:t2\"),0))","v":{"$error":"#REF!"}},null,"20 Школа"]
[{"$f":"ROW(A6)&\" \"&IFERROR(IF(VLOOKUP($B$4:$B76,[1]!Имя_Ж_Список,1,FALSE)=FALSE,\"\",\"\"),\"м\")&IFERROR(IF(VLOOKUP($B$4:$B76,[1]!Имя_М_Список,1,FALSE)=FALSE,\"\",\"\"),\"ж\")&IFERROR(IF(VLOOKUP($B$4:$B76,[1]Новенькие!$E$2:$E406,1,FALSE)=FALSE,\"\",\" н\"),\"\")","v":"6 ж"},"Наташа","Батрова","Стоянка",null,null,null,null,null,null,null,null,null,"",null,null,"",null,null,{"$f":"INDEX(INDIRECT(TEXT($A$1-1,\"ДД.ММ.гг\")&\"!B4:t500\"),MATCH($B9:$B451&$C9:$C451,INDIRECT(TEXT($A$1-1,\"ДД.ММ.гг\")&\"!$B4:B500\")&INDIRECT(TEXT($A$1-1,\"ДД.ММ.гг\")&\"!$c4:C500\"),0),17)&\"/\"&INDEX(INDIRECT(TEXT($A$1-1,\"ДД.ММ.гг\")&\"!B4:t500\"),MATCH($B9:$B451&$C9:$C451,INDIRECT(TEXT($A$1-1,\"ДД.ММ.гг\")&\"!$B4:B500\")&INDIRECT(TEXT($A$1-1,\"ДД.ММ.гг\")&\"!$c4:C500\"),0),15)","v":{"$error":"#REF!"}},{"$f":"INDEX(INDIRECT(TEXT($A$1-1,\"ДД.ММ.гг\")&\"!B4:s500\"), MATCH($B9:$B451&$C9:$C451,INDIRECT(TEXT($A$1-1,\"ДД.ММ.гг\")&\"!$B4:B500\")&INDIRECT(TEXT($A$1-1,\"ДД.ММ.гг\")&\"!$c4:C500\"),0),MATCH(\"Всего\",INDIRECT(TEXT($A$1-1,\"ДД.ММ.гг\")&\"!B2:t2\"),0))","v":{"$error":"#REF!"}},null,"Маяковского"]
[{"$f":"ROW(A7)&\" \"&IFERROR(IF(VLOOKUP($B$4:$B77,[1]!Имя_Ж_Список,1,FALSE)=FALSE,\"\",\"\"),\"м\")&IFERROR(IF(VLOOKUP($B$4:$B77,[1]!Имя_М_Список,1,FALSE)=FALSE,\"\",\"\"),\"ж\")&IFERROR(IF(VLOOKUP($B$4:$B77,[1]Новенькие!$E$2:$E407,1,FALSE)=FALSE,\"\",\" н\"),\"\")","v":"7 м"},"Игорь","Бел Настенько","Стоянка",null,null,null,null,null,null,null,null,null,"",null,null,"",null,null,{"$f":"INDEX(INDIRECT(TEXT($A$1-1,\"ДД.ММ.гг\")&\"!B4:t500\"),MATCH($B10:$B452&$C10:$C452,INDIRECT(TEXT($A$1-1,\"ДД.ММ.гг\")&\"!$B4:B500\")&INDIRECT(TEXT($A$1-1,\"ДД.ММ.гг\")&\"!$c4:C500\"),0),17)&\"/\"&INDEX(INDIRECT(TEXT($A$1-1,\"ДД.ММ.гг\")&\"!B4:t500\"),MATCH($B10:$B452&$C10:$C452,INDIRECT(TEXT($A$1-1,\"ДД.ММ.гг\")&\"!$B4:B500\")&INDIRECT(TEXT($A$1-1,\"ДД.ММ.гг\")&\"!$c4:C500\"),0),15)","v":{"$error":"#REF!"}},{"$f":"INDEX(INDIRECT(TEXT($A$1-1,\"ДД.ММ.гг\")&\"!B4:s500\"), MATCH($B10:$B452&$C10:$C452,INDIRECT(TEXT($A$1-1,\"ДД.ММ.гг\")&\"!$B4:B500\")&INDIRECT(TEXT($A$1-1,\"ДД.ММ.гг\")&\"!$c4:C500\"),0),MATCH(\"Всего\",INDIRECT(TEXT($A$1-1,\"ДД.ММ.гг\")&\"!B2:t2\"),0))","v":{"$error":"#REF!"}},null,"Мясокомбинат"]
[{"$f":"ROW(A8)&\" \"&IFERROR(IF(VLOOKUP($B$4:$B78,[1]!Имя_Ж_Список,1,FALSE)=FALSE,\"\",\"\"),\"м\")&IFERROR(IF(VLOOKUP($B$4:$B78,[1]!Имя_М_Список,1,FALSE)=FALSE,\"\",\"\"),\"ж\")&IFERROR(IF(VLOOKUP($B$4:$B78,[1]Новенькие!$E$2:$E408,1,FALSE)=FALSE,\"\",\" н\"),\"\")","v":"8 ж"},"Люда","Белякова","Стоянка",null,null,null,null,null,null,null,null,null,"",null,null,"",null,null,{"$f":"INDEX(INDIRECT(TEXT($A$1-1,\"ДД.ММ.гг\")&\"!B4:t500\"),MATCH($B11:$B453&$C11:$C453,INDIRECT(TEXT($A$1-1,\"ДД.ММ.гг\")&\"!$B4:B500\")&INDIRECT(TEXT($A$1-1,\"ДД.ММ.гг\")&\"!$c4:C500\"),0),17)&\"/\"&INDEX(INDIRECT(TEXT($A$1-1,\"ДД.ММ.гг\")&\"!B4:t500\"),MATCH($B11:$B453&$C11:$C453,INDIRECT(TEXT($A$1-1,\"ДД.ММ.гг\")&\"!$B4:B500\")&INDIRECT(TEXT($A$1-1,\"ДД.ММ.гг\")&\"!$c4:C500\"),0),15)","v":{"$error":"#REF!"}},{"$f":"INDEX(INDIRECT(TEXT($A$1-1,\"ДД.ММ.гг\")&\"!B4:s500\"), MATCH($B11:$B453&$C11:$C453,INDIRECT(TEXT($A$1-1,\"ДД.ММ.гг\")&\"!$B4:B500\")&INDIRECT(TEXT($A$1-1,\"ДД.ММ.гг\")&\"!$c4:C500\"),0),MATCH(\"Всего\",INDIRECT(TEXT($A$1-1,\"ДД.ММ.гг\")&\"!B2:t2\"),0))","v":{"$error":"#REF!"}}]
[{"$f":"ROW(A9)&\" \"&IFERROR(IF(VLOOKUP($B$4:$B79,[1]!Имя_Ж_Список,1,FALSE)=FALSE,\"\",\"\"),\"м\")&IFERROR(IF(VLOOKUP($B$4:$B79,[1]!Имя_М_Список,1,FALSE)=FALSE,\"\",\"\"),\"ж\")&IFERROR(IF(VLOOKUP($B$4:$B79,[1]Новенькие!$E$2:$E409,1,FALSE)=FALSE,\"\",\" н\"),\"\")","v":"9 м"},"Артём","Бирюков(Мол)","Стоянка",null,null,null,null,null,null,null,null,null,"",null,null,"",null,null,{"$f":"INDEX(INDIRECT(TEXT($A$1-1,\"ДД.ММ.гг\")&\"!B4:t500\"),MATCH($B12:$B454&$C12:$C454,INDIRECT(TEXT($A$1-1,\"ДД.ММ.гг\")&\"!$B4:B500\")&INDIRECT(TEXT($A$1-1,\"ДД.ММ.гг\")&\"!$c4:C500\"),0),17)&\"/\"&INDEX(INDIRECT(TEXT($A$1-1,\"ДД.ММ.гг\")&\"!B4:t500\"),MATCH($B12:$B454&$C12:$C454,INDIRECT(TEXT($A$1-1,\"ДД.ММ.гг\")&\"!$B4:B500\")&INDIRECT(TEXT($A$1-1,\"ДД.ММ.гг\")&\"!$c4:C500\"),0),15)","v":{"$error":"#REF!"}},{"$f":"INDEX(INDIRECT(TEXT($A$1-1,\"ДД.ММ.гг\")&\"!B4:s500\"), MATCH($B12:$B454&$C12:$C454,INDIRECT(TEXT($A$1-1,\"ДД.ММ.гг\")&\"!$B4:B500\")&INDIRECT(TEXT($A$1-1,\"ДД.ММ.гг\")&\"!$c4:C500\"),0),MATCH(\"Всего\",INDIRECT(TEXT($A$1-1,\"ДД.ММ.гг\")&\"!B2:t2\"),0))","v":{"$error":"#REF!"}}]
[{"$f":"ROW(A10)&\" \"&IFERROR(IF(VLOOKUP($B$4:$B80,[1]!Имя_Ж_Список,1,FALSE)=FALSE,\"\",\"\"),\"м\")&IFERROR(IF(VLOOKUP($B$4:$B80,[1]!Имя_М_Список,1,FALSE)=FALSE,\"\",\"\"),\"ж\")&IFERROR(IF(VLOOKUP($B$4:$B80,[1]Новенькие!$E$2:$E410,1,FALSE)=FALSE,\"\",\" н\"),\"\")","v":"10 м"},"Максим","Божановский(Мол)","Стоянка",null,null,null,null,null,null,null,null,null,"",null,null,"",null,null,{"$f":"INDEX(INDIRECT(TEXT($A$1-1,\"ДД.ММ.гг\")&\"!B4:t500\"),MATCH($B13:$B455&$C13:$C455,INDIRECT(TEXT($A$1-1,\"ДД.ММ.гг\")&\"!$B4:B500\")&INDIRECT(TEXT($A$1-1,\"ДД.ММ.гг\")&\"!$c4:C500\"),0),17)&\"/\"&INDEX(INDIRECT(TEXT($A$1-1,\"ДД.ММ.гг\")&\"!B4:t500\"),MATCH($B13:$B455&$C13:$C455,INDIRECT(TEXT($A$1-1,\"ДД.ММ.гг\")&\"!$B4:B500\")&INDIRECT(TEXT($A$1-1,\"ДД.ММ.гг\")&\"!$c4:C500\"),0),15)","v":{"$error":"#REF!"}},{"$f":"INDEX(INDIRECT(TEXT($A$1-1,\"ДД.ММ.гг\")&\"!B4:s500\"), MATCH($B13:$B455&$C13:$C455,INDIRECT(TEXT($A$1-1,\"ДД.ММ.гг\")&\"!$B4:B500\")&INDIRECT(TEXT($A$1-1,\"ДД.ММ.гг\")&\"!$c4:C500\"),0),MATCH(\"Всего\",INDIRECT(TEXT($A$1-1,\"ДД.ММ.гг\")&\"!B2:t2\"),0))","v":{"$error":"#REF!"}},1]
[{"$f":"ROW(A11)&\" \"&IFERROR(IF(VLOOKUP($B$4:$B81,[1]!Имя_Ж_Список,1,FALSE)=FALSE,\"\",\"\"),\"м\")&IFERROR(IF(VLOOKUP($B$4:$B81,[1]!Имя_М_Список,1,FALSE)=FALSE,\"\",\"\"),\"ж\")&IFERROR(IF(VLOOKUP($B$4:$B81,[1]Новенькие!$E$2:$E411,1,FALSE)=FALSE,\"\",\" н\"),\"\")","v":"11 ж"},"Надя","Болтунова","Стоянка",null,null,null,null,1,null,null,null,null,1,800,null,"",null,1,{"$f":"INDEX(INDIRECT(TEXT($A$1-1,\"ДД.ММ.гг\")&\"!B4:t500\"),MATCH($B14:$B456&$C14:$C456,INDIRECT(TEXT($A$1-1,\"ДД.ММ.гг\")&\"!$B4:B500\")&INDIRECT(TEXT($A$1-1,\"ДД.ММ.гг\")&\"!$c4:C500\"),0),17)&\"/\"&INDEX(INDIRECT(TEXT($A$1-1,\"ДД.ММ.гг\")&\"!B4:t500\"),MATCH($B14:$B456&$C14:$C456,INDIRECT(TEXT($A$1-1,\"ДД.ММ.гг\")&\"!$B4:B500\")&INDIRECT(TEXT($A$1-1,\"ДД.ММ.гг\")&\"!$c4:C500\"),0),15)","v":{"$error":"#REF!"}},{"$f":"INDEX(INDIRECT(TEXT($A$1-1,\"ДД.ММ.гг\")&\"!B4:s500\"), MATCH($B14:$B456&$C14:$C456,INDIRECT(TEXT($A$1-1,\"ДД.ММ.гг\")&\"!$B4:B500\")&INDIRECT(TEXT($A$1-1,\"ДД.ММ.гг\")&\"!$c4:C500\"),0),MATCH(\"Всего\",INDIRECT(TEXT($A$1-1,\"ДД.ММ.гг\")&\"!B2:t2\"),0))","v":{"$error":"#REF!"}}]
[{"$f":"ROW(A12)&\" \"&IFERROR(IF(VLOOKUP($B$4:$B82,[1]!Имя_Ж_Список,1,FALSE)=FALSE,\"\",\"\"),\"м\")&IFERROR(IF(VLOOKUP($B$4:$B82,[1]!Имя_М_Список,1,FALSE)=FALSE,\"\",\"\"),\"ж\")&IFERROR(IF(VLOOKUP($B$4:$B82,[1]Новенькие!$E$2:$E412,1,FALSE)=FALSE,\"\",\" н\"),\"\")","v":"12 м"},"Артём","Братский(Канд)","Стоянка",null,null,null,null,null,null,null,null,null,"",null,null,"",null,null,{"$f":"INDEX(INDIRECT(TEXT($A$1-1,\"ДД.ММ.гг\")&\"!B4:t500\"),MATCH($B15:$B458&$C15:$C458,INDIRECT(TEXT($A$1-1,\"ДД.ММ.гг\")&\"!$B4:B500\")&INDIRECT(TEXT($A$1-1,\"ДД.ММ.гг\")&\"!$c4:C500\"),0),17)&\"/\"&INDEX(INDIRECT(TEXT($A$1-1,\"ДД.ММ.гг\")&\"!B4:t500\"),MATCH($B15:$B458&$C15:$C458,INDIRECT(TEXT($A$1-1,\"ДД.ММ.гг\")&\"!$B4:B500\")&INDIRECT(TEXT($A$1-1,\"ДД.ММ.гг\")&\"!$c4:C500\"),0),15)","v":{"$error":"#REF!"}},{"$f":"INDEX(INDIRECT(TEXT($A$1-1,\"ДД.ММ.гг\")&\"!B4:s500\"), MATCH($B15:$B457&$C15:$C457,INDIRECT(TEXT($A$1-1,\"ДД.ММ.гг\")&\"!$B4:B500\")&INDIRECT(TEXT($A$1-1,\"ДД.ММ.гг\")&\"!$c4:C500\"),0),MATCH(\"Всего\",INDIRECT(TEXT($A$1-1,\"ДД.ММ.гг\")&\"!B2:t2\"),0))","v":{"$error":"#REF!"}}]
{"$rows_left_out":305}