{"text_format":"1","workbook":"xlsx","n_sheets":7,"sheets":["1-Й ОБРАЗЕЦ","мужчины","Остаток на складе","Размеры мужской одежды","Таблица размеров мужской обуви","ОБРАЗЕЦ","норма выдачи ССИЗ"],"not_rendered":{"charts":0,"images":1,"macros":1,"external_links":0,"defined_names":4,"comments":1,"pivot_tables":0},"unopened":[],"bounds":{"document_bytes":16777216,"sheet_cells":100000,"rows_first":2000,"rows_last":500,"rows_between":2000,"halvings":0,"cell_chars":16384,"cell_head_chars":4096},"cells_cut":0,"cells_raw":0,"read":"whole","date_system":"1900"}

{"sheet":"1-Й ОБРАЗЕЦ","index":0,"n_rows":60,"n_cols":16,"rows_kept":60,"cut":false,"hidden":false,"merged":[[41,2,41,7],[24,1,24,10],[1,3,1,5],[33,1,33,10],[21,14,22,19],[25,14,26,19],[27,14,28,19],[29,14,30,19]]}
[null,null,null,null,null,null,"РКУ",null,null,null,null,null,0]
[null,null,null,{"$f":"TODAY()","v":"2020-11-30"},null,null,"рост ",175,"одежда",54,"обувь",44]
[]
[null,"№ п/п","Наименование СИЗ","ТМЦ","цена","дата выдачи","срок носки, мес","дата списания","износ","стоимость","20%","Итого с НДС","Закупка",null,"Наименование","Количество"]
[null,1,"Футболка СПОРТ-К трикотажная оранжевого цвета",6100000219,490,"2020-04-16",6,{"$f":"F5+G5*30","v":"2020-10-13"},{"$f":"1-IF(ISBLANK($D$3),(TODAY()-Table13129130131133[[#This Row],[дата выдачи]])/(Table13129130131133[[#This Row],[дата списания]]-Table13129130131133[[#This Row],[дата выдачи]]),($D$3-Table13129130131133[[#This Row],[дата выдачи]])/(Table13129130131133[[#This Row],[дата списания]]-Table13129130131133[[#This Row],[дата выдачи]]))","v":-0.26666666666666661},{"$f":"Table13129130131133[[#This Row],[цена]]*Table13129130131133[[#This Row],[износ]]","v":-130.66666666666663},{"$f":"$J5*$K$27","v":-26.133333333333326},{"$f":"J5+K5","v":-156.79999999999995},{"$f":"IF(L5<0,\"1\",\"0\")","v":"1"}]
[null,2,"Очки с непрямой вентиляцией закрытые УЛЬТРАВИЖИН",6100000177,55,"2020-06-17",3,"2020-09-15",{"$f":"1-IF(ISBLANK($D$3),(TODAY()-Table13129130131133[[#This Row],[дата выдачи]])/(Table13129130131133[[#This Row],[дата списания]]-Table13129130131133[[#This Row],[дата выдачи]]),($D$3-Table13129130131133[[#This Row],[дата выдачи]])/(Table13129130131133[[#This Row],[дата списания]]-Table13129130131133[[#This Row],[дата выдачи]]))","v":-0.84444444444444455},{"$f":"Table13129130131133[[#This Row],[цена]]*Table13129130131133[[#This Row],[износ]]","v":-46.44444444444445},{"$f":"$J6*$K$27","v":-9.2888888888888896},{"$f":"J6+K6","v":-55.733333333333341},"1"]
[null,3,"Костюм мужской летний Инженер",6100000217,955,"2020-06-18",12,"2021-06-13",{"$f":"1-IF(ISBLANK($D$3),(TODAY()-Table13129130131133[[#This Row],[дата выдачи]])/(Table13129130131133[[#This Row],[дата списания]]-Table13129130131133[[#This Row],[дата выдачи]]),($D$3-Table13129130131133[[#This Row],[дата выдачи]])/(Table13129130131133[[#This Row],[дата списания]]-Table13129130131133[[#This Row],[дата выдачи]]))","v":0.54166666666666674},{"$f":"Table13129130131133[[#This Row],[цена]]*Table13129130131133[[#This Row],[износ]]","v":517.29166666666674},103.45833333333336,620.75000000000011,"0"]
[null,4,"Термостойкие перчатки 500C",6100000165,420,"2020-06-19",3,"2020-09-17",{"$f":"1-IF(ISBLANK($D$3),(TODAY()-Table13129130131133[[#This Row],[дата выдачи]])/(Table13129130131133[[#This Row],[дата списания]]-Table13129130131133[[#This Row],[дата выдачи]]),($D$3-Table13129130131133[[#This Row],[дата выдачи]])/(Table13129130131133[[#This Row],[дата списания]]-Table13129130131133[[#This Row],[дата выдачи]]))","v":-0.82222222222222219},{"$f":"Table13129130131133[[#This Row],[цена]]*Table13129130131133[[#This Row],[износ]]","v":-345.33333333333331},-69.066666666666663,-414.4,"1"]
{"$rows_left_out":53}
{"sheet":"мужчины","index":1,"n_rows":328,"n_cols":30,"rows_kept":328,"cut":false,"hidden":false,"merged":[[241,16,241,17],[242,16,242,17],[243,16,243,17],[250,16,250,17],[251,16,251,17],[252,16,252,17],[181,16,182,17],[181,18,182,18],[257,16,257,17],[239,16,239,17],[240,15,240,18],[249,16,249,17],[211,14,211,18],[212,14,212,18],[213,14,225,14],[213,15,213,18],[214,16,214,17],[215,16,215,17],[216,16,216,17],[217,16,217,17],[218,16,218,17],[219,16,219,17],[220,16,220,17],[221,16,221,17],[258,15,258,18],[259,14,271,14],[259,16,259,17],[260,16,260,17],[261,16,261,17],[262,16,262,17],[263,16,263,17],[264,16,264,17],[265,16,265,17],[266,16,266,17],[267,16,267,17],[268,16,268,17],[269,16,269,17],[270,16,270,17],[271,16,271,17],[241,14,256,14],[253,16,253,17],[254,16,254,17],[255,16,255,17],[256,16,256,17],[226,16,226,17],[227,15,227,18],[228,14,238,14],[228,16,228,17],[229,16,229,17],[230,16,230,17],[231,16,231,17],[232,16,232,17],[233,16,233,17],[234,16,234,17],[235,16,235,17],[236,16,236,17],[237,16,237,17],[238,16,238,17],[244,16,244,17],[245,16,245,17],[246,16,246,17],[247,16,247,17],[248,16,248,17],[222,16,222,17],[223,16,223,17],[224,16,224,17],[225,16,225,17],[0,0,0,1],[286,0,303,0],[305,0,324,0],[187,0,205,0],[208,0,223,0],[226,0,242,0],[245,0,262,0],[265,0,283,0],[49,16,49,17],[50,16,50,17],[52,16,52,17],[39,16,39,17],[51,15,51,18],[33,15,33,18],[34,14,49,14],[22,16,22,17],[23,16,23,17],[24,16,24,17],[25,16,25,17],[27,16,27,17],[325,1,325,10],[303,1,303,10],[1,0,14,0],[16,0,35,0],[37,0,57,0],[60,0,79,0],[206,1,206,10],[284,1,284,10],[224,1,224,10],[243,1,243,10],[263,1,263,10],[82,0,101,0],[104,0,122,0],[125,0,141,0],[144,0,162,0],[165,0,184,0],[4,21,4,28],[80,1,80,10],[102,1,102,10],[185,1,185,10],[123,1,123,10],[142,1,142,10],[163,1,163,10],[60,1,60,2],[14,1,14,10],[36,1,36,10],[58,1,58,10],[17,1,17,2],[17,16,17,17],[18,16,18,17],[19,16,19,17],[21,16,21,17],[20,15,20,18],[13,16,13,17],[14,16,14,17],[15,16,15,17],[16,16,16,17],[37,16,37,17],[21,14,31,14],[26,16,26,17],[28,16,28,17],[29,16,29,17],[30,16,30,17],[31,16,31,17],[32,16,32,17],[34,16,34,17],[35,16,35,17],[36,16,36,17],[40,16,40,17],[38,16,38,17],[41,16,41,17],[42,16,42,17],[43,16,43,17],[44,16,44,17],[45,16,45,17],[46,16,46,17],[47,16,47,17],[48,16,48,17],[52,14,64,14],[57,16,57,17],[58,16,58,17],[59,16,59,17],[60,16,60,17],[61,16,61,17],[62,16,62,17],[63,16,63,17],[64,16,64,17],[53,16,53,17],[54,16,54,17],[55,16,55,17],[56,16,56,17],[4,14,4,18],[5,14,5,18],[6,14,18,14],[6,15,6,18],[7,16,7,17],[8,16,8,17],[9,16,9,17],[10,16,10,17],[11,16,11,17],[12,16,12,17],[154,16,154,17],[155,16,155,17],[167,16,167,17],[168,16,168,17],[174,16,174,17],[175,15,175,18],[156,16,156,17],[157,15,157,18],[144,15,144,18],[145,16,145,17],[146,16,146,17],[147,16,147,17],[148,16,148,17],[141,16,141,17],[142,16,142,17],[143,16,143,17],[13,22,13,28],[149,16,149,17],[150,16,150,17],[151,16,151,17],[152,16,152,17],[153,16,153,17],[128,14,128,18],[129,14,129,18],[130,14,142,14],[130,15,130,18],[131,16,131,17],[132,16,132,17],[133,16,133,17],[134,16,134,17],[135,16,135,17],[136,16,136,17],[137,16,137,17],[138,16,138,17],[139,16,139,17],[140,16,140,17],[145,14,155,14],[176,14,189,14],[176,16,176,17],[177,16,177,17],[178,16,178,17],[179,16,179,17],[180,16,180,17],[183,16,183,17],[184,16,184,17],[185,16,185,17],[186,16,186,17],[187,16,187,17],[188,16,188,17],[189,16,189,17],[158,14,173,14],[158,16,158,17],[159,16,159,17],[160,16,160,17],[161,16,161,17],[162,16,162,17],[163,16,163,17],[164,16,164,17],[165,16,165,17],[166,16,166,17],[169,16,169,17],[170,16,170,17],[171,16,171,17],[172,16,172,17],[173,16,173,17]]}
[null,null,null,null,null,null,null,null,null,null,null,null,null,null,null,null,{"$f":"NOW()","v":"2020-11-30T22:28:22.360"}]
[1,"ФИО",null,null,null,null,"ДОЛЖНОСТЬ"]
[null,null,"дата увольнения",null,null,null,"рост ",176,"одежда","54(XL)","обувь",44]
[]
[null,"№ п/п","Наименование СИЗ","н/н","цена","дата выдачи","срок носки, мес","дата списания","износ","остаток на складе","20%","Итого с НДС","Закупка",null,"НОРМА ВЫДАЧИ СПЕЦОДЕЖДЫ,СПЕЦОБУВИ И ДРУГИХ СРЕДСТВ ИНДИВИДУАЛЬНОЙ ЗАЩИТЫ РАБОТНИКОВ СМЕНЫ",null,null,null,null,null,null,{"$f":"TODAY()","v":"2020-11-30"}]
[null,1,"Футболка СПОРТ-К трикотажная оранжевого цвета",6100000219,null,"2020-08-14",6,{"$f":"F6+G6*30.5","v":"2021-02-13"},{"$f":"1-IF(ISBLANK($D$3),(TODAY()-мужчины!$F6)/(мужчины!$H6-мужчины!$F6),($D$3-мужчины!$F6)/(мужчины!$H6-мужчины!$F6))","v":0.4098360655737705},{"$f":"IFERROR(INDEX('Остаток на складе'!$A$6:$E$120,MATCH(Akberov[[#This Row],[Наименование СИЗ]],'Остаток на складе'!$A$6:$A$120,0),5),\"НЕТ!\")","v":206},{"$f":"$J6*Akberov[[#Headers],[20%]]","v":41.2},{"$f":"J6+K6","v":247.2},{"$f":"IF(L6<0,\"1\",\"0\")","v":"0"},null,"ПЕРЕЧЕНЬ",null,null,null,null,null,null,"Неделя","Пн","Вт","Ср","Чт","Пт","Сб","Вс"]
[null,2,"Очки с непрямой вентиляцией закрытые УЛЬТРАВИЖИН",6100000177,null,"2020-08-14",3,{"$f":"F7+G7*30.5","v":"2020-11-13T12:00:00"},{"$f":"1-IF(ISBLANK($D$3),(TODAY()-мужчины!$F7)/(мужчины!$H7-мужчины!$F7),($D$3-мужчины!$F7)/(мужчины!$H7-мужчины!$F7))","v":-0.18032786885245899},{"$f":"IFERROR(INDEX('Остаток на складе'!$A$6:$E$120,MATCH(Akberov[[#This Row],[Наименование СИЗ]],'Остаток на складе'!$A$6:$A$120,0),5),\"НЕТ!\")","v":35},{"$f":"$J7*Akberov[[#Headers],[20%]]","v":7},{"$f":"J7+K7","v":42},{"$f":"IF(L7<0,\"1\",\"0\")","v":"0"},null,1,"НАЧАЛЬНИК СМЕНЫ",null,null,null,null,null,{"$f":"INT((V5-WEEKDAY(V5,2)-DATE(YEAR(V5+4-WEEKDAY(V5,2)),1,4))/7)+2","v":49},{"$f":"IF(MONTH(DATE(YEAR($V$5),MONTH($V$5),1)) <>MONTH(DATE(YEAR($V$5),MONTH($V$5),1)- (WEEKDAY(DATE(YEAR($V$5),MONTH($V$5),1),2)-1) +{0;1;2;3;4;5}*7+{1,2,3,4,5,6,7}-1),\" \", DATE(YEAR($V$5),MONTH($V$5),1)- (WEEKDAY(DATE(YEAR($V$5),MONTH($V$5),1),2)-1) +{0;1;2;3;4;5}*7+{1,2,3,4,5,6,7}-1)","v":" "},{"$f":"IF(MONTH(DATE(YEAR($V$5),MONTH($V$5),1)) <>MONTH(DATE(YEAR($V$5),MONTH($V$5),1)- (WEEKDAY(DATE(YEAR($V$5),MONTH($V$5),1),2)-1) +{0;1;2;3;4;5}*7+{1,2,3,4,5,6,7}-1),\" \", DATE(YEAR($V$5),MONTH($V$5),1)- (WEEKDAY(DATE(YEAR($V$5),MONTH($V$5),1),2)-1) +{0;1;2;3;4;5}*7+{1,2,3,4,5,6,7}-1)","v":" "},{"$f":"IF(MONTH(DATE(YEAR($V$5),MONTH($V$5),1)) <>MONTH(DATE(YEAR($V$5),MONTH($V$5),1)- (WEEKDAY(DATE(YEAR($V$5),MONTH($V$5),1),2)-1) +{0;1;2;3;4;5}*7+{1,2,3,4,5,6,7}-1),\" \", DATE(YEAR($V$5),MONTH($V$5),1)- (WEEKDAY(DATE(YEAR($V$5),MONTH($V$5),1),2)-1) +{0;1;2;3;4;5}*7+{1,2,3,4,5,6,7}-1)","v":" "},{"$f":"IF(MONTH(DATE(YEAR($V$5),MONTH($V$5),1)) <>MONTH(DATE(YEAR($V$5),MONTH($V$5),1)- (WEEKDAY(DATE(YEAR($V$5),MONTH($V$5),1),2)-1) +{0;1;2;3;4;5}*7+{1,2,3,4,5,6,7}-1),\" \", DATE(YEAR($V$5),MONTH($V$5),1)- (WEEKDAY(DATE(YEAR($V$5),MONTH($V$5),1),2)-1) +{0;1;2;3;4;5}*7+{1,2,3,4,5,6,7}-1)","v":" "},{"$f":"IF(MONTH(DATE(YEAR($V$5),MONTH($V$5),1)) <>MONTH(DATE(YEAR($V$5),MONTH($V$5),1)- (WEEKDAY(DATE(YEAR($V$5),MONTH($V$5),1),2)-1) +{0;1;2;3;4;5}*7+{1,2,3,4,5,6,7}-1),\" \", DATE(YEAR($V$5),MONTH($V$5),1)- (WEEKDAY(DATE(YEAR($V$5),MONTH($V$5),1),2)-1) +{0;1;2;3;4;5}*7+{1,2,3,4,5,6,7}-1)","v":" "},{"$f":"IF(MONTH(DATE(YEAR($V$5),MONTH($V$5),1)) <>MONTH(DATE(YEAR($V$5),MONTH($V$5),1)- (WEEKDAY(DATE(YEAR($V$5),MONTH($V$5),1),2)-1) +{0;1;2;3;4;5}*7+{1,2,3,4,5,6,7}-1),\" \", DATE(YEAR($V$5),MONTH($V$5),1)- (WEEKDAY(DATE(YEAR($V$5),MONTH($V$5),1),2)-1) +{0;1;2;3;4;5}*7+{1,2,3,4,5,6,7}-1)","v":" "},{"$f":"IF(MONTH(DATE(YEAR($V$5),MONTH($V$5),1)) <>MONTH(DATE(YEAR($V$5),MONTH($V$5),1)- (WEEKDAY(DATE(YEAR($V$5),MONTH($V$5),1),2)-1) +{0;1;2;3;4;5}*7+{1,2,3,4,5,6,7}-1),\" \", DATE(YEAR($V$5),MONTH($V$5),1)- (WEEKDAY(DATE(YEAR($V$5),MONTH($V$5),1),2)-1) +{0;1;2;3;4;5}*7+{1,2,3,4,5,6,7}-1)","v":" "}]
[null,3,"Костюм мужской летний Инженер",6100000217,null,"2020-02-12",12,"2021-02-12",{"$f":"1-IF(ISBLANK($D$3),(TODAY()-мужчины!$F8)/(мужчины!$H8-мужчины!$F8),($D$3-мужчины!$F8)/(мужчины!$H8-мужчины!$F8))","v":0.20218579234972678},{"$f":"IFERROR(INDEX('Остаток на складе'!$A$6:$E$120,MATCH(Akberov[[#This Row],[Наименование СИЗ]],'Остаток на складе'!$A$6:$A$120,0),5),\"НЕТ!\")","v":107},{"$f":"$J8*Akberov[[#Headers],[20%]]","v":21.400000000000002},128.4,"0",null,null,"1.1","КАСКА ЗАЩИТНАЯ,СИНЯЯ",null,"ДО ИЗНОСА",null,null,{"$f":"INT((V5+7-WEEKDAY(V5+7,2)-DATE(YEAR(V5+4+7-WEEKDAY(V5+7,2)),1,4))/7)+2","v":50},{"$f":"IF(MONTH(DATE(YEAR($V$5),MONTH($V$5),1)) <>MONTH(DATE(YEAR($V$5),MONTH($V$5),1)- (WEEKDAY(DATE(YEAR($V$5),MONTH($V$5),1),2)-1) +{0;1;2;3;4;5}*7+{1,2,3,4,5,6,7}-1),\" \", DATE(YEAR($V$5),MONTH($V$5),1)- (WEEKDAY(DATE(YEAR($V$5),MONTH($V$5),1),2)-1) +{0;1;2;3;4;5}*7+{1,2,3,4,5,6,7}-1)","v":" "},{"$f":"IF(MONTH(DATE(YEAR($V$5),MONTH($V$5),1)) <>MONTH(DATE(YEAR($V$5),MONTH($V$5),1)- (WEEKDAY(DATE(YEAR($V$5),MONTH($V$5),1),2)-1) +{0;1;2;3;4;5}*7+{1,2,3,4,5,6,7}-1),\" \", DATE(YEAR($V$5),MONTH($V$5),1)- (WEEKDAY(DATE(YEAR($V$5),MONTH($V$5),1),2)-1) +{0;1;2;3;4;5}*7+{1,2,3,4,5,6,7}-1)","v":" "},{"$f":"IF(MONTH(DATE(YEAR($V$5),MONTH($V$5),1)) <>MONTH(DATE(YEAR($V$5),MONTH($V$5),1)- (WEEKDAY(DATE(YEAR($V$5),MONTH($V$5),1),2)-1) +{0;1;2;3;4;5}*7+{1,2,3,4,5,6,7}-1),\" \", DATE(YEAR($V$5),MONTH($V$5),1)- (WEEKDAY(DATE(YEAR($V$5),MONTH($V$5),1),2)-1) +{0;1;2;3;4;5}*7+{1,2,3,4,5,6,7}-1)","v":" "},{"$f":"IF(MONTH(DATE(YEAR($V$5),MONTH($V$5),1)) <>MONTH(DATE(YEAR($V$5),MONTH($V$5),1)- (WEEKDAY(DATE(YEAR($V$5),MONTH($V$5),1),2)-1) +{0;1;2;3;4;5}*7+{1,2,3,4,5,6,7}-1),\" \", DATE(YEAR($V$5),MONTH($V$5),1)- (WEEKDAY(DATE(YEAR($V$5),MONTH($V$5),1),2)-1) +{0;1;2;3;4;5}*7+{1,2,3,4,5,6,7}-1)","v":" "},{"$f":"IF(MONTH(DATE(YEAR($V$5),MONTH($V$5),1)) <>MONTH(DATE(YEAR($V$5),MONTH($V$5),1)- (WEEKDAY(DATE(YEAR($V$5),MONTH($V$5),1),2)-1) +{0;1;2;3;4;5}*7+{1,2,3,4,5,6,7}-1),\" \", DATE(YEAR($V$5),MONTH($V$5),1)- (WEEKDAY(DATE(YEAR($V$5),MONTH($V$5),1),2)-1) +{0;1;2;3;4;5}*7+{1,2,3,4,5,6,7}-1)","v":" "},{"$f":"IF(MONTH(DATE(YEAR($V$5),MONTH($V$5),1)) <>MONTH(DATE(YEAR($V$5),MONTH($V$5),1)- (WEEKDAY(DATE(YEAR($V$5),MONTH($V$5),1),2)-1) +{0;1;2;3;4;5}*7+{1,2,3,4,5,6,7}-1),\" \", DATE(YEAR($V$5),MONTH($V$5),1)- (WEEKDAY(DATE(YEAR($V$5),MONTH($V$5),1),2)-1) +{0;1;2;3;4;5}*7+{1,2,3,4,5,6,7}-1)","v":" "},{"$f":"IF(MONTH(DATE(YEAR($V$5),MONTH($V$5),1)) <>MONTH(DATE(YEAR($V$5),MONTH($V$5),1)- (WEEKDAY(DATE(YEAR($V$5),MONTH($V$5),1),2)-1) +{0;1;2;3;4;5}*7+{1,2,3,4,5,6,7}-1),\" \", DATE(YEAR($V$5),MONTH($V$5),1)- (WEEKDAY(DATE(YEAR($V$5),MONTH($V$5),1),2)-1) +{0;1;2;3;4;5}*7+{1,2,3,4,5,6,7}-1)","v":" "}]
{"$rows_left_out":321}
{"sheet":"Остаток на складе","index":2,"n_rows":131,"n_cols":13,"rows_kept":131,"cut":false,"hidden":false,"merged":[[1,9,2,9],[1,10,2,10],[1,11,2,11],[1,12,2,12],[0,1,1,1],[0,2,1,2],[0,3,1,3],[0,4,1,4],[1,8,2,8]]}
["Склад","Количество Начальный остаток","Количество Приход","Количество Расход","Количество Конечный остаток",{"$f":"TODAY()","v":"2020-11-30"}]
["Номенклатура",null,null,null,null,null,null,null,"Количество Начальный остаток","Количество Начальный остаток","Количество Приход","Количество Расход","Количество Конечный остаток"]
["Склад средств индивидуальной защиты",27563,6230,6129,{"$f":"(B3+C3)-D3","v":27664},{"$f":"IF(G3,1,E3>2)","v":true}]
[{"$f":"I4","v":"Gladding Trousers (GT10/WSH) Теплозащитные брюки"},{"$f":"IF(EXACT(A4,I4),J4)","v":0},{"$f":"K4","v":0},{"$f":"L4","v":0},{"$f":"(B4+C4)-D4","v":0},{"$f":"IF(G4,1,E4>2)","v":false},null,1,"Gladding Trousers (GT10/WSH) Теплозащитные брюки",null,null,null,2]
[{"$f":"I5","v":"Reinforced Gladding Jacket (GJK/85) Куртка теплозащитная"},{"$f":"IF(EXACT(A5,I5),J5)","v":3},{"$f":"K5","v":0},0,3,true,null,2,"Reinforced Gladding Jacket (GJK/85) Куртка теплозащитная",3,null,null,3]
["Бируши одноразовые HOWARD LEIGHT ЛАЗЕР ЛАЙТ",12162,0,0,12162,true,null,3,"Бируши одноразовые HOWARD LEIGHT ЛАЗЕР ЛАЙТ",12162,null,null,"12 162,000"]
["Бланки удостоверений о проверке знаний требований охраны труда",315,0,0,315,true,null,4,"Бланки удостоверений о проверке знаний требований охраны труда",315,null,null,315]
["Ботинки высокие ОМОН",{"$f":"IF(EXACT(A8,I8),J8)","v":1},0,0,1,false,null,5,"Ботинки высокие ОМОН",1,null,null,1]
{"$rows_left_out":124}
{"sheet":"Размеры мужской одежды","index":3,"n_rows":17,"n_cols":24,"rows_kept":17,"cut":false,"hidden":false,"merged":[[1,2,2,2],[0,3,0,6]]}
[null,null,null,"Размеры мужской одежды"]
[null,"Российский","Международный","Обхват","Обхват","Обхват","Длина","Англия","США","Европа","Италия"]
[null,"размер",null,"груди (см)","талии (см)","бедер (см)","рукава (см)","(UK)","(US)","(EU)","(IT)"]
[null,44,"XXS",88,70,92,59,32,34,38,42]
[null,46,"XS",92,76,96,60,34,36,40,44]
[null,48,"S",96,82,100,61,36,38,42,46]
[null,50,"M",100,88,104,62,38,40,44,48]
[null,52,"L",104,94,108,63,40,42,46,50]
{"$rows_left_out":10}
{"sheet":"Таблица размеров мужской обуви","index":4,"n_rows":15,"n_cols":6,"rows_kept":15,"cut":false,"hidden":false,"merged":[[0,0,0,5]]}
["Таблица размеров мужской обуви"]
["Россия","Европа","США","Англия","Япония","CM"]
[38,39,6,5.5,25,25]
[39,40,7,6.5,25.5,25.5]
[40,41,8,7,26.5,26.5]
[41,42,9,8,27,27]
[42,43,10,9,27.5,27.5]
[43,44,11,9.5,28.5,28.5]
{"$rows_left_out":8}
{"sheet":"ОБРАЗЕЦ","index":5,"n_rows":37,"n_cols":19,"rows_kept":37,"cut":false,"hidden":false,"merged":[[36,1,36,11]]}
[{"$f":"NOW()","v":"2020-11-30T22:28:22.360"},null,"=1-ЕСЛИ(ЕПУСТО($D$3);(СЕГОДНЯ()-мужчины!$F6)/(мужчины!$H6-мужчины!$F6);($D$3-мужчины!$F6)/(мужчины!$H6-мужчины!$F6))"]
[]
[null,null,null,null,null,null,null,null,null,null,null,"$J6*мужчины!$K$20"]
[]
[null,"№ п/п","Наименование СИЗ","н/н","цена","дата выдачи","срок носки, мес","дата списания","износ","ОСТАТОК НА СКЛАДЕ","Стоимость","20%","Итого с НДС","Закупка",null,null,null,null,{"$error":"#N/A"}]
[null,{"$f":"IF(ISBLANK(C6),\"\",COUNTA($C$6:C6))","v":1},"Бируши одноразовые HOWARD LEIGHT ЛАЗЕР ЛАЙТ",null,249,"2020-02-06",12,{"$f":"F6+G6*30","v":"2021-01-31"},{"$f":"1-IF(ISBLANK($D$4),(TODAY()-Mukhayev18[[#This Row],[дата выдачи]])/(Mukhayev18[[#This Row],[дата списания]]-Mukhayev18[[#This Row],[дата выдачи]]),($D$4-Mukhayev18[[#This Row],[дата выдачи]])/(Mukhayev18[[#This Row],[дата списания]]-Mukhayev18[[#This Row],[дата выдачи]]))","v":0.17222222222222228},{"$f":"INDEX('Остаток на складе'!$A$6:$E$114,MATCH(Mukhayev18[[#This Row],[Наименование СИЗ]],'Остаток на складе'!$A$6:$A$114,0),5)","v":12162},{"$f":"Mukhayev18[[#This Row],[цена]]*Mukhayev18[[#This Row],[износ]]","v":42.883333333333347},{"$f":"$J6*Table13129130131133[[#Headers],[20%]]","v":2432.4},{"$f":"J6+L6","v":14594.4},{"$f":"IF(M6<0,\"1\",\"0\")","v":"0"}]
[null,{"$f":"IF(ISBLANK(C7),\"\",COUNTA($C$6:C7))","v":2},"Костюм мужской летний Инженер",null,250,"2020-02-07",3,{"$f":"F7+G7*30","v":"2020-05-07"},{"$f":"1-IF(ISBLANK($D$4),(TODAY()-Mukhayev18[[#This Row],[дата выдачи]])/(Mukhayev18[[#This Row],[дата списания]]-Mukhayev18[[#This Row],[дата выдачи]]),($D$4-Mukhayev18[[#This Row],[дата выдачи]])/(Mukhayev18[[#This Row],[дата списания]]-Mukhayev18[[#This Row],[дата выдачи]]))","v":-2.2999999999999998},{"$f":"INDEX('Остаток на складе'!$A$6:$E$114,MATCH(Mukhayev18[[#This Row],[Наименование СИЗ]],'Остаток на складе'!$A$6:$A$114,0),5)","v":107},{"$f":"Mukhayev18[[#This Row],[цена]]*Mukhayev18[[#This Row],[износ]]","v":-575},{"$f":"$J7*Table13129130131133[[#Headers],[20%]]","v":21.400000000000002},{"$f":"J7+L7","v":128.4},{"$f":"IF(M7<0,\"1\",\"0\")","v":"0"}]
[null,{"$f":"IF(ISBLANK(C8),\"\",COUNTA($C$6:C8))","v":3},"Куртка утеплённая CERVA Аллин",null,250,"2020-02-08",12,"2021-02-02",{"$f":"1-IF(ISBLANK($D$4),(TODAY()-Mukhayev18[[#This Row],[дата выдачи]])/(Mukhayev18[[#This Row],[дата списания]]-Mukhayev18[[#This Row],[дата выдачи]]),($D$4-Mukhayev18[[#This Row],[дата выдачи]])/(Mukhayev18[[#This Row],[дата списания]]-Mukhayev18[[#This Row],[дата выдачи]]))","v":0.17777777777777781},{"$f":"INDEX('Остаток на складе'!$A$6:$E$114,MATCH(Mukhayev18[[#This Row],[Наименование СИЗ]],'Остаток на складе'!$A$6:$A$114,0),5)","v":38},{"$f":"Mukhayev18[[#This Row],[цена]]*Mukhayev18[[#This Row],[износ]]","v":44.44444444444445},{"$f":"$J8*Table13129130131133[[#Headers],[20%]]","v":7.6000000000000005},45.6,"0"]
{"$rows_left_out":30}
{"sheet":"норма выдачи ССИЗ","index":6,"n_rows":61,"n_cols":5,"rows_kept":61,"cut":false,"hidden":false,"merged":[[11,2,11,3],[0,0,0,4],[1,0,1,4],[2,1,2,4],[3,2,3,3],[4,2,4,3],[2,0,14,0],[5,2,5,3],[6,2,6,3],[7,2,7,3],[8,2,8,3],[9,2,9,3],[10,2,10,3],[22,2,22,3],[12,2,12,3],[13,2,13,3],[14,2,14,3],[15,2,15,3],[16,1,16,4],[38,2,38,3],[30,2,30,3],[31,2,31,3],[32,2,32,3],[33,2,33,3],[34,2,34,3],[17,0,27,0],[35,2,35,3],[29,1,29,4],[36,2,36,3],[37,2,37,3],[23,2,23,3],[24,2,24,3],[25,2,25,3],[26,2,26,3],[27,2,27,3],[28,2,28,3],[17,2,17,3],[18,2,18,3],[19,2,19,3],[20,2,20,3],[21,2,21,3],[47,1,47,4],[30,0,45,0],[52,2,52,3],[53,2,53,3],[54,2,54,3],[45,2,45,3],[46,2,46,3],[48,2,48,3],[49,2,49,3],[50,2,50,3],[39,2,39,3],[40,2,40,3],[41,2,41,3],[42,2,42,3],[43,2,43,3],[44,2,44,3],[61,2,61,3],[62,2,62,3],[48,0,60,0],[55,2,55,3],[56,2,56,3],[57,2,57,3],[58,2,58,3],[59,2,59,3],[60,2,60,3],[51,2,51,3]]}
["НОРМА ВЫДАЧИ СПЕЦОДЕЖДЫ,СПЕЦОБУВИ И ДРУГИХ СРЕДСТВ ИНДИВИДУАЛЬНОЙ ЗАЩИТЫ РАБОТНИКОВ СМЕНЫ"]
["ПЕРЕЧЕНЬ"]
[1,"НАЧАЛЬНИК СМЕНЫ"]
[null,"1.1","КАСКА ЗАЩИТНАЯ,СИНЯЯ",null,"ДО ИЗНОСА"]
[null,"1.2","ОЧКИ ЗАЩИТНЫЕ ОТКРЫТЫЕ",null,"ДО ИЗНОСА"]
[null,"1.3","ОЧКИ ЗАЩИТНЫЕ С НЕПРЯМОЙ ВЕНТИЛЯЦИЕЙ ЗАКРЫТОГО ТИПА",null,"ДО ИЗНОСА"]
[null,"1.4","ОЧКИ ЗАТЕМНЕННЫЕ",null,"ДО ИЗНОСА"]
[null,"1.5","КОСТЮМ ЗАЩИТНЫЙ ЛЕТНИЙ",null,"1 КОМП. НА ГОД"]
{"$rows_left_out":53}