{"text_format":"1","workbook":"xlsx","n_sheets":4,"sheets":["ФинЧасть","Письмо","Данные","Формулы"],"not_rendered":{"charts":0,"images":0,"macros":1,"external_links":0,"defined_names":2,"comments":0,"pivot_tables":0},"unopened":[],"bounds":{"document_bytes":16777216,"sheet_cells":100000,"rows_first":2000,"rows_last":500,"rows_between":2000,"halvings":0,"cell_chars":16384,"cell_head_chars":4096},"cells_cut":0,"cells_raw":0,"read":"whole","date_system":"1900"}

{"sheet":"ФинЧасть","index":0,"n_rows":11,"n_cols":7,"rows_kept":11,"cut":false,"hidden":true,"merged":[[0,0,0,3],[1,0,1,3],[2,0,2,3],[3,0,3,3],[4,0,4,3],[5,0,5,3],[6,0,6,3],[7,0,7,3],[8,0,8,3],[9,0,9,3],[10,0,10,3]]}
["Командировка продавца-кассира с 04.06 по 19.06 Елена Бузмакова 8-900-375-86-64 (Ср 30000) ЕКБ Белинского В ФОТ для бюджета на выезд (Ср.ЗП)*1,5 =45000+ндфл 2243 (за месячную норму часов+переработки)"]
["Командировка ЗУМ с 04.06 по 19.06 Ксения Распопина 8-922-210-34-46 (Ср 39000) ЕКБ Белинского В ФОТ для бюджета на выезд (Ср.ЗП)*1,5 =58500+ндфл 2550 (за месячную норму часов+переработки)"]
["Командировка продавца с ... по ... Крокодилов Сергей Иванович 8-900-041-65-94(Ср 29100), ЕКБ Гранат, В ФОТ для бюджета на выезд (Ср.ЗП)*1,5=43650+ндфл 2243 руб (за месячную норму часов+переработки)"]
["Командировка Ст. кладовщик с 27.05 по 17.06 Фазилов Илья Ибрагимович 8-963-446-15-63(Ср 31500), ЕКБ Грибоедова, В ФОТ для бюджета на выезд (Ср.ЗП)*1,5=47250+ндфл 2691 руб (за месячную норму часов+переработки)"]
["Командировка кладовщик с ... по ... Грачев Игорь Михайлович 8-977-287-21-88(Ср 34900), МСК Мытищи Селезнева, В ФОТ для бюджета на выезд (Ср.ЗП)*1,5=52350+ндфл 1950 руб (за месячную норму часов+переработки)"]
["Командировка ЗУМ с 27.05 по 17.06 Давыдова Наталья Игоревна 8-901-71-51-499(Ср 48500) МСК Одинцово В ФОТ для бюджета на выезд Ср.ЗП*1,5 =72750+ндфл 2845 руб(за месячную норму часов+переработки) "]
["Командировка Ст. кассира с 08.06 по 17.06 Бондаренко Александра Леонидовна 8-982-649-60-66(Ср 32000) ЕКБ Гранат В ФОТ для бюджета на выезд Ср.ЗП*1,5 =24000+ндфл 2550(за 88 часов)",null,null,null,null,88,{"$f":"32000*F7/176*1.5","v":24000}]
["Командировка Ст. кассира с 25.08 по 08.09 Шелковникова Татьяна Павловна 8-919-766-50-10(Ср 42530) МСК Раменское Михалевича В ФОТ для бюджета на выезд Ср.ЗП*1,5 = 55821 + ндфл 2600(за 154 час)",null,null,null,14,{"$f":"E8*11","v":154},{"$f":"42530*F8/176*1.5","v":55820.625}]
["Командировка Ст. кассира с 04.06 по 17.06 Татьяна Храмова 8-982-611-41-75 (Ср 32000) ЕКБ Белинского В ФОТ для бюджета на выезд (Ср.ЗП)*1,5 =18000+ндфл 2550(за 66 часов)",null,null,null,null,66,{"$f":"32000*F9/176*1.5","v":18000}]
["Командировка ЗУМ с 04.06 по 19.06 Ильиных Евгений 8-982-638-62-01 (Ср 39000 ) ЕКБ Мегаполис В ФОТ для бюджета на выезд (Ср.ЗП)*1,5 =58500+ндфл 2550  (за месячную норму часов+переработки)"]
["Командировка ЗУМ с 04.06 по 19.06 Никита Ячменников 8-908-919-25-31 (Ср 39000) ЕКБ Бабушкина В ФОТ для бюджета на выезд (Ср.ЗП)*1,5 =58500+ндфл 2550 (за месячную норму часов+переработки)"]

{"sheet":"Письмо","index":1,"n_rows":4,"n_cols":3,"rows_kept":4,"cut":false,"hidden":false,"merged":[]}
[]
[]
["ТЕКСТ",{"$f":"Формулы!A30","v":"Уважаемые Управляющие, довожу до вашего сведения о предстоящей командировке ваших сотрудников:\n\n\nПетров Петр с 15.01 по 08.02       direktor-179 \nИванов Иван с 0 по 0       direktor-180 \nСидоров Сидр с 0 по 0       direktor-181 \nВасилий Алибабаевич с 0 по 0       direktor-182 \nДоцент с 0 по 0       direktor-183 \nКотов Кот с 0 по 0       direktor-184 \nСмиронов Смирн с 0 по 0       direktor-185 \nВАКАНТ с 0 по 0       direktor-186 \nВАКАНТ с 0 по 0       direktor-187 \nВика с 0 по 0       direktor-188 \nСветлогор с 0 по 0       direktor-189 \nВАКАНТ с 0 по 0       direktor-190 \nГрачев Грач с 15.01 по 08.02       direktor-191 \nКарпов Карп с 0 по 0       direktor-192 \nВАКАНТ с 0 по 0       direktor-193 \nВАКАНТ с 0 по 0       direktor-194 \nВАКАНТ с 15.01 по 08.02       direktor-195 \nМитя с 0 по 0       direktor-196 \nНастя с 0 по 0       direktor-197 \nКоля с 0 по 0       direktor-198 \nИгорь с 0 по 0       direktor-199 \nВикор с 0 по 0       direktor-200 \nДима с 0 по 0       direktor-201 \nСаша с 0 по 0       direktor-202 \n\nДаты указаны без учета затраченного времени на дорогу к месту командировки и возвращения из нее: только даты приезда на проект и отъезда с него. Точную дату выезда в командировку и дату возвращения из нее Ваш сотрудник предоставит после покупки билетов.\nНеобходимо учесть данный интервал дат при составлении табеля рабочего времени в Вашем магазине: один день до и два дня после обязательные выходные!\n\nПрошу подтвердить получение данного письма."},{"$f":"_xlfn.TEXTJOIN(\" \",1,IFERROR(INDEX(Данные!$B$2:$M$25,(IF(Данные!$G$2:$G$25<>\"\",ROW(Данные!$G$2:$G$25)-1,\"\")),{1,7,6,5,12}),\"\"))","v":"Петров Петр 08.02 15.01 direktor-179 \n Грачев Грач 08.02 15.01 direktor-191 \n ВАКАНТ 08.02 15.01 direktor-195 \n"}]
[null," "]

{"sheet":"Данные","index":2,"n_rows":28,"n_cols":13,"rows_kept":28,"cut":false,"hidden":false,"merged":[]}
["№","ФИО","Должность","Телефон","Город","email","Начало\n","Конец\n","ЗП","Коэф","Команд.\nЗП","НДФЛ"]
[{"$f":"ROW(2:2)-1","v":1},"Петров Петр","ЗУМ","8-888-111","Саратов","direktor-179","15.01","08.02",33,1.5,{"$f":"I2*J2","v":49.5},2,{"$f":"CHAR(10)","v":"\n"}]
[{"$f":"ROW(3:3)-1","v":2},"Иванов Иван","ЗУМ","8-888-112","Самара","direktor-180",null,null,42,1.5,{"$f":"I3*J3","v":63},28,{"$f":"CHAR(10)","v":"\n"}]
[{"$f":"ROW(4:4)-1","v":3},"Сидоров Сидр","ПК","8-888-113","Самара","direktor-181",null,null,22,1.5,{"$f":"I4*J4","v":33},3,{"$f":"CHAR(10)","v":"\n"}]
[{"$f":"ROW(5:5)-1","v":4},"Василий Алибабаевич","ЗУМ","8-888-114","Пушкин","direktor-182",null,null,32,1.5,{"$f":"I5*J5","v":48},3,{"$f":"CHAR(10)","v":"\n"}]
[{"$f":"ROW(6:6)-1","v":5},"Доцент","БОСС","8-888-115","Пушкино","direktor-183",null,null,322,1.5,{"$f":"I6*J6","v":483},22,{"$f":"CHAR(10)","v":"\n"}]
[{"$f":"ROW(7:7)-1","v":6},"Котов Кот","ЗУМ","8-888-116","Екатеринбург","direktor-184",null,null,45,1.5,{"$f":"I7*J7","v":67.5},27,{"$f":"CHAR(10)","v":"\n"}]
[{"$f":"ROW(8:8)-1","v":7},"Смиронов Смирн","ПК","8-888-117","Челябинск","direktor-185",null,null,30,1.5,{"$f":"I8*J8","v":45},15,{"$f":"CHAR(10)","v":"\n"}]
[{"$f":"ROW(9:9)-1","v":8},"ВАКАНТ",null,"8-888-118",null,"direktor-186",null,null,null,null,null,null,{"$f":"CHAR(10)","v":"\n"}]
[{"$f":"ROW(10:10)-1","v":9},"ВАКАНТ",null,"8-888-119",null,"direktor-187",null,null,null,null,null,null,{"$f":"CHAR(10)","v":"\n"}]
[{"$f":"ROW(11:11)-1","v":10},"Вика","ПК","8-888-120","Новосибирск","direktor-188",null,null,43,1.5,{"$f":"I11*J11","v":64.5},21,{"$f":"CHAR(10)","v":"\n"}]
[{"$f":"ROW(12:12)-1","v":11},"Светлогор","ЗУМ","8-888-121","Новокузнецк","direktor-189",null,null,55,1.5,{"$f":"I12*J12","v":82.5},2,{"$f":"CHAR(10)","v":"\n"}]
[{"$f":"ROW(13:13)-1","v":12},"ВАКАНТ",null,"8-888-122",null,"direktor-190",null,null,null,null,null,null,{"$f":"CHAR(10)","v":"\n"}]
[{"$f":"ROW(14:14)-1","v":13},"Грачев Грач","Кладовщик","8-888-123","Москва","direktor-191","15.01","08.02",46,1.5,{"$f":"I14*J14","v":69},2,{"$f":"CHAR(10)","v":"\n"}]
[{"$f":"ROW(15:15)-1","v":14},"Карпов Карп",null,"8-888-124",null,"direktor-192",null,null,26,1.5,{"$f":"I15*J15","v":39},2,{"$f":"CHAR(10)","v":"\n"}]
[{"$f":"ROW(16:16)-1","v":15},"ВАКАНТ",null,"8-888-125",null,"direktor-193",null,null,null,null,null,null,{"$f":"CHAR(10)","v":"\n"}]
[{"$f":"ROW(17:17)-1","v":16},"ВАКАНТ",null,"8-888-126",null,"direktor-194",null,null,null,null,null,null,{"$f":"CHAR(10)","v":"\n"}]
[{"$f":"ROW(18:18)-1","v":17},"ВАКАНТ",null,"8-888-127",null,"direktor-195","15.01","08.02",null,null,null,null,{"$f":"CHAR(10)","v":"\n"}]
[{"$f":"ROW(19:19)-1","v":18},"Митя","Ст. кладовщик","8-888-128","С.-Петербург","direktor-196",null,null,40,1.5,{"$f":"I19*J19","v":60},2,{"$f":"CHAR(10)","v":"\n"}]
[{"$f":"ROW(20:20)-1","v":19},"Настя","Ст. кладовщик","8-888-129","Екатеринбург","direktor-197",null,null,41,1.5,{"$f":"I20*J20","v":61.5},22,{"$f":"CHAR(10)","v":"\n"}]
{"$rows_left_out":9}
{"sheet":"Формулы","index":3,"n_rows":56,"n_cols":24,"rows_kept":56,"cut":false,"hidden":false,"merged":[[29,0,55,0]]}
[]
[{"$f":"CONCATENATE(B2,\" \",C2,\" \",D2,\" \",E2,\" \",F2,\" \",F30,\" \",G2,H2,\", \",I2,\", \",J2,\" \",K2,L2,\" \",M2,\" \",N2,O2,\" \",P2,\" \",Q2,\" \",R2,\" \",S2,\" \",T2,\" \",U2)","v":"Командировка ЗУМ с 15.01 по  08.02, Петров Петр, 8-888-111 (ср.33 ), Саратов, в ФОТ для бюджета на выезд (Ср.ЗП)*1,5 = 49,5 + ндфл 2 руб  (за месячную норму часов+переработки)"},"Командировка",{"$f":"Данные!C2","v":"ЗУМ"},"с",{"$f":"Данные!G2","v":"15.01"},"по",{"$f":"Данные!H2","v":"08.02"},null,{"$f":"Данные!B2","v":"Петров Петр"},{"$f":"Данные!D2","v":"8-888-111"},"(ср.",{"$f":"Данные!I2","v":33},"),",{"$f":"Данные!E2","v":"Саратов"},",","в ФОТ для бюджета на выезд (Ср.ЗП)*1,5 =",{"$f":"Данные!K2","v":49.5},"+ ндфл",{"$f":"Данные!L2","v":2},"руб"," (за месячную норму часов+переработки)",null,null,{"$f":"Данные!F2","v":"direktor-179"}]
[{"$f":"CONCATENATE(B3,\" \",C3,\" \",D3,\" \",E3,\" \",F3,\" \",F31,\" \",G3,H3,\", \",I3,\", \",J3,\" \",K3,L3,\" \",M3,\" \",N3,O3,\" \",P3,\" \",Q3,\" \",R3,\" \",S3,\" \",T3,\" \",U3)","v":"Командировка ЗУМ с 0 по  0, Иванов Иван, 8-888-112 (ср.42 ), Самара, в ФОТ для бюджета на выезд (Ср.ЗП)*1,5 = 63 + ндфл 28 руб  (за месячную норму часов+переработки)"},"Командировка",{"$f":"Данные!C3","v":"ЗУМ"},"с",{"$f":"Данные!G3","v":"00:00:00"},"по",{"$f":"Данные!H3","v":"00:00:00"},null,{"$f":"Данные!B3","v":"Иванов Иван"},{"$f":"Данные!D3","v":"8-888-112"},"(ср.",{"$f":"Данные!I3","v":42},"),",{"$f":"Данные!E3","v":"Самара"},",","в ФОТ для бюджета на выезд (Ср.ЗП)*1,5 =",{"$f":"Данные!K3","v":63},"+ ндфл",{"$f":"Данные!L3","v":28},"руб"," (за месячную норму часов+переработки)",null,null,{"$f":"Данные!F3","v":"direktor-180"}]
[{"$f":"CONCATENATE(B4,\" \",C4,\" \",D4,\" \",E4,\" \",F4,\" \",F32,\" \",G4,H4,\", \",I4,\", \",J4,\" \",K4,L4,\" \",M4,\" \",N4,O4,\" \",P4,\" \",Q4,\" \",R4,\" \",S4,\" \",T4,\" \",U4)","v":"Командировка ПК с 0 по  0, Сидоров Сидр, 8-888-113 (ср.22 ), Самара, в ФОТ для бюджета на выезд (Ср.ЗП)*1,5 = 33 + ндфл 3 руб  (за месячную норму часов+переработки)"},"Командировка",{"$f":"Данные!C4","v":"ПК"},"с",{"$f":"Данные!G4","v":"00:00:00"},"по",{"$f":"Данные!H4","v":"00:00:00"},null,{"$f":"Данные!B4","v":"Сидоров Сидр"},{"$f":"Данные!D4","v":"8-888-113"},"(ср.",{"$f":"Данные!I4","v":22},"),",{"$f":"Данные!E4","v":"Самара"},",","в ФОТ для бюджета на выезд (Ср.ЗП)*1,5 =",{"$f":"Данные!K4","v":33},"+ ндфл",{"$f":"Данные!L4","v":3},"руб"," (за месячную норму часов+переработки)",null,null,{"$f":"Данные!F4","v":"direktor-181"}]
[{"$f":"CONCATENATE(B5,\" \",C5,\" \",D5,\" \",E5,\" \",F5,\" \",F33,\" \",G5,H5,\", \",I5,\", \",J5,\" \",K5,L5,\" \",M5,\" \",N5,O5,\" \",P5,\" \",Q5,\" \",R5,\" \",S5,\" \",T5,\" \",U5)","v":"Командировка ЗУМ с 0 по  0, Василий Алибабаевич, 8-888-114 (ср.32 ), Пушкин, в ФОТ для бюджета на выезд (Ср.ЗП)*1,5 = 48 + ндфл 3 руб  (за месячную норму часов+переработки)"},"Командировка",{"$f":"Данные!C5","v":"ЗУМ"},"с",{"$f":"Данные!G5","v":"00:00:00"},"по",{"$f":"Данные!H5","v":"00:00:00"},null,{"$f":"Данные!B5","v":"Василий Алибабаевич"},{"$f":"Данные!D5","v":"8-888-114"},"(ср.",{"$f":"Данные!I5","v":32},"),",{"$f":"Данные!E5","v":"Пушкин"},",","в ФОТ для бюджета на выезд (Ср.ЗП)*1,5 =",{"$f":"Данные!K5","v":48},"+ ндфл",{"$f":"Данные!L5","v":3},"руб"," (за месячную норму часов+переработки)",null,null,{"$f":"Данные!F5","v":"direktor-182"}]
[{"$f":"CONCATENATE(B6,\" \",C6,\" \",D6,\" \",E6,\" \",F6,\" \",F34,\" \",G6,H6,\", \",I6,\", \",J6,\" \",K6,L6,\" \",M6,\" \",N6,O6,\" \",P6,\" \",Q6,\" \",R6,\" \",S6,\" \",T6,\" \",U6)","v":"Командировка БОСС с 0 по  0, Доцент, 8-888-115 (ср.322 ), Пушкино, в ФОТ для бюджета на выезд (Ср.ЗП)*1,5 = 483 + ндфл 22 руб  (за месячную норму часов+переработки)"},"Командировка",{"$f":"Данные!C6","v":"БОСС"},"с",{"$f":"Данные!G6","v":"00:00:00"},"по",{"$f":"Данные!H6","v":"00:00:00"},null,{"$f":"Данные!B6","v":"Доцент"},{"$f":"Данные!D6","v":"8-888-115"},"(ср.",{"$f":"Данные!I6","v":322},"),",{"$f":"Данные!E6","v":"Пушкино"},",","в ФОТ для бюджета на выезд (Ср.ЗП)*1,5 =",{"$f":"Данные!K6","v":483},"+ ндфл",{"$f":"Данные!L6","v":22},"руб"," (за месячную норму часов+переработки)",null,null,{"$f":"Данные!F6","v":"direktor-183"}]
[{"$f":"CONCATENATE(B7,\" \",C7,\" \",D7,\" \",E7,\" \",F7,\" \",F35,\" \",G7,H7,\", \",I7,\", \",J7,\" \",K7,L7,\" \",M7,\" \",N7,O7,\" \",P7,\" \",Q7,\" \",R7,\" \",S7,\" \",T7,\" \",U7)","v":"Командировка ЗУМ с 0 по  0, Котов Кот, 8-888-116 (ср.45 ), Екатеринбург, в ФОТ для бюджета на выезд (Ср.ЗП)*1,5 = 67,5 + ндфл 27 руб  (за месячную норму часов+переработки)"},"Командировка",{"$f":"Данные!C7","v":"ЗУМ"},"с",{"$f":"Данные!G7","v":"00:00:00"},"по",{"$f":"Данные!H7","v":"00:00:00"},null,{"$f":"Данные!B7","v":"Котов Кот"},{"$f":"Данные!D7","v":"8-888-116"},"(ср.",{"$f":"Данные!I7","v":45},"),",{"$f":"Данные!E7","v":"Екатеринбург"},",","в ФОТ для бюджета на выезд (Ср.ЗП)*1,5 =",{"$f":"Данные!K7","v":67.5},"+ ндфл",{"$f":"Данные!L7","v":27},"руб"," (за месячную норму часов+переработки)",null,null,{"$f":"Данные!F7","v":"direktor-184"}]
[{"$f":"CONCATENATE(B8,\" \",C8,\" \",D8,\" \",E8,\" \",F8,\" \",F36,\" \",G8,H8,\", \",I8,\", \",J8,\" \",K8,L8,\" \",M8,\" \",N8,O8,\" \",P8,\" \",Q8,\" \",R8,\" \",S8,\" \",T8,\" \",U8)","v":"Командировка ПК с 0 по  0, Смиронов Смирн, 8-888-117 (ср.30 ), Челябинск, в ФОТ для бюджета на выезд (Ср.ЗП)*1,5 = 45 + ндфл 15 руб  (за месячную норму часов+переработки)"},"Командировка",{"$f":"Данные!C8","v":"ПК"},"с",{"$f":"Данные!G8","v":"00:00:00"},"по",{"$f":"Данные!H8","v":"00:00:00"},null,{"$f":"Данные!B8","v":"Смиронов Смирн"},{"$f":"Данные!D8","v":"8-888-117"},"(ср.",{"$f":"Данные!I8","v":30},"),",{"$f":"Данные!E8","v":"Челябинск"},",","в ФОТ для бюджета на выезд (Ср.ЗП)*1,5 =",{"$f":"Данные!K8","v":45},"+ ндфл",{"$f":"Данные!L8","v":15},"руб"," (за месячную норму часов+переработки)",null,null,{"$f":"Данные!F8","v":"direktor-185"}]
[{"$f":"CONCATENATE(B9,\" \",C9,\" \",D9,\" \",E9,\" \",F9,\" \",F37,\" \",G9,H9,\", \",I9,\", \",J9,\" \",K9,L9,\" \",M9,\" \",N9,O9,\" \",P9,\" \",Q9,\" \",R9,\" \",S9,\" \",T9,\" \",U9)","v":"Командировка 0 с 0 по  0, ВАКАНТ, 8-888-118 (ср.0 ), 0, в ФОТ для бюджета на выезд (Ср.ЗП)*1,5 = 0 + ндфл 0 руб  (за месячную норму часов+переработки)"},"Командировка",{"$f":"Данные!C9","v":0},"с",{"$f":"Данные!G9","v":"00:00:00"},"по",{"$f":"Данные!H9","v":"00:00:00"},null,{"$f":"Данные!B9","v":"ВАКАНТ"},{"$f":"Данные!D9","v":"8-888-118"},"(ср.",{"$f":"Данные!I9","v":0},"),",{"$f":"Данные!E9","v":0},",","в ФОТ для бюджета на выезд (Ср.ЗП)*1,5 =",{"$f":"Данные!K9","v":0},"+ ндфл",{"$f":"Данные!L9","v":0},"руб"," (за месячную норму часов+переработки)",null,null,{"$f":"Данные!F9","v":"direktor-186"}]
[{"$f":"CONCATENATE(B10,\" \",C10,\" \",D10,\" \",E10,\" \",F10,\" \",F38,\" \",G10,H10,\", \",I10,\", \",J10,\" \",K10,L10,\" \",M10,\" \",N10,O10,\" \",P10,\" \",Q10,\" \",R10,\" \",S10,\" \",T10,\" \",U10)","v":"Командировка 0 с 0 по  0, ВАКАНТ, 8-888-119 (ср.0 ), 0, в ФОТ для бюджета на выезд (Ср.ЗП)*1,5 = 0 + ндфл 0 руб  (за месячную норму часов+переработки)"},"Командировка",{"$f":"Данные!C10","v":0},"с",{"$f":"Данные!G10","v":"00:00:00"},"по",{"$f":"Данные!H10","v":"00:00:00"},null,{"$f":"Данные!B10","v":"ВАКАНТ"},{"$f":"Данные!D10","v":"8-888-119"},"(ср.",{"$f":"Данные!I10","v":0},"),",{"$f":"Данные!E10","v":0},",","в ФОТ для бюджета на выезд (Ср.ЗП)*1,5 =",{"$f":"Данные!K10","v":0},"+ ндфл",{"$f":"Данные!L10","v":0},"руб"," (за месячную норму часов+переработки)",null,null,{"$f":"Данные!F10","v":"direktor-187"}]
[{"$f":"CONCATENATE(B11,\" \",C11,\" \",D11,\" \",E11,\" \",F11,\" \",F39,\" \",G11,H11,\", \",I11,\", \",J11,\" \",K11,L11,\" \",M11,\" \",N11,O11,\" \",P11,\" \",Q11,\" \",R11,\" \",S11,\" \",T11,\" \",U11)","v":"Командировка ПК с 0 по  0, Вика, 8-888-120 (ср.43 ), Новосибирск, в ФОТ для бюджета на выезд (Ср.ЗП)*1,5 = 64,5 + ндфл 21 руб  (за месячную норму часов+переработки)"},"Командировка",{"$f":"Данные!C11","v":"ПК"},"с",{"$f":"Данные!G11","v":"00:00:00"},"по",{"$f":"Данные!H11","v":"00:00:00"},null,{"$f":"Данные!B11","v":"Вика"},{"$f":"Данные!D11","v":"8-888-120"},"(ср.",{"$f":"Данные!I11","v":43},"),",{"$f":"Данные!E11","v":"Новосибирск"},",","в ФОТ для бюджета на выезд (Ср.ЗП)*1,5 =",{"$f":"Данные!K11","v":64.5},"+ ндфл",{"$f":"Данные!L11","v":21},"руб"," (за месячную норму часов+переработки)",null,null,{"$f":"Данные!F11","v":"direktor-188"}]
[{"$f":"CONCATENATE(B12,\" \",C12,\" \",D12,\" \",E12,\" \",F12,\" \",F40,\" \",G12,H12,\", \",I12,\", \",J12,\" \",K12,L12,\" \",M12,\" \",N12,O12,\" \",P12,\" \",Q12,\" \",R12,\" \",S12,\" \",T12,\" \",U12)","v":"Командировка ЗУМ с 0 по  0, Светлогор, 8-888-121 (ср.55 ), Новокузнецк, в ФОТ для бюджета на выезд (Ср.ЗП)*1,5 = 82,5 + ндфл 2 руб  (за месячную норму часов+переработки)"},"Командировка",{"$f":"Данные!C12","v":"ЗУМ"},"с",{"$f":"Данные!G12","v":"00:00:00"},"по",{"$f":"Данные!H12","v":"00:00:00"},null,{"$f":"Данные!B12","v":"Светлогор"},{"$f":"Данные!D12","v":"8-888-121"},"(ср.",{"$f":"Данные!I12","v":55},"),",{"$f":"Данные!E12","v":"Новокузнецк"},",","в ФОТ для бюджета на выезд (Ср.ЗП)*1,5 =",{"$f":"Данные!K12","v":82.5},"+ ндфл",{"$f":"Данные!L12","v":2},"руб"," (за месячную норму часов+переработки)",null,null,{"$f":"Данные!F12","v":"direktor-189"}]
[{"$f":"CONCATENATE(B13,\" \",C13,\" \",D13,\" \",E13,\" \",F13,\" \",F41,\" \",G13,H13,\", \",I13,\", \",J13,\" \",K13,L13,\" \",M13,\" \",N13,O13,\" \",P13,\" \",Q13,\" \",R13,\" \",S13,\" \",T13,\" \",U13)","v":"Командировка 0 с 0 по  0, ВАКАНТ, 8-888-122 (ср.0 ), 0, в ФОТ для бюджета на выезд (Ср.ЗП)*1,5 = 0 + ндфл 0 руб  (за месячную норму часов+переработки)"},"Командировка",{"$f":"Данные!C13","v":0},"с",{"$f":"Данные!G13","v":"00:00:00"},"по",{"$f":"Данные!H13","v":"00:00:00"},null,{"$f":"Данные!B13","v":"ВАКАНТ"},{"$f":"Данные!D13","v":"8-888-122"},"(ср.",{"$f":"Данные!I13","v":0},"),",{"$f":"Данные!E13","v":0},",","в ФОТ для бюджета на выезд (Ср.ЗП)*1,5 =",{"$f":"Данные!K13","v":0},"+ ндфл",{"$f":"Данные!L13","v":0},"руб"," (за месячную норму часов+переработки)",null,null,{"$f":"Данные!F13","v":"direktor-190"}]
[{"$f":"CONCATENATE(B14,\" \",C14,\" \",D14,\" \",E14,\" \",F14,\" \",F42,\" \",G14,H14,\", \",I14,\", \",J14,\" \",K14,L14,\" \",M14,\" \",N14,O14,\" \",P14,\" \",Q14,\" \",R14,\" \",S14,\" \",T14,\" \",U14)","v":"Командировка Кладовщик с 15.01 по  08.02, Грачев Грач, 8-888-123 (ср.46 ), Москва, в ФОТ для бюджета на выезд (Ср.ЗП)*1,5 = 69 + ндфл 2 руб  (за месячную норму часов+переработки)"},"Командировка",{"$f":"Данные!C14","v":"Кладовщик"},"с",{"$f":"Данные!G14","v":"15.01"},"по",{"$f":"Данные!H14","v":"08.02"},null,{"$f":"Данные!B14","v":"Грачев Грач"},{"$f":"Данные!D14","v":"8-888-123"},"(ср.",{"$f":"Данные!I14","v":46},"),",{"$f":"Данные!E14","v":"Москва"},",","в ФОТ для бюджета на выезд (Ср.ЗП)*1,5 =",{"$f":"Данные!K14","v":69},"+ ндфл",{"$f":"Данные!L14","v":2},"руб"," (за месячную норму часов+переработки)",null,null,{"$f":"Данные!F14","v":"direktor-191"}]
[{"$f":"CONCATENATE(B15,\" \",C15,\" \",D15,\" \",E15,\" \",F15,\" \",F43,\" \",G15,H15,\", \",I15,\", \",J15,\" \",K15,L15,\" \",M15,\" \",N15,O15,\" \",P15,\" \",Q15,\" \",R15,\" \",S15,\" \",T15,\" \",U15)","v":"Командировка 0 с 0 по  0, Карпов Карп, 8-888-124 (ср.26 ), 0, в ФОТ для бюджета на выезд (Ср.ЗП)*1,5 = 39 + ндфл 2 руб  (за месячную норму часов+переработки)"},"Командировка",{"$f":"Данные!C15","v":0},"с",{"$f":"Данные!G15","v":"00:00:00"},"по",{"$f":"Данные!H15","v":"00:00:00"},null,{"$f":"Данные!B15","v":"Карпов Карп"},{"$f":"Данные!D15","v":"8-888-124"},"(ср.",{"$f":"Данные!I15","v":26},"),",{"$f":"Данные!E15","v":0},",","в ФОТ для бюджета на выезд (Ср.ЗП)*1,5 =",{"$f":"Данные!K15","v":39},"+ ндфл",{"$f":"Данные!L15","v":2},"руб"," (за месячную норму часов+переработки)",null,null,{"$f":"Данные!F15","v":"direktor-192"}]
[{"$f":"CONCATENATE(B16,\" \",C16,\" \",D16,\" \",E16,\" \",F16,\" \",F44,\" \",G16,H16,\", \",I16,\", \",J16,\" \",K16,L16,\" \",M16,\" \",N16,O16,\" \",P16,\" \",Q16,\" \",R16,\" \",S16,\" \",T16,\" \",U16)","v":"Командировка 0 с 0 по  0, ВАКАНТ, 8-888-125 (ср.0 ), 0, в ФОТ для бюджета на выезд (Ср.ЗП)*1,5 = 0 + ндфл 0 руб  (за месячную норму часов+переработки)"},"Командировка",{"$f":"Данные!C16","v":0},"с",{"$f":"Данные!G16","v":"00:00:00"},"по",{"$f":"Данные!H16","v":"00:00:00"},null,{"$f":"Данные!B16","v":"ВАКАНТ"},{"$f":"Данные!D16","v":"8-888-125"},"(ср.",{"$f":"Данные!I16","v":0},"),",{"$f":"Данные!E16","v":0},",","в ФОТ для бюджета на выезд (Ср.ЗП)*1,5 =",{"$f":"Данные!K16","v":0},"+ ндфл",{"$f":"Данные!L16","v":0},"руб"," (за месячную норму часов+переработки)",null,null,{"$f":"Данные!F16","v":"direktor-193"}]
[{"$f":"CONCATENATE(B17,\" \",C17,\" \",D17,\" \",E17,\" \",F17,\" \",F45,\" \",G17,H17,\", \",I17,\", \",J17,\" \",K17,L17,\" \",M17,\" \",N17,O17,\" \",P17,\" \",Q17,\" \",R17,\" \",S17,\" \",T17,\" \",U17)","v":"Командировка 0 с 0 по  0, ВАКАНТ, 8-888-126 (ср.0 ), 0, в ФОТ для бюджета на выезд (Ср.ЗП)*1,5 = 0 + ндфл 0 руб  (за месячную норму часов+переработки)"},"Командировка",{"$f":"Данные!C17","v":0},"с",{"$f":"Данные!G17","v":"00:00:00"},"по",{"$f":"Данные!H17","v":"00:00:00"},null,{"$f":"Данные!B17","v":"ВАКАНТ"},{"$f":"Данные!D17","v":"8-888-126"},"(ср.",{"$f":"Данные!I17","v":0},"),",{"$f":"Данные!E17","v":0},",","в ФОТ для бюджета на выезд (Ср.ЗП)*1,5 =",{"$f":"Данные!K17","v":0},"+ ндфл",{"$f":"Данные!L17","v":0},"руб"," (за месячную норму часов+переработки)",null,null,{"$f":"Данные!F17","v":"direktor-194"}]
[{"$f":"CONCATENATE(B18,\" \",C18,\" \",D18,\" \",E18,\" \",F18,\" \",F46,\" \",G18,H18,\", \",I18,\", \",J18,\" \",K18,L18,\" \",M18,\" \",N18,O18,\" \",P18,\" \",Q18,\" \",R18,\" \",S18,\" \",T18,\" \",U18)","v":"Командировка 0 с 15.01 по  08.02, ВАКАНТ, 8-888-127 (ср.0 ), 0, в ФОТ для бюджета на выезд (Ср.ЗП)*1,5 = 0 + ндфл 0 руб  (за месячную норму часов+переработки)"},"Командировка",{"$f":"Данные!C18","v":0},"с",{"$f":"Данные!G18","v":"15.01"},"по",{"$f":"Данные!H18","v":"08.02"},null,{"$f":"Данные!B18","v":"ВАКАНТ"},{"$f":"Данные!D18","v":"8-888-127"},"(ср.",{"$f":"Данные!I18","v":0},"),",{"$f":"Данные!E18","v":0},",","в ФОТ для бюджета на выезд (Ср.ЗП)*1,5 =",{"$f":"Данные!K18","v":0},"+ ндфл",{"$f":"Данные!L18","v":0},"руб"," (за месячную норму часов+переработки)",null,null,{"$f":"Данные!F18","v":"direktor-195"}]
[{"$f":"CONCATENATE(B19,\" \",C19,\" \",D19,\" \",E19,\" \",F19,\" \",F47,\" \",G19,H19,\", \",I19,\", \",J19,\" \",K19,L19,\" \",M19,\" \",N19,O19,\" \",P19,\" \",Q19,\" \",R19,\" \",S19,\" \",T19,\" \",U19)","v":"Командировка Ст. кладовщик с 0 по  0, Митя, 8-888-128 (ср.40 ), С.-Петербург, в ФОТ для бюджета на выезд (Ср.ЗП)*1,5 = 60 + ндфл 2 руб  (за месячную норму часов+переработки)"},"Командировка",{"$f":"Данные!C19","v":"Ст. кладовщик"},"с",{"$f":"Данные!G19","v":"00:00:00"},"по",{"$f":"Данные!H19","v":"00:00:00"},null,{"$f":"Данные!B19","v":"Митя"},{"$f":"Данные!D19","v":"8-888-128"},"(ср.",{"$f":"Данные!I19","v":40},"),",{"$f":"Данные!E19","v":"С.-Петербург"},",","в ФОТ для бюджета на выезд (Ср.ЗП)*1,5 =",{"$f":"Данные!K19","v":60},"+ ндфл",{"$f":"Данные!L19","v":2},"руб"," (за месячную норму часов+переработки)",null,null,{"$f":"Данные!F19","v":"direktor-196"}]
[{"$f":"CONCATENATE(B20,\" \",C20,\" \",D20,\" \",E20,\" \",F20,\" \",F48,\" \",G20,H20,\", \",I20,\", \",J20,\" \",K20,L20,\" \",M20,\" \",N20,O20,\" \",P20,\" \",Q20,\" \",R20,\" \",S20,\" \",T20,\" \",U20)","v":"Командировка Ст. кладовщик с 0 по  0, Настя, 8-888-129 (ср.41 ), Екатеринбург, в ФОТ для бюджета на выезд (Ср.ЗП)*1,5 = 61,5 + ндфл 22 руб  (за месячную норму часов+переработки)"},"Командировка",{"$f":"Данные!C20","v":"Ст. кладовщик"},"с",{"$f":"Данные!G20","v":"00:00:00"},"по",{"$f":"Данные!H20","v":"00:00:00"},null,{"$f":"Данные!B20","v":"Настя"},{"$f":"Данные!D20","v":"8-888-129"},"(ср.",{"$f":"Данные!I20","v":41},"),",{"$f":"Данные!E20","v":"Екатеринбург"},",","в ФОТ для бюджета на выезд (Ср.ЗП)*1,5 =",{"$f":"Данные!K20","v":61.5},"+ ндфл",{"$f":"Данные!L20","v":22},"руб"," (за месячную норму часов+переработки)",null,null,{"$f":"Данные!F20","v":"direktor-197"}]
{"$rows_left_out":36}