{"text_format":"1","workbook":"xlsx","n_sheets":3,"sheets":["Блок","Разделение","сырье"],"not_rendered":{"charts":0,"images":0,"macros":1,"external_links":2,"defined_names":211,"comments":0,"pivot_tables":0},"unopened":[],"bounds":{"document_bytes":16777216,"sheet_cells":100000,"rows_first":2000,"rows_last":500,"rows_between":2000,"halvings":0,"cell_chars":16384,"cell_head_chars":4096},"cells_cut":0,"cells_raw":0,"read":"whole","date_system":"1900"}

{"sheet":"Блок","index":0,"n_rows":1,"n_cols":1,"rows_kept":1,"cut":false,"hidden":false,"merged":[[0,0,0,2],[2,0,2,2]]}
["Блок А"]

{"sheet":"Разделение","index":1,"n_rows":39,"n_cols":8,"rows_kept":39,"cut":false,"hidden":false,"merged":[]}
[{"$f":"INDEX(Таблица1173[вид сырья],SMALL(IF(MATCH(Таблица1173[вид сырья],Таблица1173[вид сырья],)=ROW(Таблица1173[вид сырья])-3,ROW(Таблица1173[вид сырья])-3),COLUMN()))","v":"ПНД"},{"$f":"INDEX(Таблица1173[вид сырья],SMALL(IF(MATCH(Таблица1173[вид сырья],Таблица1173[вид сырья],)=ROW(Таблица1173[вид сырья])-3,ROW(Таблица1173[вид сырья])-3),COLUMN()))","v":"ПВД"},{"$f":"INDEX(Таблица1173[вид сырья],SMALL(IF(MATCH(Таблица1173[вид сырья],Таблица1173[вид сырья],)=ROW(Таблица1173[вид сырья])-3,ROW(Таблица1173[вид сырья])-3),COLUMN()))","v":"Меловая добавка"},{"$f":"INDEX(Таблица1173[вид сырья],SMALL(IF(MATCH(Таблица1173[вид сырья],Таблица1173[вид сырья],)=ROW(Таблица1173[вид сырья])-3,ROW(Таблица1173[вид сырья])-3),COLUMN()))","v":"ЛПВД"},{"$f":"INDEX(Таблица1173[вид сырья],SMALL(IF(MATCH(Таблица1173[вид сырья],Таблица1173[вид сырья],)=ROW(Таблица1173[вид сырья])-3,ROW(Таблица1173[вид сырья])-3),COLUMN()))","v":"Концентрат"},{"$f":"INDEX(Таблица1173[вид сырья],SMALL(IF(MATCH(Таблица1173[вид сырья],Таблица1173[вид сырья],)=ROW(Таблица1173[вид сырья])-3,ROW(Таблица1173[вид сырья])-3),COLUMN()))","v":"Добавка"},{"$f":"IFERROR(INDEX(Таблица1173[вид сырья],SMALL(IF(MATCH(Таблица1173[вид сырья],Таблица1173[вид сырья],)=ROW(Таблица1173[вид сырья])-3,ROW(Таблица1173[вид сырья])-3),COLUMN())),0)","v":0},{"$f":"IFERROR(INDEX(Таблица1173[вид сырья],SMALL(IF(MATCH(Таблица1173[вид сырья],Таблица1173[вид сырья],)=ROW(Таблица1173[вид сырья])-3,ROW(Таблица1173[вид сырья])-3),COLUMN())),0)","v":0}]
[{"$f":"MATCH(IF(A1<>0,A1,\"我\"),сырье!$B:$B,A1=0)","v":4},{"$f":"MATCH(IF(B1<>0,B1,\"我\"),сырье!$B:$B,B1=0)","v":28},{"$f":"MATCH(IF(C1<>0,C1,\"我\"),сырье!$B:$B,C1=0)","v":59},{"$f":"MATCH(IF(D1<>0,D1,\"我\"),сырье!$B:$B,D1=0)","v":62},{"$f":"MATCH(IF(E1<>0,E1,\"我\"),сырье!$B:$B,E1=0)","v":66},{"$f":"MATCH(IF(F1<>0,F1,\"我\"),сырье!$B:$B,F1=0)","v":86},{"$f":"MATCH(IF(G1<>0,G1,\"我\"),сырье!$B:$B,G1=0)","v":92},{"$f":"MATCH(IF(H1<>0,H1,\"我\"),сырье!$B:$B,H1=0)","v":92}]
[{"$f":"IF(ROW(A1)<B$2-A$2+1,INDEX(сырье!$C:$C,A$2+ROW(A1)-1),\"/ю\")","v":"гр ПНД зеленая"},{"$f":"IF(ROW(B1)<C$2-B$2+1,INDEX(сырье!$C:$C,B$2+ROW(B1)-1),\"/ю\")","v":"FA2004"},{"$f":"IF(ROW(C1)<D$2-C$2+1,INDEX(сырье!$C:$C,C$2+ROW(C1)-1),\"/ю\")","v":"мел Alen 282"},{"$f":"IF(ROW(D1)<E$2-D$2+1,INDEX(сырье!$C:$C,D$2+ROW(D1)-1),\"/ю\")","v":"LLDPE 0920"},{"$f":"IF(ROW(E1)<F$2-E$2+1,INDEX(сырье!$C:$C,E$2+ROW(E1)-1),\"/ю\")","v":"ск RED 30-0479"},{"$f":"IF(ROW(F1)<G$2-F$2+1,INDEX(сырье!$C:$C,F$2+ROW(F1)-1),\"/ю\")","v":"антислип ДАС-7"},{"$f":"IF(ROW(G1)<H$2-G$2+1,INDEX(сырье!$C:$C,G$2+ROW(G1)-1),\"/ю\")","v":"/ю"},{"$f":"IF(ROW(H1)<I$2-H$2+1,INDEX(сырье!$C:$C,H$2+ROW(H1)-1),\"/ю\")","v":"/ю"}]
[{"$f":"IF(ROW(A2)<B$2-A$2+1,INDEX(сырье!$C:$C,A$2+ROW(A2)-1),\"/ю\")","v":"гр ПНД цветная"},{"$f":"IF(ROW(B2)<C$2-B$2+1,INDEX(сырье!$C:$C,B$2+ROW(B2)-1),\"/ю\")","v":"FK1820"},{"$f":"IF(ROW(C2)<D$2-C$2+1,INDEX(сырье!$C:$C,C$2+ROW(C2)-1),\"/ю\")","v":"мел R80PE-1 Европолимер"},{"$f":"IF(ROW(D2)<E$2-D$2+1,INDEX(сырье!$C:$C,D$2+ROW(D2)-1),\"/ю\")","v":"LLDPE 09200"},{"$f":"IF(ROW(E2)<F$2-E$2+1,INDEX(сырье!$C:$C,E$2+ROW(E2)-1),\"/ю\")","v":"ск бежевый 72613м"},{"$f":"IF(ROW(F2)<G$2-F$2+1,INDEX(сырье!$C:$C,F$2+ROW(F2)-1),\"/ю\")","v":"Антистат ПОАЛ23"},{"$f":"IF(ROW(G2)<H$2-G$2+1,INDEX(сырье!$C:$C,G$2+ROW(G2)-1),\"/ю\")","v":"/ю"},{"$f":"IF(ROW(H2)<I$2-H$2+1,INDEX(сырье!$C:$C,H$2+ROW(H2)-1),\"/ю\")","v":"/ю"}]
[{"$f":"IF(ROW(A3)<B$2-A$2+1,INDEX(сырье!$C:$C,A$2+ROW(A3)-1),\"/ю\")","v":"гр ПСД прозр"},{"$f":"IF(ROW(B3)<C$2-B$2+1,INDEX(сырье!$C:$C,B$2+ROW(B3)-1),\"/ю\")","v":"гр 108"},{"$f":"IF(ROW(C3)<D$2-C$2+1,INDEX(сырье!$C:$C,C$2+ROW(C3)-1),\"/ю\")","v":"мел Картли"},{"$f":"IF(ROW(D3)<E$2-D$2+1,INDEX(сырье!$C:$C,D$2+ROW(D3)-1),\"/ю\")","v":"Полиэтилен   TR-131 (Marlex)"},{"$f":"IF(ROW(E3)<F$2-E$2+1,INDEX(сырье!$C:$C,E$2+ROW(E3)-1),\"/ю\")","v":"ск бежевый ME875160"},{"$f":"IF(ROW(F3)<G$2-F$2+1,INDEX(сырье!$C:$C,F$2+ROW(F3)-1),\"/ю\")","v":"Модификатор 101"},{"$f":"IF(ROW(G3)<H$2-G$2+1,INDEX(сырье!$C:$C,G$2+ROW(G3)-1),\"/ю\")","v":"/ю"},{"$f":"IF(ROW(H3)<I$2-H$2+1,INDEX(сырье!$C:$C,H$2+ROW(H3)-1),\"/ю\")","v":"/ю"}]
[{"$f":"IF(ROW(A4)<B$2-A$2+1,INDEX(сырье!$C:$C,A$2+ROW(A4)-1),\"/ю\")","v":"гр ПСД фиолетовая"},{"$f":"IF(ROW(B4)<C$2-B$2+1,INDEX(сырье!$C:$C,B$2+ROW(B4)-1),\"/ю\")","v":"гр 153"},{"$f":"IF(ROW(C4)<D$2-C$2+1,INDEX(сырье!$C:$C,C$2+ROW(C4)-1),\"/ю\")","v":"/ю"},{"$f":"IF(ROW(D4)<E$2-D$2+1,INDEX(сырье!$C:$C,D$2+ROW(D4)-1),\"/ю\")","v":"ПЭТП(B)"},{"$f":"IF(ROW(E4)<F$2-E$2+1,INDEX(сырье!$C:$C,E$2+ROW(E4)-1),\"/ю\")","v":"ск белый 253"},{"$f":"IF(ROW(F4)<G$2-F$2+1,INDEX(сырье!$C:$C,F$2+ROW(F4)-1),\"/ю\")","v":"ОлеАмид"},{"$f":"IF(ROW(G4)<H$2-G$2+1,INDEX(сырье!$C:$C,G$2+ROW(G4)-1),\"/ю\")","v":"/ю"},{"$f":"IF(ROW(H4)<I$2-H$2+1,INDEX(сырье!$C:$C,H$2+ROW(H4)-1),\"/ю\")","v":"/ю"}]
[{"$f":"IF(ROW(A5)<B$2-A$2+1,INDEX(сырье!$C:$C,A$2+ROW(A5)-1),\"/ю\")","v":"гр. ПНД Голубая"},{"$f":"IF(ROW(B5)<C$2-B$2+1,INDEX(сырье!$C:$C,B$2+ROW(B5)-1),\"/ю\")","v":"гр 158"},{"$f":"IF(ROW(C5)<D$2-C$2+1,INDEX(сырье!$C:$C,C$2+ROW(C5)-1),\"/ю\")","v":"/ю"},{"$f":"IF(ROW(D5)<E$2-D$2+1,INDEX(сырье!$C:$C,D$2+ROW(D5)-1),\"/ю\")","v":"/ю"},{"$f":"IF(ROW(E5)<F$2-E$2+1,INDEX(сырье!$C:$C,E$2+ROW(E5)-1),\"/ю\")","v":"ск белый ME80000"},{"$f":"IF(ROW(F5)<G$2-F$2+1,INDEX(сырье!$C:$C,F$2+ROW(F5)-1),\"/ю\")","v":"Осушающая добавка Айсфикс 50"},{"$f":"IF(ROW(G5)<H$2-G$2+1,INDEX(сырье!$C:$C,G$2+ROW(G5)-1),\"/ю\")","v":"/ю"},{"$f":"IF(ROW(H5)<I$2-H$2+1,INDEX(сырье!$C:$C,H$2+ROW(H5)-1),\"/ю\")","v":"/ю"}]
[{"$f":"IF(ROW(A6)<B$2-A$2+1,INDEX(сырье!$C:$C,A$2+ROW(A6)-1),\"/ю\")","v":"гр. ПНД оранжевая"},{"$f":"IF(ROW(B6)<C$2-B$2+1,INDEX(сырье!$C:$C,B$2+ROW(B6)-1),\"/ю\")","v":"гр ПВД 2й сорт Упласт"},{"$f":"IF(ROW(C6)<D$2-C$2+1,INDEX(сырье!$C:$C,C$2+ROW(C6)-1),\"/ю\")","v":"/ю"},{"$f":"IF(ROW(D6)<E$2-D$2+1,INDEX(сырье!$C:$C,D$2+ROW(D6)-1),\"/ю\")","v":"/ю"},{"$f":"IF(ROW(E6)<F$2-E$2+1,INDEX(сырье!$C:$C,E$2+ROW(E6)-1),\"/ю\")","v":"ск голубой 5304"},{"$f":"IF(ROW(F6)<G$2-F$2+1,INDEX(сырье!$C:$C,F$2+ROW(F6)-1),\"/ю\")","v":"Светостабилизатор УФ 310"},{"$f":"IF(ROW(G6)<H$2-G$2+1,INDEX(сырье!$C:$C,G$2+ROW(G6)-1),\"/ю\")","v":"/ю"},{"$f":"IF(ROW(H6)<I$2-H$2+1,INDEX(сырье!$C:$C,H$2+ROW(H6)-1),\"/ю\")","v":"/ю"}]
[{"$f":"IF(ROW(A7)<B$2-A$2+1,INDEX(сырье!$C:$C,A$2+ROW(A7)-1),\"/ю\")","v":"гр. ПНД Черная"},{"$f":"IF(ROW(B7)<C$2-B$2+1,INDEX(сырье!$C:$C,B$2+ROW(B7)-1),\"/ю\")","v":"гр ПВД белая Упласт"},{"$f":"IF(ROW(C7)<D$2-C$2+1,INDEX(сырье!$C:$C,C$2+ROW(C7)-1),\"/ю\")","v":"/ю"},{"$f":"IF(ROW(D7)<E$2-D$2+1,INDEX(сырье!$C:$C,D$2+ROW(D7)-1),\"/ю\")","v":"/ю"},{"$f":"IF(ROW(E7)<F$2-E$2+1,INDEX(сырье!$C:$C,E$2+ROW(E7)-1),\"/ю\")","v":"ск желтый 31102"},{"$f":"IF(ROW(F7)<G$2-F$2+1,INDEX(сырье!$C:$C,F$2+ROW(F7)-1),\"/ю\")","v":"/ю"},{"$f":"IF(ROW(G7)<H$2-G$2+1,INDEX(сырье!$C:$C,G$2+ROW(G7)-1),\"/ю\")","v":"/ю"},{"$f":"IF(ROW(H7)<I$2-H$2+1,INDEX(сырье!$C:$C,H$2+ROW(H7)-1),\"/ю\")","v":"/ю"}]
[{"$f":"IF(ROW(A8)<B$2-A$2+1,INDEX(сырье!$C:$C,A$2+ROW(A8)-1),\"/ю\")","v":"гр.ПНД Флагман"},{"$f":"IF(ROW(B8)<C$2-B$2+1,INDEX(сырье!$C:$C,B$2+ROW(B8)-1),\"/ю\")","v":"гр ПВД зеленая"},{"$f":"IF(ROW(C8)<D$2-C$2+1,INDEX(сырье!$C:$C,C$2+ROW(C8)-1),\"/ю\")","v":"/ю"},{"$f":"IF(ROW(D8)<E$2-D$2+1,INDEX(сырье!$C:$C,D$2+ROW(D8)-1),\"/ю\")","v":"/ю"},{"$f":"IF(ROW(E8)<F$2-E$2+1,INDEX(сырье!$C:$C,E$2+ROW(E8)-1),\"/ю\")","v":"ск зелен. 4363"},{"$f":"IF(ROW(F8)<G$2-F$2+1,INDEX(сырье!$C:$C,F$2+ROW(F8)-1),\"/ю\")","v":"/ю"},{"$f":"IF(ROW(G8)<H$2-G$2+1,INDEX(сырье!$C:$C,G$2+ROW(G8)-1),\"/ю\")","v":"/ю"},{"$f":"IF(ROW(H8)<I$2-H$2+1,INDEX(сырье!$C:$C,H$2+ROW(H8)-1),\"/ю\")","v":"/ю"}]
[{"$f":"IF(ROW(A9)<B$2-A$2+1,INDEX(сырье!$C:$C,A$2+ROW(A9)-1),\"/ю\")","v":"гранула ПНД белая"},{"$f":"IF(ROW(B9)<C$2-B$2+1,INDEX(сырье!$C:$C,B$2+ROW(B9)-1),\"/ю\")","v":"гр ПВД цветная"},{"$f":"IF(ROW(C9)<D$2-C$2+1,INDEX(сырье!$C:$C,C$2+ROW(C9)-1),\"/ю\")","v":"/ю"},{"$f":"IF(ROW(D9)<E$2-D$2+1,INDEX(сырье!$C:$C,D$2+ROW(D9)-1),\"/ю\")","v":"/ю"},{"$f":"IF(ROW(E9)<F$2-E$2+1,INDEX(сырье!$C:$C,E$2+ROW(E9)-1),\"/ю\")","v":"ск кремовый 8855"},{"$f":"IF(ROW(F9)<G$2-F$2+1,INDEX(сырье!$C:$C,F$2+ROW(F9)-1),\"/ю\")","v":"/ю"},{"$f":"IF(ROW(G9)<H$2-G$2+1,INDEX(сырье!$C:$C,G$2+ROW(G9)-1),\"/ю\")","v":"/ю"},{"$f":"IF(ROW(H9)<I$2-H$2+1,INDEX(сырье!$C:$C,H$2+ROW(H9)-1),\"/ю\")","v":"/ю"}]
[{"$f":"IF(ROW(A10)<B$2-A$2+1,INDEX(сырье!$C:$C,A$2+ROW(A10)-1),\"/ю\")","v":"гранула ПНД желтая"},{"$f":"IF(ROW(B10)<C$2-B$2+1,INDEX(сырье!$C:$C,B$2+ROW(B10)-1),\"/ю\")","v":"гр ПВДбелая "},{"$f":"IF(ROW(C10)<D$2-C$2+1,INDEX(сырье!$C:$C,C$2+ROW(C10)-1),\"/ю\")","v":"/ю"},{"$f":"IF(ROW(D10)<E$2-D$2+1,INDEX(сырье!$C:$C,D$2+ROW(D10)-1),\"/ю\")","v":"/ю"},{"$f":"IF(ROW(E10)<F$2-E$2+1,INDEX(сырье!$C:$C,E$2+ROW(E10)-1),\"/ю\")","v":"ск оранж ПФ1205/08ПЭ"},{"$f":"IF(ROW(F10)<G$2-F$2+1,INDEX(сырье!$C:$C,F$2+ROW(F10)-1),\"/ю\")","v":"/ю"},{"$f":"IF(ROW(G10)<H$2-G$2+1,INDEX(сырье!$C:$C,G$2+ROW(G10)-1),\"/ю\")","v":"/ю"},{"$f":"IF(ROW(H10)<I$2-H$2+1,INDEX(сырье!$C:$C,H$2+ROW(H10)-1),\"/ю\")","v":"/ю"}]
[{"$f":"IF(ROW(A11)<B$2-A$2+1,INDEX(сырье!$C:$C,A$2+ROW(A11)-1),\"/ю\")","v":"гранула ПНД красная "},{"$f":"IF(ROW(B11)<C$2-B$2+1,INDEX(сырье!$C:$C,B$2+ROW(B11)-1),\"/ю\")","v":"гр трубная черная"},{"$f":"IF(ROW(C11)<D$2-C$2+1,INDEX(сырье!$C:$C,C$2+ROW(C11)-1),\"/ю\")","v":"/ю"},{"$f":"IF(ROW(D11)<E$2-D$2+1,INDEX(сырье!$C:$C,D$2+ROW(D11)-1),\"/ю\")","v":"/ю"},{"$f":"IF(ROW(E11)<F$2-E$2+1,INDEX(сырье!$C:$C,E$2+ROW(E11)-1),\"/ю\")","v":"ск оранжевый 20-0133"},{"$f":"IF(ROW(F11)<G$2-F$2+1,INDEX(сырье!$C:$C,F$2+ROW(F11)-1),\"/ю\")","v":"/ю"},{"$f":"IF(ROW(G11)<H$2-G$2+1,INDEX(сырье!$C:$C,G$2+ROW(G11)-1),\"/ю\")","v":"/ю"},{"$f":"IF(ROW(H11)<I$2-H$2+1,INDEX(сырье!$C:$C,H$2+ROW(H11)-1),\"/ю\")","v":"/ю"}]
[{"$f":"IF(ROW(A12)<B$2-A$2+1,INDEX(сырье!$C:$C,A$2+ROW(A12)-1),\"/ю\")","v":"гранула ПНД розовая"},{"$f":"IF(ROW(B12)<C$2-B$2+1,INDEX(сырье!$C:$C,B$2+ROW(B12)-1),\"/ю\")","v":"гр. ПВД белая. Грандпласт (изовол)"},{"$f":"IF(ROW(C12)<D$2-C$2+1,INDEX(сырье!$C:$C,C$2+ROW(C12)-1),\"/ю\")","v":"/ю"},{"$f":"IF(ROW(D12)<E$2-D$2+1,INDEX(сырье!$C:$C,D$2+ROW(D12)-1),\"/ю\")","v":"/ю"},{"$f":"IF(ROW(E12)<F$2-E$2+1,INDEX(сырье!$C:$C,E$2+ROW(E12)-1),\"/ю\")","v":"ск розовый 1603"},{"$f":"IF(ROW(F12)<G$2-F$2+1,INDEX(сырье!$C:$C,F$2+ROW(F12)-1),\"/ю\")","v":"/ю"},{"$f":"IF(ROW(G12)<H$2-G$2+1,INDEX(сырье!$C:$C,G$2+ROW(G12)-1),\"/ю\")","v":"/ю"},{"$f":"IF(ROW(H12)<I$2-H$2+1,INDEX(сырье!$C:$C,H$2+ROW(H12)-1),\"/ю\")","v":"/ю"}]
[{"$f":"IF(ROW(A13)<B$2-A$2+1,INDEX(сырье!$C:$C,A$2+ROW(A13)-1),\"/ю\")","v":"гранула ПНД синяя"},{"$f":"IF(ROW(B13)<C$2-B$2+1,INDEX(сырье!$C:$C,B$2+ROW(B13)-1),\"/ю\")","v":"гр. ПВД Голубая"},{"$f":"IF(ROW(C13)<D$2-C$2+1,INDEX(сырье!$C:$C,C$2+ROW(C13)-1),\"/ю\")","v":"/ю"},{"$f":"IF(ROW(D13)<E$2-D$2+1,INDEX(сырье!$C:$C,D$2+ROW(D13)-1),\"/ю\")","v":"/ю"},{"$f":"IF(ROW(E13)<F$2-E$2+1,INDEX(сырье!$C:$C,E$2+ROW(E13)-1),\"/ю\")","v":"ск св.желтый 32392"},{"$f":"IF(ROW(F13)<G$2-F$2+1,INDEX(сырье!$C:$C,F$2+ROW(F13)-1),\"/ю\")","v":"/ю"},{"$f":"IF(ROW(G13)<H$2-G$2+1,INDEX(сырье!$C:$C,G$2+ROW(G13)-1),\"/ю\")","v":"/ю"},{"$f":"IF(ROW(H13)<I$2-H$2+1,INDEX(сырье!$C:$C,H$2+ROW(H13)-1),\"/ю\")","v":"/ю"}]
[{"$f":"IF(ROW(A14)<B$2-A$2+1,INDEX(сырье!$C:$C,A$2+ROW(A14)-1),\"/ю\")","v":"гранула ТКО "},{"$f":"IF(ROW(B14)<C$2-B$2+1,INDEX(сырье!$C:$C,B$2+ROW(B14)-1),\"/ю\")","v":"гр. ПВД цвет. Грандпласт"},{"$f":"IF(ROW(C14)<D$2-C$2+1,INDEX(сырье!$C:$C,C$2+ROW(C14)-1),\"/ю\")","v":"/ю"},{"$f":"IF(ROW(D14)<E$2-D$2+1,INDEX(сырье!$C:$C,D$2+ROW(D14)-1),\"/ю\")","v":"/ю"},{"$f":"IF(ROW(E14)<F$2-E$2+1,INDEX(сырье!$C:$C,E$2+ROW(E14)-1),\"/ю\")","v":"СК серебр. металлик 8222"},{"$f":"IF(ROW(F14)<G$2-F$2+1,INDEX(сырье!$C:$C,F$2+ROW(F14)-1),\"/ю\")","v":"/ю"},{"$f":"IF(ROW(G14)<H$2-G$2+1,INDEX(сырье!$C:$C,G$2+ROW(G14)-1),\"/ю\")","v":"/ю"},{"$f":"IF(ROW(H14)<I$2-H$2+1,INDEX(сырье!$C:$C,H$2+ROW(H14)-1),\"/ю\")","v":"/ю"}]
[{"$f":"IF(ROW(A15)<B$2-A$2+1,INDEX(сырье!$C:$C,A$2+ROW(A15)-1),\"/ю\")","v":"ПНД 10500"},{"$f":"IF(ROW(B15)<C$2-B$2+1,INDEX(сырье!$C:$C,B$2+ROW(B15)-1),\"/ю\")","v":"гр. ПВД цветная Изовол"},{"$f":"IF(ROW(C15)<D$2-C$2+1,INDEX(сырье!$C:$C,C$2+ROW(C15)-1),\"/ю\")","v":"/ю"},{"$f":"IF(ROW(D15)<E$2-D$2+1,INDEX(сырье!$C:$C,D$2+ROW(D15)-1),\"/ю\")","v":"/ю"},{"$f":"IF(ROW(E15)<F$2-E$2+1,INDEX(сырье!$C:$C,E$2+ROW(E15)-1),\"/ю\")","v":"ск син 5402"},{"$f":"IF(ROW(F15)<G$2-F$2+1,INDEX(сырье!$C:$C,F$2+ROW(F15)-1),\"/ю\")","v":"/ю"},{"$f":"IF(ROW(G15)<H$2-G$2+1,INDEX(сырье!$C:$C,G$2+ROW(G15)-1),\"/ю\")","v":"/ю"},{"$f":"IF(ROW(H15)<I$2-H$2+1,INDEX(сырье!$C:$C,H$2+ROW(H15)-1),\"/ю\")","v":"/ю"}]
[{"$f":"IF(ROW(A16)<B$2-A$2+1,INDEX(сырье!$C:$C,A$2+ROW(A16)-1),\"/ю\")","v":"ПНД 1060"},{"$f":"IF(ROW(B16)<C$2-B$2+1,INDEX(сырье!$C:$C,B$2+ROW(B16)-1),\"/ю\")","v":"гр. ПВД черно-белая"},{"$f":"IF(ROW(C16)<D$2-C$2+1,INDEX(сырье!$C:$C,C$2+ROW(C16)-1),\"/ю\")","v":"/ю"},{"$f":"IF(ROW(D16)<E$2-D$2+1,INDEX(сырье!$C:$C,D$2+ROW(D16)-1),\"/ю\")","v":"/ю"},{"$f":"IF(ROW(E16)<F$2-E$2+1,INDEX(сырье!$C:$C,E$2+ROW(E16)-1),\"/ю\")","v":"ск темный-шок 1725/08"},{"$f":"IF(ROW(F16)<G$2-F$2+1,INDEX(сырье!$C:$C,F$2+ROW(F16)-1),\"/ю\")","v":"/ю"},{"$f":"IF(ROW(G16)<H$2-G$2+1,INDEX(сырье!$C:$C,G$2+ROW(G16)-1),\"/ю\")","v":"/ю"},{"$f":"IF(ROW(H16)<I$2-H$2+1,INDEX(сырье!$C:$C,H$2+ROW(H16)-1),\"/ю\")","v":"/ю"}]
[{"$f":"IF(ROW(A17)<B$2-A$2+1,INDEX(сырье!$C:$C,A$2+ROW(A17)-1),\"/ю\")","v":"ПНД 1150"},{"$f":"IF(ROW(B17)<C$2-B$2+1,INDEX(сырье!$C:$C,B$2+ROW(B17)-1),\"/ю\")","v":"гр.ПВД в/с Липецк"},{"$f":"IF(ROW(C17)<D$2-C$2+1,INDEX(сырье!$C:$C,C$2+ROW(C17)-1),\"/ю\")","v":"/ю"},{"$f":"IF(ROW(D17)<E$2-D$2+1,INDEX(сырье!$C:$C,D$2+ROW(D17)-1),\"/ю\")","v":"/ю"},{"$f":"IF(ROW(E17)<F$2-E$2+1,INDEX(сырье!$C:$C,E$2+ROW(E17)-1),\"/ю\")","v":"СК топл.молоко 1313"},{"$f":"IF(ROW(F17)<G$2-F$2+1,INDEX(сырье!$C:$C,F$2+ROW(F17)-1),\"/ю\")","v":"/ю"},{"$f":"IF(ROW(G17)<H$2-G$2+1,INDEX(сырье!$C:$C,G$2+ROW(G17)-1),\"/ю\")","v":"/ю"},{"$f":"IF(ROW(H17)<I$2-H$2+1,INDEX(сырье!$C:$C,H$2+ROW(H17)-1),\"/ю\")","v":"/ю"}]
[{"$f":"IF(ROW(A18)<B$2-A$2+1,INDEX(сырье!$C:$C,A$2+ROW(A18)-1),\"/ю\")","v":"ПНД 273 "},{"$f":"IF(ROW(B18)<C$2-B$2+1,INDEX(сырье!$C:$C,B$2+ROW(B18)-1),\"/ю\")","v":"гранула Агропромупак"},{"$f":"IF(ROW(C18)<D$2-C$2+1,INDEX(сырье!$C:$C,C$2+ROW(C18)-1),\"/ю\")","v":"/ю"},{"$f":"IF(ROW(D18)<E$2-D$2+1,INDEX(сырье!$C:$C,D$2+ROW(D18)-1),\"/ю\")","v":"/ю"},{"$f":"IF(ROW(E18)<F$2-E$2+1,INDEX(сырье!$C:$C,E$2+ROW(E18)-1),\"/ю\")","v":"ск фиол 6514"},{"$f":"IF(ROW(F18)<G$2-F$2+1,INDEX(сырье!$C:$C,F$2+ROW(F18)-1),\"/ю\")","v":"/ю"},{"$f":"IF(ROW(G18)<H$2-G$2+1,INDEX(сырье!$C:$C,G$2+ROW(G18)-1),\"/ю\")","v":"/ю"},{"$f":"IF(ROW(H18)<I$2-H$2+1,INDEX(сырье!$C:$C,H$2+ROW(H18)-1),\"/ю\")","v":"/ю"}]
{"$rows_left_out":20}
{"sheet":"сырье","index":2,"n_rows":150,"n_cols":5,"rows_kept":150,"cut":false,"hidden":false,"merged":[[0,1,0,5],[1,1,1,4]]}
[null,"Сырье на пленку"]
[]
[null,"вид сырья","Наименование","Плотность","цена, за 1кг"]
[{"$f":"[2]сырье!A4","v":1},{"$f":"[2]сырье!B4","v":"ПНД"},{"$f":"[2]сырье!C4","v":"гр ПНД зеленая"},{"$f":"[2]сырье!D4","v":0.95},{"$f":"[2]сырье!E4","v":89.94}]
[{"$f":"[2]сырье!A5","v":2},{"$f":"[2]сырье!B5","v":"ПНД"},{"$f":"[2]сырье!C5","v":"гр ПНД цветная"},{"$f":"[2]сырье!D5","v":0.95},{"$f":"[2]сырье!E5","v":67.84}]
[{"$f":"[2]сырье!A6","v":3},{"$f":"[2]сырье!B6","v":"ПНД"},{"$f":"[2]сырье!C6","v":"гр ПСД прозр"},{"$f":"[2]сырье!D6","v":0.94},{"$f":"[2]сырье!E6","v":83.47}]
[{"$f":"[2]сырье!A7","v":4},{"$f":"[2]сырье!B7","v":"ПНД"},{"$f":"[2]сырье!C7","v":"гр ПСД фиолетовая"},{"$f":"[2]сырье!D7","v":0.94},{"$f":"[2]сырье!E7","v":86.68}]
[{"$f":"[2]сырье!A8","v":5},{"$f":"[2]сырье!B8","v":"ПНД"},{"$f":"[2]сырье!C8","v":"гр. ПНД Голубая"},{"$f":"[2]сырье!D8","v":0.94},{"$f":"[2]сырье!E8","v":94}]
[{"$f":"[2]сырье!A9","v":6},{"$f":"[2]сырье!B9","v":"ПНД"},{"$f":"[2]сырье!C9","v":"гр. ПНД оранжевая"},{"$f":"[2]сырье!D9","v":0.95},{"$f":"[2]сырье!E9","v":72.52}]
[{"$f":"[2]сырье!A10","v":7},{"$f":"[2]сырье!B10","v":"ПНД"},{"$f":"[2]сырье!C10","v":"гр. ПНД Черная"},{"$f":"[2]сырье!D10","v":0.95},{"$f":"[2]сырье!E10","v":74.040000000000006}]
[{"$f":"[2]сырье!A11","v":8},{"$f":"[2]сырье!B11","v":"ПНД"},{"$f":"[2]сырье!C11","v":"гр.ПНД Флагман"},{"$f":"[2]сырье!D11","v":0.95},{"$f":"[2]сырье!E11","v":50}]
[{"$f":"[2]сырье!A12","v":9},{"$f":"[2]сырье!B12","v":"ПНД"},{"$f":"[2]сырье!C12","v":"гранула ПНД белая"},{"$f":"[2]сырье!D12","v":0.95},{"$f":"[2]сырье!E12","v":72.989999999999995}]
[{"$f":"[2]сырье!A13","v":10},{"$f":"[2]сырье!B13","v":"ПНД"},{"$f":"[2]сырье!C13","v":"гранула ПНД желтая"},{"$f":"[2]сырье!D13","v":0.95},{"$f":"[2]сырье!E13","v":75.67}]
[{"$f":"[2]сырье!A14","v":11},{"$f":"[2]сырье!B14","v":"ПНД"},{"$f":"[2]сырье!C14","v":"гранула ПНД красная "},{"$f":"[2]сырье!D14","v":0.95},{"$f":"[2]сырье!E14","v":74.63}]
[{"$f":"[2]сырье!A15","v":12},{"$f":"[2]сырье!B15","v":"ПНД"},{"$f":"[2]сырье!C15","v":"гранула ПНД розовая"},{"$f":"[2]сырье!D15","v":0.95},{"$f":"[2]сырье!E15","v":58.85}]
[{"$f":"[2]сырье!A16","v":13},{"$f":"[2]сырье!B16","v":"ПНД"},{"$f":"[2]сырье!C16","v":"гранула ПНД синяя"},{"$f":"[2]сырье!D16","v":0.95},{"$f":"[2]сырье!E16","v":77.8}]
[{"$f":"[2]сырье!A17","v":14},{"$f":"[2]сырье!B17","v":"ПНД"},{"$f":"[2]сырье!C17","v":"гранула ТКО "},{"$f":"[2]сырье!D17","v":0.95},{"$f":"[2]сырье!E17","v":52.67}]
[{"$f":"[2]сырье!A18","v":15},{"$f":"[2]сырье!B18","v":"ПНД"},{"$f":"[2]сырье!C18","v":"ПНД 10500"},{"$f":"[2]сырье!D18","v":0.95},{"$f":"[2]сырье!E18","v":95}]
[{"$f":"[2]сырье!A19","v":16},{"$f":"[2]сырье!B19","v":"ПНД"},{"$f":"[2]сырье!C19","v":"ПНД 1060"},{"$f":"[2]сырье!D19","v":0.95},{"$f":"[2]сырье!E19","v":95}]
[{"$f":"[2]сырье!A20","v":17},{"$f":"[2]сырье!B20","v":"ПНД"},{"$f":"[2]сырье!C20","v":"ПНД 1150"},{"$f":"[2]сырье!D20","v":0.95},{"$f":"[2]сырье!E20","v":92}]
{"$rows_left_out":130}