{"text_format":"1","workbook":"xlsx","n_sheets":5,"sheets":["Monday","Copy Names","Job History","Names","ALL NAMES"],"not_rendered":{"charts":0,"images":0,"macros":1,"external_links":0,"defined_names":4,"comments":1,"pivot_tables":0},"unopened":[],"bounds":{"document_bytes":16777216,"sheet_cells":100000,"rows_first":2000,"rows_last":500,"rows_between":2000,"halvings":0,"cell_chars":16384,"cell_head_chars":4096},"cells_cut":0,"cells_raw":0,"read":"whole","date_system":"1900"}

{"sheet":"Monday","index":0,"n_rows":46,"n_cols":17,"rows_kept":46,"cut":false,"hidden":false,"merged":[]}
[{"$f":" INDEX($Q$4:$Q$11, B1)","v":"Saturday 2"},7]
[]
[]
[null,null,null,"GOODS IN TEAM ",null,null,null,"FLOOR TEAM",null,null,null,null,null,null,null,"E.Lindo","Monday"]
[null,null,null,null,null,null,null,null,null,null,null,null,null,null,null,"J.Gorrell","Tuesday"]
[null,null,1,{"$f":" VLOOKUP( LARGE(Names!$A$3:$A$99*Names!$D$3:$D$99, C6), Names!$A$3:$C$99, 3, 0)","v":"A.McFarlane"},"2PM",null,1,{"$f":" VLOOKUP( LARGE(Names!$A$3:$A$99*Names!$E$3:$E$99, G6), Names!$A$3:$C$99, 3, 0)","v":"N.Lukasevicius"},"2PM",null,null,null,null,null,null,"K.Pape","Wednesday"]
[null,null,2,{"$f":" VLOOKUP( LARGE(Names!$A$3:$A$99*Names!$D$3:$D$99, C7), Names!$A$3:$C$99, 3, 0)","v":"I.Edgar"},"2PM",null,2,{"$f":" VLOOKUP( LARGE(Names!$A$3:$A$99*Names!$E$3:$E$99, G7), Names!$A$3:$C$99, 3, 0)","v":"R.Pembroke"},"2PM",null,null,null,null,null,null,"M.Abu","Thursday"]
[null,null,3,{"$f":" VLOOKUP( LARGE(Names!$A$3:$A$99*Names!$D$3:$D$99, C8), Names!$A$3:$C$99, 3, 0)","v":"A.Goodman"},"2PM",null,3,{"$f":" VLOOKUP( LARGE(Names!$A$3:$A$99*Names!$E$3:$E$99, G8), Names!$A$3:$C$99, 3, 0)","v":"M.Kochowski"},"2PM",null,null,null,null,null,null,"M.Flanagan","Friday"]
[null,null,4,{"$f":" VLOOKUP( LARGE(Names!$A$3:$A$99*Names!$D$3:$D$99, C9), Names!$A$3:$C$99, 3, 0)","v":"E.Selickis"},"2PM",null,4,{"$f":" VLOOKUP( LARGE(Names!$A$3:$A$99*Names!$E$3:$E$99, G9), Names!$A$3:$C$99, 3, 0)","v":"T.Harman"},"4PM",null,null,null,null,null,null,"M.Kumar","Saturday 1"]
[null,null,5,{"$f":" VLOOKUP( LARGE(Names!$A$3:$A$99*Names!$D$3:$D$99, C10), Names!$A$3:$C$99, 3, 0)","v":"B.Golubkov"},"4PM",null,5,{"$f":" VLOOKUP( LARGE(Names!$A$3:$A$99*Names!$E$3:$E$99, G10), Names!$A$3:$C$99, 3, 0)","v":"M.Flanagan"},"4PM",null,null,null,null,null,null,"M.Lawson","Saturday 2"]
[null,null,null,null,null,null,null,null,null,null,null,null,null,null,null,"P.Chapman","Sunday"]
[null,null,null,null,null,null,null,null,null,null,null,null,null,null,null,"R.Hallgally"]
[null,null,null,null,"2 to 4",null,null,null,null,null,null,null,null,null,null,"S.Abraham"]
[null,null,null,"FORKS",null,null,null,null,null,null,null,null,null,null,null,"S.Pearce"]
[null,null,1,{"$f":" VLOOKUP( MAX(Names!$A$3:$A$99 * Names!$H$3:$H$99 * INDEX(Names!$J$3:$Q$99,,$B$1)), Names!$A$3:$C$99, 3, 0)","v":"S.Pearce"},"2PM",null,null,null,null,null,null,null,null,null,null,"S.Stretton"]
[null,null,null,null,null,null,null,"Bread Pickers",null,null,null,null,null,null,null,"T.Bryan"]
[null,null,null,"OPPS",null,null,1,null,null,null,null,null,null,null,null,"A.Bradbury"]
[null,null,1,null,"2PM",null,2,null,null,null,null,null,null,null,null,"A.Nicholls"]
[null,null,2,null,"2PM",null,3,null,null,null,null,null,null,null,null,"A.Wall"]
[null,null,null,"COVER",null,null,4,null,null,null,null,null,null,null,null,"A.Walton"]
{"$rows_left_out":27}
{"sheet":"Copy Names","index":1,"n_rows":25,"n_cols":9,"rows_kept":25,"cut":false,"hidden":false,"merged":[]}
[]
[]
[]
[null,null,null,"GOODS IN TEAM ",null,null,null,"FLOOR TEAM"]
[]
[null,null,1,"M.Abu","2PM",null,1,"M.Abu","2PM"]
[null,null,2,"R.Diprose","2PM",null,2,"R.Diprose","2PM"]
[null,null,3,"M.Flanagan","2PM",null,3,"M.Flanagan","2PM"]
[null,null,4,"R.Hallgally","2PM",null,4,"T.Winter","4PM"]
[null,null,5,"T.Winter","4PM",null,5,"B.Sutton","4PM"]
[]
[]
[null,null,null,null,"2 to 4"]
[null,null,null,"FORKS"]
[null,null,1,"S.Stretton","2PM"]
[null,null,null,null,null,null,null,"Bread Pickers"]
[null,null,null,"OPPS",null,null,1]
[null,null,1,null,null,null,2]
[null,null,2,null,null,null,3]
[null,null,null,"COVER",null,null,4]
{"$rows_left_out":6}
{"sheet":"Job History","index":2,"n_rows":70,"n_cols":14,"rows_kept":70,"cut":false,"hidden":false,"merged":[]}
[null,"Nº","Name","Goods in(Days)","Fl.Team(Days)","Forks(Days)","Pick. (Days)","Non.Productive",null,null,"Goods in","Picking","Floor team","Forks"]
[null,"Job History!",null,{"$f":"AVERAGE(D3:D999)","v":0.61764705882352944},{"$f":"AVERAGE(E3:E999)","v":0.66176470588235292},{"$f":"AVERAGE(F3:F999)","v":0.13235294117647059},{"$f":"AVERAGE(G3:G999)","v":0},{"$f":"AVERAGE(H3:H999)","v":1.411764705882353},null,null,"T.Underwood",null,"A.Wall","M.Kumar"]
[null,1,"A.Bradbury",{"$f":"COUNTIF($K$2:$K$60000,C3)","v":1},{"$f":"COUNTIF($M$2:$M$60000,C3)","v":0},{"$f":"COUNTIF($N$2:$N$60000,C3)","v":0},{"$f":"COUNTIF($L$2:$L$60000,C3)","v":0},{"$f":"COUNTIF($K$2:$K$60000,C3)+COUNTIF($M$2:$M$60000,C3)+COUNTIF($N$2:$N$60000,C3)","v":1},null,null,"R.Diprose",null,"P.Green","S.Abraham"]
[null,2,"A.Hussey",{"$f":"COUNTIF($K$2:$K$60000,C4)","v":0},{"$f":"COUNTIF($M$2:$M$60000,C4)","v":0},{"$f":"COUNTIF($N$2:$N$60000,C4)","v":0},0,{"$f":"COUNTIF($K$2:$K$60000,C4)+COUNTIF($M$2:$M$60000,C4)+COUNTIF($N$2:$N$60000,C4)","v":0},null,null,"A.Nicholls",null,"E.Mullally","S.Stretton"]
[null,3,"A.McFarlane",0,0,0,0,0,null,null,"C.Keegan",null,"R.Rozniak","K.Pape"]
[null,4,"A.Nicholls",1,1,0,0,2,null,null,"P.McArthur",null,"P.Chapman","T.Bryan"]
[null,5,"B.Ratcliffe",0,0,0,0,0,null,null,{"$error":"#N/A"},null,"G.Hawkins","S.Stretton"]
[null,6,"A.Wall",1,2,0,0,3,null,null,"J.Pyke",null,"K.Pape","S.Stretton"]
[null,7,"A.Walton",1,2,0,0,3,null,null,{"$error":"#N/A"},null,"C.Boateng","M.Kumar"]
[null,8,"B.Golubkov",0,0,0,0,0,null,null,"A.Walton",null,"B.Sutton","S.Stretton"]
[null,9,"B.Ratcliffe",0,0,0,0,0,null,null,{"$error":"#N/A"},null,"M.Lawson"]
[null,10,"B.Sutton",0,2,0,0,2,null,null,"M.Kumar",null,"A.Walton"]
[null,11,"C.Boateng",0,1,0,0,1,null,null,"K.Pape",null,"S.Pearce"]
[null,12,"C.Keegan",1,0,0,0,1,null,null,"A.Bradbury",null,"M.Lawson"]
[null,13,"D.Caffell",0,0,0,0,0,null,null,"A.Wall",null,"P.Green"]
[null,14,"D.Cooke",0,0,0,0,0,null,null,"S.Pearce",null,"T.Doyle"]
[null,15,"D.Hickmott",1,0,0,0,1,null,null,"G.Franklin",null,"R.Hallgally"]
[null,16,"D.Magill",1,0,0,0,1,null,null,"I.Edgar",null,"J.Pyke"]
[null,17,"D.Roczniak",0,0,0,0,0,null,null,"P.Chapman",null,"S.Chow"]
[null,18,"E.Lindo",1,0,0,0,1,null,null,"S.Abraham",null,"T.Underwood"]
{"$rows_left_out":51}
{"sheet":"Names","index":3,"n_rows":69,"n_cols":36,"rows_kept":69,"cut":false,"hidden":false,"merged":[]}
[null,null,null,null,null,{"$f":" SUM(F$3:F$99)","v":52},{"$f":" SUM(G$3:G$99)","v":65},{"$f":" SUM(H$3:H$99)","v":18},{"$f":" SUM(I$3:I$99)","v":65},{"$f":"COUNTIF(J3:J99,1)","v":42},{"$f":"COUNTIF(K3:K99,1)","v":49},50,57,51,15,16,29,{"$f":" SUM(R$3:R$99) / SUM(F$3:F$99)","v":0.80769230769230771},{"$f":" SUM(S$3:S$99) / SUM(G$3:G$99)","v":0.69230769230769229},{"$f":" SUM(T$3:T$99) / SUM(H$3:H$99)","v":0.5}]
["Rand","Rank","Name","Фильтр (Goods in)","Фильтр (Fl.Team)","Goods in (Capability)","Fl.Team (Capability)","Forks (Capability)","Pick. (Capability)","Monday","Tuesday","Wednesday","Thursday","Friday","Saturday 1","Saturday 2","Sunday","Goods in(Days)","Fl.Team(Days)","Forks(Days)",null,null,null,null,null,null,null,null,null,null,null,null,null,null,"Rand","Rank"]
[{"$f":" INT(1000000*RAND()) + ROW()/1000","v":313650.00300000003},null,"A.Bradbury",{"$f":" IF( 1.2 * MAX(0.5, R$1) + 1 < R3, 0, INDEX($J3:$Q3, Monday!$B$1) * NOT($C3 = Monday!$D$15) )","v":0},{"$f":" IF( 1.2 * MAX(0.5, S$1) + 1 < S3, 0, INDEX($J3:$Q3, Monday!$B$1) * ISNA(MATCH($C3, Monday!$D$6:$D$13, 0)) * NOT($C3 = Monday!$D$15)  )","v":0},1,1,0,1,1,1,1,1,1,0,0,1,{"$f":" INDEX('Job History'!$D$3:$F$99, MATCH($C3, 'Job History'!$C$3:$C$99, 0),)","v":1},0,0,null,null,null,null,null,null,null,null,null,null,null,null,null,null,{"$f":"RAND()*AM3","v":0},{"$f":"RANK($AI3,$AI$3:$AI$51)+COUNTIF(AJ$2:AJ2,AJ2)-1","v":1}]
[708346.00399999996,null,"A.Hussey",{"$f":" IF( 1.2 * MAX(0.5, R$1) + 1 < R4, 0, INDEX($J4:$Q4, Monday!$B$1) * NOT($C4 = Monday!$D$15) )","v":0},{"$f":" IF( 1.2 * MAX(0.5, S$1) + 1 < S4, 0, INDEX($J4:$Q4, Monday!$B$1) * ISNA(MATCH($C4, Monday!$D$6:$D$13, 0)) * NOT($C4 = Monday!$D$15)  )","v":0},1,1,0,1,0,0,1,1,1,0,0,0,{"$f":" INDEX('Job History'!$D$3:$F$99, MATCH($C4, 'Job History'!$C$3:$C$99, 0),)","v":0},0,0,null,null,null,null,null,null,null,null,null,null,null,null,null,null,0,{"$f":"RANK($AI4,$AI$3:$AI$51)+COUNTIF(AJ$2:AJ3,AJ3)-1","v":1}]
[984195.005,null,"A.McFarlane",{"$f":" IF( 1.2 * MAX(0.5, R$1) + 1 < R5, 0, INDEX($J5:$Q5, Monday!$B$1) * NOT($C5 = Monday!$D$15) )","v":1},{"$f":" IF( 1.2 * MAX(0.5, S$1) + 1 < S5, 0, INDEX($J5:$Q5, Monday!$B$1) * ISNA(MATCH($C5, Monday!$D$6:$D$13, 0)) * NOT($C5 = Monday!$D$15)  )","v":0},1,1,0,1,0,1,1,1,1,1,1,0,{"$f":" INDEX('Job History'!$D$3:$F$99, MATCH($C5, 'Job History'!$C$3:$C$99, 0),)","v":0},0,0,null,null,null,null,null,null,null,null,null,null,null,null,null,null,0,{"$f":"RANK($AI5,$AI$3:$AI$51)+COUNTIF(AJ$2:AJ4,AJ4)-1","v":2}]
[633203.00600000005,null,"A.Nicholls",{"$f":" IF( 1.2 * MAX(0.5, R$1) + 1 < R6, 0, INDEX($J6:$Q6, Monday!$B$1) * NOT($C6 = Monday!$D$15) )","v":0},{"$f":" IF( 1.2 * MAX(0.5, S$1) + 1 < S6, 0, INDEX($J6:$Q6, Monday!$B$1) * ISNA(MATCH($C6, Monday!$D$6:$D$13, 0)) * NOT($C6 = Monday!$D$15)  )","v":0},1,1,0,1,1,1,1,1,1,0,0,1,{"$f":" INDEX('Job History'!$D$3:$F$99, MATCH($C6, 'Job History'!$C$3:$C$99, 0),)","v":1},1,0,null,null,null,null,null,null,null,null,null,null,null,null,null,null,0,{"$f":"RANK($AI6,$AI$3:$AI$51)+COUNTIF(AJ$2:AJ5,AJ5)-1","v":1}]
[717991.00699999998,null,"A.Wall",{"$f":" IF( 1.2 * MAX(0.5, R$1) + 1 < R7, 0, INDEX($J7:$Q7, Monday!$B$1) * NOT($C7 = Monday!$D$15) )","v":0},{"$f":" IF( 1.2 * MAX(0.5, S$1) + 1 < S7, 0, INDEX($J7:$Q7, Monday!$B$1) * ISNA(MATCH($C7, Monday!$D$6:$D$13, 0)) * NOT($C7 = Monday!$D$15)  )","v":0},1,1,0,1,1,1,1,1,1,0,0,1,{"$f":" INDEX('Job History'!$D$3:$F$99, MATCH($C7, 'Job History'!$C$3:$C$99, 0),)","v":1},2,0,null,null,null,null,null,null,null,null,null,null,null,null,null,null,0,{"$f":"RANK($AI7,$AI$3:$AI$51)+COUNTIF(AJ$2:AJ6,AJ6)-1","v":3}]
[14617.008,null,"A.Walton",{"$f":" IF( 1.2 * MAX(0.5, R$1) + 1 < R8, 0, INDEX($J8:$Q8, Monday!$B$1) * NOT($C8 = Monday!$D$15) )","v":0},{"$f":" IF( 1.2 * MAX(0.5, S$1) + 1 < S8, 0, INDEX($J8:$Q8, Monday!$B$1) * ISNA(MATCH($C8, Monday!$D$6:$D$13, 0)) * NOT($C8 = Monday!$D$15)  )","v":0},0,1,0,1,1,0,1,1,1,0,0,0,{"$f":" INDEX('Job History'!$D$3:$F$99, MATCH($C8, 'Job History'!$C$3:$C$99, 0),)","v":1},2,0,null,null,null,null,null,null,null,null,null,null,null,null,null,null,0,{"$f":"RANK($AI8,$AI$3:$AI$51)+COUNTIF(AJ$2:AJ7,AJ7)-1","v":1}]
[878508.00899999996,null,"B.Golubkov",{"$f":" IF( 1.2 * MAX(0.5, R$1) + 1 < R9, 0, INDEX($J9:$Q9, Monday!$B$1) * NOT($C9 = Monday!$D$15) )","v":1},{"$f":" IF( 1.2 * MAX(0.5, S$1) + 1 < S9, 0, INDEX($J9:$Q9, Monday!$B$1) * ISNA(MATCH($C9, Monday!$D$6:$D$13, 0)) * NOT($C9 = Monday!$D$15)  )","v":0},1,1,0,1,0,1,1,1,1,1,1,0,{"$f":" INDEX('Job History'!$D$3:$F$99, MATCH($C9, 'Job History'!$C$3:$C$99, 0),)","v":0},0,0,null,null,null,null,null,null,null,null,null,null,null,null,null,null,0,{"$f":"RANK($AI9,$AI$3:$AI$51)+COUNTIF(AJ$2:AJ8,AJ8)-1","v":4}]
[180401.01,null,"B.Ratcliffe",{"$f":" IF( 1.2 * MAX(0.5, R$1) + 1 < R10, 0, INDEX($J10:$Q10, Monday!$B$1) * NOT($C10 = Monday!$D$15) )","v":0},{"$f":" IF( 1.2 * MAX(0.5, S$1) + 1 < S10, 0, INDEX($J10:$Q10, Monday!$B$1) * ISNA(MATCH($C10, Monday!$D$6:$D$13, 0)) * NOT($C10 = Monday!$D$15)  )","v":0},0,1,0,1,0,0,0,1,1,0,0,1,{"$f":" INDEX('Job History'!$D$3:$F$99, MATCH($C10, 'Job History'!$C$3:$C$99, 0),)","v":0},0,0,null,null,null,null,null,null,null,null,null,null,null,null,null,null,0,{"$f":"RANK($AI10,$AI$3:$AI$51)+COUNTIF(AJ$2:AJ9,AJ9)-1","v":1}]
[734821.01100000006,null,"B.Sutton",{"$f":" IF( 1.2 * MAX(0.5, R$1) + 1 < R11, 0, INDEX($J11:$Q11, Monday!$B$1) * NOT($C11 = Monday!$D$15) )","v":0},{"$f":" IF( 1.2 * MAX(0.5, S$1) + 1 < S11, 0, INDEX($J11:$Q11, Monday!$B$1) * ISNA(MATCH($C11, Monday!$D$6:$D$13, 0)) * NOT($C11 = Monday!$D$15)  )","v":0},1,1,0,1,1,1,1,1,0,0,0,1,{"$f":" INDEX('Job History'!$D$3:$F$99, MATCH($C11, 'Job History'!$C$3:$C$99, 0),)","v":0},2,0,null,null,null,null,null,null,null,null,null,null,null,null,null,null,0,{"$f":"RANK($AI11,$AI$3:$AI$51)+COUNTIF(AJ$2:AJ10,AJ10)-1","v":5}]
[15784.012000000001,null,"C.Boateng",{"$f":" IF( 1.2 * MAX(0.5, R$1) + 1 < R12, 0, INDEX($J12:$Q12, Monday!$B$1) * NOT($C12 = Monday!$D$15) )","v":0},{"$f":" IF( 1.2 * MAX(0.5, S$1) + 1 < S12, 0, INDEX($J12:$Q12, Monday!$B$1) * ISNA(MATCH($C12, Monday!$D$6:$D$13, 0)) * NOT($C12 = Monday!$D$15)  )","v":0},1,1,0,1,1,1,1,1,1,0,0,0,{"$f":" INDEX('Job History'!$D$3:$F$99, MATCH($C12, 'Job History'!$C$3:$C$99, 0),)","v":0},1,0,null,null,null,null,null,null,null,null,null,null,null,null,null,null,0,{"$f":"RANK($AI12,$AI$3:$AI$51)+COUNTIF(AJ$2:AJ11,AJ11)-1","v":1}]
[527806.01300000004,null,"C.Keegan",{"$f":" IF( 1.2 * MAX(0.5, R$1) + 1 < R13, 0, INDEX($J13:$Q13, Monday!$B$1) * NOT($C13 = Monday!$D$15) )","v":0},{"$f":" IF( 1.2 * MAX(0.5, S$1) + 1 < S13, 0, INDEX($J13:$Q13, Monday!$B$1) * ISNA(MATCH($C13, Monday!$D$6:$D$13, 0)) * NOT($C13 = Monday!$D$15)  )","v":0},1,1,0,1,1,1,1,1,1,1,0,1,{"$f":" INDEX('Job History'!$D$3:$F$99, MATCH($C13, 'Job History'!$C$3:$C$99, 0),)","v":1},0,0,null,null,null,null,null,null,null,null,null,null,null,null,null,null,0,{"$f":"RANK($AI13,$AI$3:$AI$51)+COUNTIF(AJ$2:AJ12,AJ12)-1","v":6}]
[860825.01399999997,null,"D.Caffell",{"$f":" IF( 1.2 * MAX(0.5, R$1) + 1 < R14, 0, INDEX($J14:$Q14, Monday!$B$1) * NOT($C14 = Monday!$D$15) )","v":0},{"$f":" IF( 1.2 * MAX(0.5, S$1) + 1 < S14, 0, INDEX($J14:$Q14, Monday!$B$1) * ISNA(MATCH($C14, Monday!$D$6:$D$13, 0)) * NOT($C14 = Monday!$D$15)  )","v":0},1,1,1,1,0,1,1,0,0,0,0,1,{"$f":" INDEX('Job History'!$D$3:$F$99, MATCH($C14, 'Job History'!$C$3:$C$99, 0),)","v":0},0,0,null,null,null,null,null,null,null,null,null,null,null,null,null,null,0,{"$f":"RANK($AI14,$AI$3:$AI$51)+COUNTIF(AJ$2:AJ13,AJ13)-1","v":1}]
[51027.014999999999,null,"D.Cooke",{"$f":" IF( 1.2 * MAX(0.5, R$1) + 1 < R15, 0, INDEX($J15:$Q15, Monday!$B$1) * NOT($C15 = Monday!$D$15) )","v":0},{"$f":" IF( 1.2 * MAX(0.5, S$1) + 1 < S15, 0, INDEX($J15:$Q15, Monday!$B$1) * ISNA(MATCH($C15, Monday!$D$6:$D$13, 0)) * NOT($C15 = Monday!$D$15)  )","v":0},1,1,1,1,0,0,0,1,1,0,0,1,{"$f":" INDEX('Job History'!$D$3:$F$99, MATCH($C15, 'Job History'!$C$3:$C$99, 0),)","v":0},0,0,null,null,null,null,null,null,null,null,null,null,null,null,null,null,0,{"$f":"RANK($AI15,$AI$3:$AI$51)+COUNTIF(AJ$2:AJ14,AJ14)-1","v":7}]
[164768.016,null,"D.Hickmott",{"$f":" IF( 1.2 * MAX(0.5, R$1) + 1 < R16, 0, INDEX($J16:$Q16, Monday!$B$1) * NOT($C16 = Monday!$D$15) )","v":1},{"$f":" IF( 1.2 * MAX(0.5, S$1) + 1 < S16, 0, INDEX($J16:$Q16, Monday!$B$1) * ISNA(MATCH($C16, Monday!$D$6:$D$13, 0)) * NOT($C16 = Monday!$D$15)  )","v":1},1,1,0,1,1,1,1,1,1,1,1,0,{"$f":" INDEX('Job History'!$D$3:$F$99, MATCH($C16, 'Job History'!$C$3:$C$99, 0),)","v":1},0,0,null,null,null,null,null,null,null,null,null,null,null,null,null,null,0,{"$f":"RANK($AI16,$AI$3:$AI$51)+COUNTIF(AJ$2:AJ15,AJ15)-1","v":1}]
[635377.01699999999,null,"D.Magill",{"$f":" IF( 1.2 * MAX(0.5, R$1) + 1 < R17, 0, INDEX($J17:$Q17, Monday!$B$1) * NOT($C17 = Monday!$D$15) )","v":0},{"$f":" IF( 1.2 * MAX(0.5, S$1) + 1 < S17, 0, INDEX($J17:$Q17, Monday!$B$1) * ISNA(MATCH($C17, Monday!$D$6:$D$13, 0)) * NOT($C17 = Monday!$D$15)  )","v":0},0,1,0,1,1,0,1,1,1,0,0,1,{"$f":" INDEX('Job History'!$D$3:$F$99, MATCH($C17, 'Job History'!$C$3:$C$99, 0),)","v":1},0,0,null,null,null,null,null,null,null,null,null,null,null,null,null,null,0,{"$f":"RANK($AI17,$AI$3:$AI$51)+COUNTIF(AJ$2:AJ16,AJ16)-1","v":8}]
[396277.01799999998,null,"D.Roczniak",{"$f":" IF( 1.2 * MAX(0.5, R$1) + 1 < R18, 0, INDEX($J18:$Q18, Monday!$B$1) * NOT($C18 = Monday!$D$15) )","v":0},{"$f":" IF( 1.2 * MAX(0.5, S$1) + 1 < S18, 0, INDEX($J18:$Q18, Monday!$B$1) * ISNA(MATCH($C18, Monday!$D$6:$D$13, 0)) * NOT($C18 = Monday!$D$15)  )","v":0},1,1,0,1,0,1,1,1,1,0,0,0,{"$f":" INDEX('Job History'!$D$3:$F$99, MATCH($C18, 'Job History'!$C$3:$C$99, 0),)","v":0},0,0,null,null,null,null,null,null,null,null,null,null,null,null,null,null,0,{"$f":"RANK($AI18,$AI$3:$AI$51)+COUNTIF(AJ$2:AJ17,AJ17)-1","v":1}]
[473306.01899999997,null,"E.Lindo",{"$f":" IF( 1.2 * MAX(0.5, R$1) + 1 < R19, 0, INDEX($J19:$Q19, Monday!$B$1) * NOT($C19 = Monday!$D$15) )","v":0},{"$f":" IF( 1.2 * MAX(0.5, S$1) + 1 < S19, 0, INDEX($J19:$Q19, Monday!$B$1) * ISNA(MATCH($C19, Monday!$D$6:$D$13, 0)) * NOT($C19 = Monday!$D$15)  )","v":0},1,1,1,1,1,1,1,1,1,0,0,0,{"$f":" INDEX('Job History'!$D$3:$F$99, MATCH($C19, 'Job History'!$C$3:$C$99, 0),)","v":1},0,0,null,null,null,null,null,null,null,null,null,null,null,null,null,null,0,{"$f":"RANK($AI19,$AI$3:$AI$51)+COUNTIF(AJ$2:AJ18,AJ18)-1","v":9}]
[634227.02,null,"E.Mooney",{"$f":" IF( 1.2 * MAX(0.5, R$1) + 1 < R20, 0, INDEX($J20:$Q20, Monday!$B$1) * NOT($C20 = Monday!$D$15) )","v":0},{"$f":" IF( 1.2 * MAX(0.5, S$1) + 1 < S20, 0, INDEX($J20:$Q20, Monday!$B$1) * ISNA(MATCH($C20, Monday!$D$6:$D$13, 0)) * NOT($C20 = Monday!$D$15)  )","v":0},0,1,0,1,0,1,0,1,1,0,0,0,{"$f":" INDEX('Job History'!$D$3:$F$99, MATCH($C20, 'Job History'!$C$3:$C$99, 0),)","v":0},0,0,null,null,null,null,null,null,null,null,null,null,null,null,null,null,0,{"$f":"RANK($AI20,$AI$3:$AI$51)+COUNTIF(AJ$2:AJ19,AJ19)-1","v":1}]
{"$rows_left_out":50}
{"sheet":"ALL NAMES","index":4,"n_rows":69,"n_cols":14,"rows_kept":69,"cut":false,"hidden":false,"merged":[[0,0,0,1]]}
["All Names!",null,null,"goods in","floor team","forks","Monday","Tuesday","Wednesday","Thursday","Friday","Saturday 1","Saturday 2","Sunday"]
[1,"A.Bradbury",null,1,1,0,1,1,1,1,1,0,0,1]
[2,"A.Hussey",null,1,1,0,0,0,1,1,1,0,0,0]
[3,"A.McFarlane",null,1,1,0,0,1,1,1,1,1,1,0]
[4,"A.Nicholls",null,1,1,0,1,1,1,1,1,0,0,1]
[5,"A.Wall",null,1,1,0,1,1,1,1,1,0,0,1]
[6,"A.Walton",null,0,1,0,1,0,1,1,1,0,0,0]
[7,"B.Golubkov",null,1,1,0,0,1,1,1,1,1,1,0]
[8,"B.Ratcliffe",null,0,1,0,0,0,0,1,1,0,0,1]
[9,"B.Sutton",null,1,1,0,1,1,1,1,0,0,0,1]
[10,"C.Boateng",null,1,1,0,1,1,1,1,1,0,0,0]
[11,"C.Keegan",null,1,1,0,1,1,1,1,1,1,0,1]
[12,"D.Caffell",null,1,1,1,0,1,1,0,0,0,0,1]
[13,"D.Cooke",null,1,1,1,0,0,0,1,1,0,0,1]
[14,"D.Hickmott",null,1,1,0,1,1,1,1,1,1,1,0]
[15,"D.Magill",null,0,1,0,1,0,1,1,1,0,0,1]
[16,"D.Roczniak",null,1,1,0,0,1,1,1,1,0,0,0]
[17,"E.Lindo",null,1,1,1,1,1,1,1,1,0,0,0]
[18,"E.Mooney",null,0,1,0,0,1,0,1,1,0,0,0]
[19,"E.Mullally",null,1,1,0,1,1,1,1,1,0,1,0]
{"$rows_left_out":49}