{"text_format":"1","workbook":"xlsx","n_sheets":5,"sheets":["Список","Замены","Черновик","Хронология","Как должно"],"not_rendered":{"charts":5,"images":1,"macros":1,"external_links":0,"defined_names":0,"comments":0,"pivot_tables":0},"unopened":[],"bounds":{"document_bytes":16777216,"sheet_cells":100000,"rows_first":2000,"rows_last":500,"rows_between":2000,"halvings":0,"cell_chars":16384,"cell_head_chars":4096},"cells_cut":0,"cells_raw":0,"read":"whole","date_system":"1900"}

{"sheet":"Список","index":0,"n_rows":19,"n_cols":6,"rows_kept":19,"cut":false,"hidden":false,"merged":[]}
["Name","Number","Stage","Line","Unite","Number for map"]
["Путь",1,"Stage_01","Line_1",null,{"$f":"IFERROR(INDEX(Замены!$F$1:$F$100,MATCH(Замены!A2,Замены!$C$1:$C$100,0),1),\"\")","v":"A001"}]
["Лоза",1,"Stage_01","Line_2",null,{"$f":"IFERROR(INDEX(Замены!$F$1:$F$100,MATCH(Замены!A3,Замены!$C$1:$C$100,0),1),\"\")","v":"A002"}]
["Путь",2,"Stage_02","Line_1",null,{"$f":"IFERROR(INDEX(Замены!$F$1:$F$100,MATCH(Замены!A4,Замены!$C$1:$C$100,0),1),\"\")","v":"A001"}]
["Лоза",2,"Stage_02","Line_2",null,{"$f":"IFERROR(INDEX(Замены!$F$1:$F$100,MATCH(Замены!A5,Замены!$C$1:$C$100,0),1),\"\")","v":"A002"}]
["Лоза",3,"Stage_03","Line_2",null,{"$f":"IFERROR(INDEX(Замены!$F$1:$F$100,MATCH(Замены!A6,Замены!$C$1:$C$100,0),1),\"\")","v":"A002"}]
["Путь",3,"Stage_04","Line_1",null,{"$f":"IFERROR(INDEX(Замены!$F$1:$F$100,MATCH(Замены!A7,Замены!$C$1:$C$100,0),1),\"\")","v":"A001"}]
["Путь",4,"Stage_05","Line_1",null,{"$f":"IFERROR(INDEX(Замены!$F$1:$F$100,MATCH(Замены!A8,Замены!$C$1:$C$100,0),1),\"\")","v":"A001"}]
["Лоза",4,"Stage_05","Line_2",null,{"$f":"IFERROR(INDEX(Замены!$F$1:$F$100,MATCH(Замены!A9,Замены!$C$1:$C$100,0),1),\"\")","v":"A002"}]
["Путь",5,"Stage_07","Line_1","\"Путь\" и \"Лоза\"",{"$f":"IFERROR(INDEX(Замены!$F$1:$F$100,MATCH(Замены!A10,Замены!$C$1:$C$100,0),1),\"\")","v":"A003"}]
["Лоза",5,"Stage_09","Line_2",null,{"$f":"IFERROR(INDEX(Замены!$F$1:$F$100,MATCH(Замены!A11,Замены!$C$1:$C$100,0),1),\"\")","v":"A002"}]
["Путь",6,"Stage_10","Line_1",null,{"$f":"IFERROR(INDEX(Замены!$F$1:$F$100,MATCH(Замены!A12,Замены!$C$1:$C$100,0),1),\"\")","v":"A001"}]
["Лоза",6,"Stage_10","Line_2",null,{"$f":"IFERROR(INDEX(Замены!$F$1:$F$100,MATCH(Замены!A13,Замены!$C$1:$C$100,0),1),\"\")","v":"A002"}]
["Путь",7,"Stage_11","Line_1",null,{"$f":"IFERROR(INDEX(Замены!$F$1:$F$100,MATCH(Замены!A14,Замены!$C$1:$C$100,0),1),\"\")","v":"A001"}]
["Лоза",7,"Stage_11","Line_2",null,{"$f":"IFERROR(INDEX(Замены!$F$1:$F$100,MATCH(Замены!A15,Замены!$C$1:$C$100,0),1),\"\")","v":"A002"}]
["Путь",8,"Stage_12","Line_1",null,{"$f":"IFERROR(INDEX(Замены!$F$1:$F$100,MATCH(Замены!A16,Замены!$C$1:$C$100,0),1),\"\")","v":"A001"}]
["Лоза",8,"Stage_12","Line_2",null,{"$f":"IFERROR(INDEX(Замены!$F$1:$F$100,MATCH(Замены!A17,Замены!$C$1:$C$100,0),1),\"\")","v":"A002"}]
["Путь",9,"Stage_13","Line_1",null,{"$f":"IFERROR(INDEX(Замены!$F$1:$F$100,MATCH(Замены!A18,Замены!$C$1:$C$100,0),1),\"\")","v":"A001"}]
["Лоза",9,"Stage_13","Line_2",null,{"$f":"IFERROR(INDEX(Замены!$F$1:$F$100,MATCH(Замены!A19,Замены!$C$1:$C$100,0),1),\"\")","v":"A002"}]

{"sheet":"Замены","index":1,"n_rows":19,"n_cols":6,"rows_kept":19,"cut":false,"hidden":false,"merged":[]}
["Повторы",null,"Без повторов","Замена",null,"Номер для макроса"]
[{"$f":"IF(ISBLANK(Список!E2),Список!A2,Список!E2)","v":"Путь"},null,"Путь",null,null,"A001"]
[{"$f":"IF(ISBLANK(Список!E3),Список!A3,Список!E3)","v":"Лоза"}]
[{"$f":"IF(ISBLANK(Список!E4),Список!A4,Список!E4)","v":"Путь"},null,"Лоза",null,null,"A002"]
[{"$f":"IF(ISBLANK(Список!E5),Список!A5,Список!E5)","v":"Лоза"}]
[{"$f":"IF(ISBLANK(Список!E6),Список!A6,Список!E6)","v":"Лоза"},null,"\"Путь\" и \"Лоза\"",null,null,"A003"]
[{"$f":"IF(ISBLANK(Список!E7),Список!A7,Список!E7)","v":"Путь"}]
[{"$f":"IF(ISBLANK(Список!E8),Список!A8,Список!E8)","v":"Путь"}]
[{"$f":"IF(ISBLANK(Список!E9),Список!A9,Список!E9)","v":"Лоза"}]
[{"$f":"IF(ISBLANK(Список!E10),Список!A10,Список!E10)","v":"\"Путь\" и \"Лоза\""}]
[{"$f":"IF(ISBLANK(Список!E11),Список!A11,Список!E11)","v":"Лоза"}]
[{"$f":"IF(ISBLANK(Список!E12),Список!A12,Список!E12)","v":"Путь"}]
[{"$f":"IF(ISBLANK(Список!E13),Список!A13,Список!E13)","v":"Лоза"}]
[{"$f":"IF(ISBLANK(Список!E14),Список!A14,Список!E14)","v":"Путь"}]
[{"$f":"IF(ISBLANK(Список!E15),Список!A15,Список!E15)","v":"Лоза"}]
[{"$f":"IF(ISBLANK(Список!E16),Список!A16,Список!E16)","v":"Путь"}]
[{"$f":"IF(ISBLANK(Список!E17),Список!A17,Список!E17)","v":"Лоза"}]
[{"$f":"IF(ISBLANK(Список!E18),Список!A18,Список!E18)","v":"Путь"}]
[{"$f":"IF(ISBLANK(Список!E19),Список!A19,Список!E19)","v":"Лоза"}]

{"sheet":"Черновик","index":2,"n_rows":14,"n_cols":48,"rows_kept":14,"cut":false,"hidden":false,"merged":[]}
["Без повторов","Замена",null,"Номер для макроса",null,null,null,null,null,null,null,"Stage_01",null,null,"Stage_02",null,null,"Stage_03",null,null,"Stage_04",null,null,"Stage_05",null,null,"Stage_06",null,null,"Stage_07",null,null,"Stage_08",null,null,"Stage_09",null,null,"Stage_10",null,null,"Stage_11",null,null,"Stage_12",null,null,"Stage_13"]
["Путь",null,null,"A001"]
[null,null,null,"A002",null,null,null,null,"Line_1",null,null,{"$f":"IFERROR(LOOKUP(2,1/((L$1=Список!$C$2:$C$100)*(Список!$D$2:$D$100=$I3)),Список!$F$2:$F$100),\" \")","v":"A001"},{"$f":"IFERROR(LOOKUP(2,1/((M$1=Список!$C$2:$C$100)*(Список!$D$2:$D$100=$I3)),Список!$F$2:$F$100),\" \")","v":" "},{"$f":"IFERROR(LOOKUP(2,1/((N$1=Список!$C$2:$C$100)*(Список!$D$2:$D$100=$I3)),Список!$F$2:$F$100),\" \")","v":" "},{"$f":"IFERROR(LOOKUP(2,1/((O$1=Список!$C$2:$C$100)*(Список!$D$2:$D$100=$I3)),Список!$F$2:$F$100),\" \")","v":"A001"},{"$f":"IFERROR(LOOKUP(2,1/((P$1=Список!$C$2:$C$100)*(Список!$D$2:$D$100=$I3)),Список!$F$2:$F$100),\" \")","v":" "},{"$f":"IFERROR(LOOKUP(2,1/((Q$1=Список!$C$2:$C$100)*(Список!$D$2:$D$100=$I3)),Список!$F$2:$F$100),\" \")","v":" "},{"$f":"IFERROR(LOOKUP(2,1/((R$1=Список!$C$2:$C$100)*(Список!$D$2:$D$100=$I3)),Список!$F$2:$F$100),\" \")","v":" "},{"$f":"IFERROR(LOOKUP(2,1/((S$1=Список!$C$2:$C$100)*(Список!$D$2:$D$100=$I3)),Список!$F$2:$F$100),\" \")","v":" "},{"$f":"IFERROR(LOOKUP(2,1/((T$1=Список!$C$2:$C$100)*(Список!$D$2:$D$100=$I3)),Список!$F$2:$F$100),\" \")","v":" "},{"$f":"IFERROR(LOOKUP(2,1/((U$1=Список!$C$2:$C$100)*(Список!$D$2:$D$100=$I3)),Список!$F$2:$F$100),\" \")","v":"A001"},{"$f":"IFERROR(LOOKUP(2,1/((V$1=Список!$C$2:$C$100)*(Список!$D$2:$D$100=$I3)),Список!$F$2:$F$100),\" \")","v":" "},{"$f":"IFERROR(LOOKUP(2,1/((W$1=Список!$C$2:$C$100)*(Список!$D$2:$D$100=$I3)),Список!$F$2:$F$100),\" \")","v":" "},{"$f":"IFERROR(LOOKUP(2,1/((X$1=Список!$C$2:$C$100)*(Список!$D$2:$D$100=$I3)),Список!$F$2:$F$100),\" \")","v":"A001"},{"$f":"IFERROR(LOOKUP(2,1/((Y$1=Список!$C$2:$C$100)*(Список!$D$2:$D$100=$I3)),Список!$F$2:$F$100),\" \")","v":" "},{"$f":"IFERROR(LOOKUP(2,1/((Z$1=Список!$C$2:$C$100)*(Список!$D$2:$D$100=$I3)),Список!$F$2:$F$100),\" \")","v":" "},{"$f":"IFERROR(LOOKUP(2,1/((AA$1=Список!$C$2:$C$100)*(Список!$D$2:$D$100=$I3)),Список!$F$2:$F$100),\" \")","v":" "},{"$f":"IFERROR(LOOKUP(2,1/((AB$1=Список!$C$2:$C$100)*(Список!$D$2:$D$100=$I3)),Список!$F$2:$F$100),\" \")","v":" "},{"$f":"IFERROR(LOOKUP(2,1/((AC$1=Список!$C$2:$C$100)*(Список!$D$2:$D$100=$I3)),Список!$F$2:$F$100),\" \")","v":" "},{"$f":"IFERROR(LOOKUP(2,1/((AD$1=Список!$C$2:$C$100)*(Список!$D$2:$D$100=$I3)),Список!$F$2:$F$100),\" \")","v":"A003"},{"$f":"IFERROR(LOOKUP(2,1/((AE$1=Список!$C$2:$C$100)*(Список!$D$2:$D$100=$I3)),Список!$F$2:$F$100),\" \")","v":" "},{"$f":"IFERROR(LOOKUP(2,1/((AF$1=Список!$C$2:$C$100)*(Список!$D$2:$D$100=$I3)),Список!$F$2:$F$100),\" \")","v":" "},{"$f":"IFERROR(LOOKUP(2,1/((AG$1=Список!$C$2:$C$100)*(Список!$D$2:$D$100=$I3)),Список!$F$2:$F$100),\" \")","v":" "},{"$f":"IFERROR(LOOKUP(2,1/((AH$1=Список!$C$2:$C$100)*(Список!$D$2:$D$100=$I3)),Список!$F$2:$F$100),\" \")","v":" "},{"$f":"IFERROR(LOOKUP(2,1/((AI$1=Список!$C$2:$C$100)*(Список!$D$2:$D$100=$I3)),Список!$F$2:$F$100),\" \")","v":" "},{"$f":"IFERROR(LOOKUP(2,1/((AJ$1=Список!$C$2:$C$100)*(Список!$D$2:$D$100=$I3)),Список!$F$2:$F$100),\" \")","v":" "},{"$f":"IFERROR(LOOKUP(2,1/((AK$1=Список!$C$2:$C$100)*(Список!$D$2:$D$100=$I3)),Список!$F$2:$F$100),\" \")","v":" "},{"$f":"IFERROR(LOOKUP(2,1/((AL$1=Список!$C$2:$C$100)*(Список!$D$2:$D$100=$I3)),Список!$F$2:$F$100),\" \")","v":" "},{"$f":"IFERROR(LOOKUP(2,1/((AM$1=Список!$C$2:$C$100)*(Список!$D$2:$D$100=$I3)),Список!$F$2:$F$100),\" \")","v":"A001"},{"$f":"IFERROR(LOOKUP(2,1/((AN$1=Список!$C$2:$C$100)*(Список!$D$2:$D$100=$I3)),Список!$F$2:$F$100),\" \")","v":" "},{"$f":"IFERROR(LOOKUP(2,1/((AO$1=Список!$C$2:$C$100)*(Список!$D$2:$D$100=$I3)),Список!$F$2:$F$100),\" \")","v":" "},{"$f":"IFERROR(LOOKUP(2,1/((AP$1=Список!$C$2:$C$100)*(Список!$D$2:$D$100=$I3)),Список!$F$2:$F$100),\" \")","v":"A001"},{"$f":"IFERROR(LOOKUP(2,1/((AQ$1=Список!$C$2:$C$100)*(Список!$D$2:$D$100=$I3)),Список!$F$2:$F$100),\" \")","v":" "},{"$f":"IFERROR(LOOKUP(2,1/((AR$1=Список!$C$2:$C$100)*(Список!$D$2:$D$100=$I3)),Список!$F$2:$F$100),\" \")","v":" "},{"$f":"IFERROR(LOOKUP(2,1/((AS$1=Список!$C$2:$C$100)*(Список!$D$2:$D$100=$I3)),Список!$F$2:$F$100),\" \")","v":"A001"},{"$f":"IFERROR(LOOKUP(2,1/((AT$1=Список!$C$2:$C$100)*(Список!$D$2:$D$100=$I3)),Список!$F$2:$F$100),\" \")","v":" "},{"$f":"IFERROR(LOOKUP(2,1/((AU$1=Список!$C$2:$C$100)*(Список!$D$2:$D$100=$I3)),Список!$F$2:$F$100),\" \")","v":" "},{"$f":"IFERROR(LOOKUP(2,1/((AV$1=Список!$C$2:$C$100)*(Список!$D$2:$D$100=$I3)),Список!$F$2:$F$100),\" \")","v":"A001"}]
["Лоза",null,null,"A003",null,null,null,null,null,null,null,{"$f":"IFERROR(LOOKUP(2,1/((L$1=Список!$C$2:$C$100)*(Список!$D$2:$D$100=$I4)),Список!$F$2:$F$100),\" \")","v":" "},{"$f":"IFERROR(LOOKUP(2,1/((M$1=Список!$C$2:$C$100)*(Список!$D$2:$D$100=$I4)),Список!$F$2:$F$100),\" \")","v":0},{"$f":"IFERROR(LOOKUP(2,1/((N$1=Список!$C$2:$C$100)*(Список!$D$2:$D$100=$I4)),Список!$F$2:$F$100),\" \")","v":0},{"$f":"IFERROR(LOOKUP(2,1/((O$1=Список!$C$2:$C$100)*(Список!$D$2:$D$100=$I4)),Список!$F$2:$F$100),\" \")","v":" "},{"$f":"IFERROR(LOOKUP(2,1/((P$1=Список!$C$2:$C$100)*(Список!$D$2:$D$100=$I4)),Список!$F$2:$F$100),\" \")","v":0},{"$f":"IFERROR(LOOKUP(2,1/((Q$1=Список!$C$2:$C$100)*(Список!$D$2:$D$100=$I4)),Список!$F$2:$F$100),\" \")","v":0},{"$f":"IFERROR(LOOKUP(2,1/((R$1=Список!$C$2:$C$100)*(Список!$D$2:$D$100=$I4)),Список!$F$2:$F$100),\" \")","v":" "},{"$f":"IFERROR(LOOKUP(2,1/((S$1=Список!$C$2:$C$100)*(Список!$D$2:$D$100=$I4)),Список!$F$2:$F$100),\" \")","v":0},{"$f":"IFERROR(LOOKUP(2,1/((T$1=Список!$C$2:$C$100)*(Список!$D$2:$D$100=$I4)),Список!$F$2:$F$100),\" \")","v":0},{"$f":"IFERROR(LOOKUP(2,1/((U$1=Список!$C$2:$C$100)*(Список!$D$2:$D$100=$I4)),Список!$F$2:$F$100),\" \")","v":" "},{"$f":"IFERROR(LOOKUP(2,1/((V$1=Список!$C$2:$C$100)*(Список!$D$2:$D$100=$I4)),Список!$F$2:$F$100),\" \")","v":0},{"$f":"IFERROR(LOOKUP(2,1/((W$1=Список!$C$2:$C$100)*(Список!$D$2:$D$100=$I4)),Список!$F$2:$F$100),\" \")","v":0},{"$f":"IFERROR(LOOKUP(2,1/((X$1=Список!$C$2:$C$100)*(Список!$D$2:$D$100=$I4)),Список!$F$2:$F$100),\" \")","v":" "},{"$f":"IFERROR(LOOKUP(2,1/((Y$1=Список!$C$2:$C$100)*(Список!$D$2:$D$100=$I4)),Список!$F$2:$F$100),\" \")","v":0},{"$f":"IFERROR(LOOKUP(2,1/((Z$1=Список!$C$2:$C$100)*(Список!$D$2:$D$100=$I4)),Список!$F$2:$F$100),\" \")","v":0},{"$f":"IFERROR(LOOKUP(2,1/((AA$1=Список!$C$2:$C$100)*(Список!$D$2:$D$100=$I4)),Список!$F$2:$F$100),\" \")","v":" "},{"$f":"IFERROR(LOOKUP(2,1/((AB$1=Список!$C$2:$C$100)*(Список!$D$2:$D$100=$I4)),Список!$F$2:$F$100),\" \")","v":0},{"$f":"IFERROR(LOOKUP(2,1/((AC$1=Список!$C$2:$C$100)*(Список!$D$2:$D$100=$I4)),Список!$F$2:$F$100),\" \")","v":0},{"$f":"IFERROR(LOOKUP(2,1/((AD$1=Список!$C$2:$C$100)*(Список!$D$2:$D$100=$I4)),Список!$F$2:$F$100),\" \")","v":" "},{"$f":"IFERROR(LOOKUP(2,1/((AE$1=Список!$C$2:$C$100)*(Список!$D$2:$D$100=$I4)),Список!$F$2:$F$100),\" \")","v":0},{"$f":"IFERROR(LOOKUP(2,1/((AF$1=Список!$C$2:$C$100)*(Список!$D$2:$D$100=$I4)),Список!$F$2:$F$100),\" \")","v":0},{"$f":"IFERROR(LOOKUP(2,1/((AG$1=Список!$C$2:$C$100)*(Список!$D$2:$D$100=$I4)),Список!$F$2:$F$100),\" \")","v":" "},{"$f":"IFERROR(LOOKUP(2,1/((AH$1=Список!$C$2:$C$100)*(Список!$D$2:$D$100=$I4)),Список!$F$2:$F$100),\" \")","v":0},{"$f":"IFERROR(LOOKUP(2,1/((AI$1=Список!$C$2:$C$100)*(Список!$D$2:$D$100=$I4)),Список!$F$2:$F$100),\" \")","v":0},{"$f":"IFERROR(LOOKUP(2,1/((AJ$1=Список!$C$2:$C$100)*(Список!$D$2:$D$100=$I4)),Список!$F$2:$F$100),\" \")","v":" "},{"$f":"IFERROR(LOOKUP(2,1/((AK$1=Список!$C$2:$C$100)*(Список!$D$2:$D$100=$I4)),Список!$F$2:$F$100),\" \")","v":0},{"$f":"IFERROR(LOOKUP(2,1/((AL$1=Список!$C$2:$C$100)*(Список!$D$2:$D$100=$I4)),Список!$F$2:$F$100),\" \")","v":0},{"$f":"IFERROR(LOOKUP(2,1/((AM$1=Список!$C$2:$C$100)*(Список!$D$2:$D$100=$I4)),Список!$F$2:$F$100),\" \")","v":" "},{"$f":"IFERROR(LOOKUP(2,1/((AN$1=Список!$C$2:$C$100)*(Список!$D$2:$D$100=$I4)),Список!$F$2:$F$100),\" \")","v":0},{"$f":"IFERROR(LOOKUP(2,1/((AO$1=Список!$C$2:$C$100)*(Список!$D$2:$D$100=$I4)),Список!$F$2:$F$100),\" \")","v":0},{"$f":"IFERROR(LOOKUP(2,1/((AP$1=Список!$C$2:$C$100)*(Список!$D$2:$D$100=$I4)),Список!$F$2:$F$100),\" \")","v":" "},{"$f":"IFERROR(LOOKUP(2,1/((AQ$1=Список!$C$2:$C$100)*(Список!$D$2:$D$100=$I4)),Список!$F$2:$F$100),\" \")","v":0},{"$f":"IFERROR(LOOKUP(2,1/((AR$1=Список!$C$2:$C$100)*(Список!$D$2:$D$100=$I4)),Список!$F$2:$F$100),\" \")","v":0},{"$f":"IFERROR(LOOKUP(2,1/((AS$1=Список!$C$2:$C$100)*(Список!$D$2:$D$100=$I4)),Список!$F$2:$F$100),\" \")","v":" "},{"$f":"IFERROR(LOOKUP(2,1/((AT$1=Список!$C$2:$C$100)*(Список!$D$2:$D$100=$I4)),Список!$F$2:$F$100),\" \")","v":0},{"$f":"IFERROR(LOOKUP(2,1/((AU$1=Список!$C$2:$C$100)*(Список!$D$2:$D$100=$I4)),Список!$F$2:$F$100),\" \")","v":0},{"$f":"IFERROR(LOOKUP(2,1/((AV$1=Список!$C$2:$C$100)*(Список!$D$2:$D$100=$I4)),Список!$F$2:$F$100),\" \")","v":" "}]
[null,null,null,null,null,null,null,null,null,null,null,{"$f":"IFERROR(LOOKUP(2,1/((L$1=Список!$C$2:$C$100)*(Список!$D$2:$D$100=$I5)),Список!$F$2:$F$100),\" \")","v":" "},{"$f":"IFERROR(LOOKUP(2,1/((M$1=Список!$C$2:$C$100)*(Список!$D$2:$D$100=$I5)),Список!$F$2:$F$100),\" \")","v":0},{"$f":"IFERROR(LOOKUP(2,1/((N$1=Список!$C$2:$C$100)*(Список!$D$2:$D$100=$I5)),Список!$F$2:$F$100),\" \")","v":0},{"$f":"IFERROR(LOOKUP(2,1/((O$1=Список!$C$2:$C$100)*(Список!$D$2:$D$100=$I5)),Список!$F$2:$F$100),\" \")","v":" "},{"$f":"IFERROR(LOOKUP(2,1/((P$1=Список!$C$2:$C$100)*(Список!$D$2:$D$100=$I5)),Список!$F$2:$F$100),\" \")","v":0},{"$f":"IFERROR(LOOKUP(2,1/((Q$1=Список!$C$2:$C$100)*(Список!$D$2:$D$100=$I5)),Список!$F$2:$F$100),\" \")","v":0},{"$f":"IFERROR(LOOKUP(2,1/((R$1=Список!$C$2:$C$100)*(Список!$D$2:$D$100=$I5)),Список!$F$2:$F$100),\" \")","v":" "},{"$f":"IFERROR(LOOKUP(2,1/((S$1=Список!$C$2:$C$100)*(Список!$D$2:$D$100=$I5)),Список!$F$2:$F$100),\" \")","v":0},{"$f":"IFERROR(LOOKUP(2,1/((T$1=Список!$C$2:$C$100)*(Список!$D$2:$D$100=$I5)),Список!$F$2:$F$100),\" \")","v":0},{"$f":"IFERROR(LOOKUP(2,1/((U$1=Список!$C$2:$C$100)*(Список!$D$2:$D$100=$I5)),Список!$F$2:$F$100),\" \")","v":" "},{"$f":"IFERROR(LOOKUP(2,1/((V$1=Список!$C$2:$C$100)*(Список!$D$2:$D$100=$I5)),Список!$F$2:$F$100),\" \")","v":0},{"$f":"IFERROR(LOOKUP(2,1/((W$1=Список!$C$2:$C$100)*(Список!$D$2:$D$100=$I5)),Список!$F$2:$F$100),\" \")","v":0},{"$f":"IFERROR(LOOKUP(2,1/((X$1=Список!$C$2:$C$100)*(Список!$D$2:$D$100=$I5)),Список!$F$2:$F$100),\" \")","v":" "},{"$f":"IFERROR(LOOKUP(2,1/((Y$1=Список!$C$2:$C$100)*(Список!$D$2:$D$100=$I5)),Список!$F$2:$F$100),\" \")","v":0},{"$f":"IFERROR(LOOKUP(2,1/((Z$1=Список!$C$2:$C$100)*(Список!$D$2:$D$100=$I5)),Список!$F$2:$F$100),\" \")","v":0},{"$f":"IFERROR(LOOKUP(2,1/((AA$1=Список!$C$2:$C$100)*(Список!$D$2:$D$100=$I5)),Список!$F$2:$F$100),\" \")","v":" "},{"$f":"IFERROR(LOOKUP(2,1/((AB$1=Список!$C$2:$C$100)*(Список!$D$2:$D$100=$I5)),Список!$F$2:$F$100),\" \")","v":0},{"$f":"IFERROR(LOOKUP(2,1/((AC$1=Список!$C$2:$C$100)*(Список!$D$2:$D$100=$I5)),Список!$F$2:$F$100),\" \")","v":0},{"$f":"IFERROR(LOOKUP(2,1/((AD$1=Список!$C$2:$C$100)*(Список!$D$2:$D$100=$I5)),Список!$F$2:$F$100),\" \")","v":" "},{"$f":"IFERROR(LOOKUP(2,1/((AE$1=Список!$C$2:$C$100)*(Список!$D$2:$D$100=$I5)),Список!$F$2:$F$100),\" \")","v":0},{"$f":"IFERROR(LOOKUP(2,1/((AF$1=Список!$C$2:$C$100)*(Список!$D$2:$D$100=$I5)),Список!$F$2:$F$100),\" \")","v":0},{"$f":"IFERROR(LOOKUP(2,1/((AG$1=Список!$C$2:$C$100)*(Список!$D$2:$D$100=$I5)),Список!$F$2:$F$100),\" \")","v":" "},{"$f":"IFERROR(LOOKUP(2,1/((AH$1=Список!$C$2:$C$100)*(Список!$D$2:$D$100=$I5)),Список!$F$2:$F$100),\" \")","v":0},{"$f":"IFERROR(LOOKUP(2,1/((AI$1=Список!$C$2:$C$100)*(Список!$D$2:$D$100=$I5)),Список!$F$2:$F$100),\" \")","v":0},{"$f":"IFERROR(LOOKUP(2,1/((AJ$1=Список!$C$2:$C$100)*(Список!$D$2:$D$100=$I5)),Список!$F$2:$F$100),\" \")","v":" "},{"$f":"IFERROR(LOOKUP(2,1/((AK$1=Список!$C$2:$C$100)*(Список!$D$2:$D$100=$I5)),Список!$F$2:$F$100),\" \")","v":0},{"$f":"IFERROR(LOOKUP(2,1/((AL$1=Список!$C$2:$C$100)*(Список!$D$2:$D$100=$I5)),Список!$F$2:$F$100),\" \")","v":0},{"$f":"IFERROR(LOOKUP(2,1/((AM$1=Список!$C$2:$C$100)*(Список!$D$2:$D$100=$I5)),Список!$F$2:$F$100),\" \")","v":" "},{"$f":"IFERROR(LOOKUP(2,1/((AN$1=Список!$C$2:$C$100)*(Список!$D$2:$D$100=$I5)),Список!$F$2:$F$100),\" \")","v":0},{"$f":"IFERROR(LOOKUP(2,1/((AO$1=Список!$C$2:$C$100)*(Список!$D$2:$D$100=$I5)),Список!$F$2:$F$100),\" \")","v":0},{"$f":"IFERROR(LOOKUP(2,1/((AP$1=Список!$C$2:$C$100)*(Список!$D$2:$D$100=$I5)),Список!$F$2:$F$100),\" \")","v":" "},{"$f":"IFERROR(LOOKUP(2,1/((AQ$1=Список!$C$2:$C$100)*(Список!$D$2:$D$100=$I5)),Список!$F$2:$F$100),\" \")","v":0},{"$f":"IFERROR(LOOKUP(2,1/((AR$1=Список!$C$2:$C$100)*(Список!$D$2:$D$100=$I5)),Список!$F$2:$F$100),\" \")","v":0},{"$f":"IFERROR(LOOKUP(2,1/((AS$1=Список!$C$2:$C$100)*(Список!$D$2:$D$100=$I5)),Список!$F$2:$F$100),\" \")","v":" "},{"$f":"IFERROR(LOOKUP(2,1/((AT$1=Список!$C$2:$C$100)*(Список!$D$2:$D$100=$I5)),Список!$F$2:$F$100),\" \")","v":0},{"$f":"IFERROR(LOOKUP(2,1/((AU$1=Список!$C$2:$C$100)*(Список!$D$2:$D$100=$I5)),Список!$F$2:$F$100),\" \")","v":0},{"$f":"IFERROR(LOOKUP(2,1/((AV$1=Список!$C$2:$C$100)*(Список!$D$2:$D$100=$I5)),Список!$F$2:$F$100),\" \")","v":" "}]
["\"Путь\" и \"Лоза\"",null,null,null,null,null,null,null,null,null,null,{"$f":"IFERROR(LOOKUP(2,1/((L$1=Список!$C$2:$C$100)*(Список!$D$2:$D$100=$I6)),Список!$F$2:$F$100),\" \")","v":" "},{"$f":"IFERROR(LOOKUP(2,1/((M$1=Список!$C$2:$C$100)*(Список!$D$2:$D$100=$I6)),Список!$F$2:$F$100),\" \")","v":0},{"$f":"IFERROR(LOOKUP(2,1/((N$1=Список!$C$2:$C$100)*(Список!$D$2:$D$100=$I6)),Список!$F$2:$F$100),\" \")","v":0},{"$f":"IFERROR(LOOKUP(2,1/((O$1=Список!$C$2:$C$100)*(Список!$D$2:$D$100=$I6)),Список!$F$2:$F$100),\" \")","v":" "},{"$f":"IFERROR(LOOKUP(2,1/((P$1=Список!$C$2:$C$100)*(Список!$D$2:$D$100=$I6)),Список!$F$2:$F$100),\" \")","v":0},{"$f":"IFERROR(LOOKUP(2,1/((Q$1=Список!$C$2:$C$100)*(Список!$D$2:$D$100=$I6)),Список!$F$2:$F$100),\" \")","v":0},{"$f":"IFERROR(LOOKUP(2,1/((R$1=Список!$C$2:$C$100)*(Список!$D$2:$D$100=$I6)),Список!$F$2:$F$100),\" \")","v":" "},{"$f":"IFERROR(LOOKUP(2,1/((S$1=Список!$C$2:$C$100)*(Список!$D$2:$D$100=$I6)),Список!$F$2:$F$100),\" \")","v":0},{"$f":"IFERROR(LOOKUP(2,1/((T$1=Список!$C$2:$C$100)*(Список!$D$2:$D$100=$I6)),Список!$F$2:$F$100),\" \")","v":0},{"$f":"IFERROR(LOOKUP(2,1/((U$1=Список!$C$2:$C$100)*(Список!$D$2:$D$100=$I6)),Список!$F$2:$F$100),\" \")","v":" "},{"$f":"IFERROR(LOOKUP(2,1/((V$1=Список!$C$2:$C$100)*(Список!$D$2:$D$100=$I6)),Список!$F$2:$F$100),\" \")","v":0},{"$f":"IFERROR(LOOKUP(2,1/((W$1=Список!$C$2:$C$100)*(Список!$D$2:$D$100=$I6)),Список!$F$2:$F$100),\" \")","v":0},{"$f":"IFERROR(LOOKUP(2,1/((X$1=Список!$C$2:$C$100)*(Список!$D$2:$D$100=$I6)),Список!$F$2:$F$100),\" \")","v":" "},{"$f":"IFERROR(LOOKUP(2,1/((Y$1=Список!$C$2:$C$100)*(Список!$D$2:$D$100=$I6)),Список!$F$2:$F$100),\" \")","v":0},{"$f":"IFERROR(LOOKUP(2,1/((Z$1=Список!$C$2:$C$100)*(Список!$D$2:$D$100=$I6)),Список!$F$2:$F$100),\" \")","v":0},{"$f":"IFERROR(LOOKUP(2,1/((AA$1=Список!$C$2:$C$100)*(Список!$D$2:$D$100=$I6)),Список!$F$2:$F$100),\" \")","v":" "},{"$f":"IFERROR(LOOKUP(2,1/((AB$1=Список!$C$2:$C$100)*(Список!$D$2:$D$100=$I6)),Список!$F$2:$F$100),\" \")","v":0},{"$f":"IFERROR(LOOKUP(2,1/((AC$1=Список!$C$2:$C$100)*(Список!$D$2:$D$100=$I6)),Список!$F$2:$F$100),\" \")","v":0},{"$f":"IFERROR(LOOKUP(2,1/((AD$1=Список!$C$2:$C$100)*(Список!$D$2:$D$100=$I6)),Список!$F$2:$F$100),\" \")","v":" "},{"$f":"IFERROR(LOOKUP(2,1/((AE$1=Список!$C$2:$C$100)*(Список!$D$2:$D$100=$I6)),Список!$F$2:$F$100),\" \")","v":0},{"$f":"IFERROR(LOOKUP(2,1/((AF$1=Список!$C$2:$C$100)*(Список!$D$2:$D$100=$I6)),Список!$F$2:$F$100),\" \")","v":0},{"$f":"IFERROR(LOOKUP(2,1/((AG$1=Список!$C$2:$C$100)*(Список!$D$2:$D$100=$I6)),Список!$F$2:$F$100),\" \")","v":" "},{"$f":"IFERROR(LOOKUP(2,1/((AH$1=Список!$C$2:$C$100)*(Список!$D$2:$D$100=$I6)),Список!$F$2:$F$100),\" \")","v":0},{"$f":"IFERROR(LOOKUP(2,1/((AI$1=Список!$C$2:$C$100)*(Список!$D$2:$D$100=$I6)),Список!$F$2:$F$100),\" \")","v":0},{"$f":"IFERROR(LOOKUP(2,1/((AJ$1=Список!$C$2:$C$100)*(Список!$D$2:$D$100=$I6)),Список!$F$2:$F$100),\" \")","v":" "},{"$f":"IFERROR(LOOKUP(2,1/((AK$1=Список!$C$2:$C$100)*(Список!$D$2:$D$100=$I6)),Список!$F$2:$F$100),\" \")","v":0},{"$f":"IFERROR(LOOKUP(2,1/((AL$1=Список!$C$2:$C$100)*(Список!$D$2:$D$100=$I6)),Список!$F$2:$F$100),\" \")","v":0},{"$f":"IFERROR(LOOKUP(2,1/((AM$1=Список!$C$2:$C$100)*(Список!$D$2:$D$100=$I6)),Список!$F$2:$F$100),\" \")","v":" "},{"$f":"IFERROR(LOOKUP(2,1/((AN$1=Список!$C$2:$C$100)*(Список!$D$2:$D$100=$I6)),Список!$F$2:$F$100),\" \")","v":0},{"$f":"IFERROR(LOOKUP(2,1/((AO$1=Список!$C$2:$C$100)*(Список!$D$2:$D$100=$I6)),Список!$F$2:$F$100),\" \")","v":0},{"$f":"IFERROR(LOOKUP(2,1/((AP$1=Список!$C$2:$C$100)*(Список!$D$2:$D$100=$I6)),Список!$F$2:$F$100),\" \")","v":" "},{"$f":"IFERROR(LOOKUP(2,1/((AQ$1=Список!$C$2:$C$100)*(Список!$D$2:$D$100=$I6)),Список!$F$2:$F$100),\" \")","v":0},{"$f":"IFERROR(LOOKUP(2,1/((AR$1=Список!$C$2:$C$100)*(Список!$D$2:$D$100=$I6)),Список!$F$2:$F$100),\" \")","v":0},{"$f":"IFERROR(LOOKUP(2,1/((AS$1=Список!$C$2:$C$100)*(Список!$D$2:$D$100=$I6)),Список!$F$2:$F$100),\" \")","v":" "},{"$f":"IFERROR(LOOKUP(2,1/((AT$1=Список!$C$2:$C$100)*(Список!$D$2:$D$100=$I6)),Список!$F$2:$F$100),\" \")","v":0},{"$f":"IFERROR(LOOKUP(2,1/((AU$1=Список!$C$2:$C$100)*(Список!$D$2:$D$100=$I6)),Список!$F$2:$F$100),\" \")","v":0},{"$f":"IFERROR(LOOKUP(2,1/((AV$1=Список!$C$2:$C$100)*(Список!$D$2:$D$100=$I6)),Список!$F$2:$F$100),\" \")","v":" "}]
[null,null,null,null,null,null,null,null,null,null,null,{"$f":"IFERROR(LOOKUP(2,1/((L$1=Список!$C$2:$C$100)*(Список!$D$2:$D$100=$I7)),Список!$F$2:$F$100),\" \")","v":" "},{"$f":"IFERROR(LOOKUP(2,1/((M$1=Список!$C$2:$C$100)*(Список!$D$2:$D$100=$I7)),Список!$F$2:$F$100),\" \")","v":0},{"$f":"IFERROR(LOOKUP(2,1/((N$1=Список!$C$2:$C$100)*(Список!$D$2:$D$100=$I7)),Список!$F$2:$F$100),\" \")","v":0},{"$f":"IFERROR(LOOKUP(2,1/((O$1=Список!$C$2:$C$100)*(Список!$D$2:$D$100=$I7)),Список!$F$2:$F$100),\" \")","v":" "},{"$f":"IFERROR(LOOKUP(2,1/((P$1=Список!$C$2:$C$100)*(Список!$D$2:$D$100=$I7)),Список!$F$2:$F$100),\" \")","v":0},{"$f":"IFERROR(LOOKUP(2,1/((Q$1=Список!$C$2:$C$100)*(Список!$D$2:$D$100=$I7)),Список!$F$2:$F$100),\" \")","v":0},{"$f":"IFERROR(LOOKUP(2,1/((R$1=Список!$C$2:$C$100)*(Список!$D$2:$D$100=$I7)),Список!$F$2:$F$100),\" \")","v":" "},{"$f":"IFERROR(LOOKUP(2,1/((S$1=Список!$C$2:$C$100)*(Список!$D$2:$D$100=$I7)),Список!$F$2:$F$100),\" \")","v":0},{"$f":"IFERROR(LOOKUP(2,1/((T$1=Список!$C$2:$C$100)*(Список!$D$2:$D$100=$I7)),Список!$F$2:$F$100),\" \")","v":0},{"$f":"IFERROR(LOOKUP(2,1/((U$1=Список!$C$2:$C$100)*(Список!$D$2:$D$100=$I7)),Список!$F$2:$F$100),\" \")","v":" "},{"$f":"IFERROR(LOOKUP(2,1/((V$1=Список!$C$2:$C$100)*(Список!$D$2:$D$100=$I7)),Список!$F$2:$F$100),\" \")","v":0},{"$f":"IFERROR(LOOKUP(2,1/((W$1=Список!$C$2:$C$100)*(Список!$D$2:$D$100=$I7)),Список!$F$2:$F$100),\" \")","v":0},{"$f":"IFERROR(LOOKUP(2,1/((X$1=Список!$C$2:$C$100)*(Список!$D$2:$D$100=$I7)),Список!$F$2:$F$100),\" \")","v":" "},{"$f":"IFERROR(LOOKUP(2,1/((Y$1=Список!$C$2:$C$100)*(Список!$D$2:$D$100=$I7)),Список!$F$2:$F$100),\" \")","v":0},{"$f":"IFERROR(LOOKUP(2,1/((Z$1=Список!$C$2:$C$100)*(Список!$D$2:$D$100=$I7)),Список!$F$2:$F$100),\" \")","v":0},{"$f":"IFERROR(LOOKUP(2,1/((AA$1=Список!$C$2:$C$100)*(Список!$D$2:$D$100=$I7)),Список!$F$2:$F$100),\" \")","v":" "},{"$f":"IFERROR(LOOKUP(2,1/((AB$1=Список!$C$2:$C$100)*(Список!$D$2:$D$100=$I7)),Список!$F$2:$F$100),\" \")","v":0},{"$f":"IFERROR(LOOKUP(2,1/((AC$1=Список!$C$2:$C$100)*(Список!$D$2:$D$100=$I7)),Список!$F$2:$F$100),\" \")","v":0},{"$f":"IFERROR(LOOKUP(2,1/((AD$1=Список!$C$2:$C$100)*(Список!$D$2:$D$100=$I7)),Список!$F$2:$F$100),\" \")","v":" "},{"$f":"IFERROR(LOOKUP(2,1/((AE$1=Список!$C$2:$C$100)*(Список!$D$2:$D$100=$I7)),Список!$F$2:$F$100),\" \")","v":0},{"$f":"IFERROR(LOOKUP(2,1/((AF$1=Список!$C$2:$C$100)*(Список!$D$2:$D$100=$I7)),Список!$F$2:$F$100),\" \")","v":0},{"$f":"IFERROR(LOOKUP(2,1/((AG$1=Список!$C$2:$C$100)*(Список!$D$2:$D$100=$I7)),Список!$F$2:$F$100),\" \")","v":" "},{"$f":"IFERROR(LOOKUP(2,1/((AH$1=Список!$C$2:$C$100)*(Список!$D$2:$D$100=$I7)),Список!$F$2:$F$100),\" \")","v":0},{"$f":"IFERROR(LOOKUP(2,1/((AI$1=Список!$C$2:$C$100)*(Список!$D$2:$D$100=$I7)),Список!$F$2:$F$100),\" \")","v":0},{"$f":"IFERROR(LOOKUP(2,1/((AJ$1=Список!$C$2:$C$100)*(Список!$D$2:$D$100=$I7)),Список!$F$2:$F$100),\" \")","v":" "},{"$f":"IFERROR(LOOKUP(2,1/((AK$1=Список!$C$2:$C$100)*(Список!$D$2:$D$100=$I7)),Список!$F$2:$F$100),\" \")","v":0},{"$f":"IFERROR(LOOKUP(2,1/((AL$1=Список!$C$2:$C$100)*(Список!$D$2:$D$100=$I7)),Список!$F$2:$F$100),\" \")","v":0},{"$f":"IFERROR(LOOKUP(2,1/((AM$1=Список!$C$2:$C$100)*(Список!$D$2:$D$100=$I7)),Список!$F$2:$F$100),\" \")","v":" "},{"$f":"IFERROR(LOOKUP(2,1/((AN$1=Список!$C$2:$C$100)*(Список!$D$2:$D$100=$I7)),Список!$F$2:$F$100),\" \")","v":0},{"$f":"IFERROR(LOOKUP(2,1/((AO$1=Список!$C$2:$C$100)*(Список!$D$2:$D$100=$I7)),Список!$F$2:$F$100),\" \")","v":0},{"$f":"IFERROR(LOOKUP(2,1/((AP$1=Список!$C$2:$C$100)*(Список!$D$2:$D$100=$I7)),Список!$F$2:$F$100),\" \")","v":" "},{"$f":"IFERROR(LOOKUP(2,1/((AQ$1=Список!$C$2:$C$100)*(Список!$D$2:$D$100=$I7)),Список!$F$2:$F$100),\" \")","v":0},{"$f":"IFERROR(LOOKUP(2,1/((AR$1=Список!$C$2:$C$100)*(Список!$D$2:$D$100=$I7)),Список!$F$2:$F$100),\" \")","v":0},{"$f":"IFERROR(LOOKUP(2,1/((AS$1=Список!$C$2:$C$100)*(Список!$D$2:$D$100=$I7)),Список!$F$2:$F$100),\" \")","v":" "},{"$f":"IFERROR(LOOKUP(2,1/((AT$1=Список!$C$2:$C$100)*(Список!$D$2:$D$100=$I7)),Список!$F$2:$F$100),\" \")","v":0},{"$f":"IFERROR(LOOKUP(2,1/((AU$1=Список!$C$2:$C$100)*(Список!$D$2:$D$100=$I7)),Список!$F$2:$F$100),\" \")","v":0},{"$f":"IFERROR(LOOKUP(2,1/((AV$1=Список!$C$2:$C$100)*(Список!$D$2:$D$100=$I7)),Список!$F$2:$F$100),\" \")","v":" "}]
[null,null,null,null,null,null,null,null,"Line_2",null,null,{"$f":"IFERROR(LOOKUP(2,1/((L$1=Список!$C$2:$C$100)*(Список!$D$2:$D$100=$I8)),Список!$F$2:$F$100),\" \")","v":"A002"},{"$f":"IFERROR(LOOKUP(2,1/((M$1=Список!$C$2:$C$100)*(Список!$D$2:$D$100=$I8)),Список!$F$2:$F$100),\" \")","v":" "},{"$f":"IFERROR(LOOKUP(2,1/((N$1=Список!$C$2:$C$100)*(Список!$D$2:$D$100=$I8)),Список!$F$2:$F$100),\" \")","v":" "},{"$f":"IFERROR(LOOKUP(2,1/((O$1=Список!$C$2:$C$100)*(Список!$D$2:$D$100=$I8)),Список!$F$2:$F$100),\" \")","v":"A002"},{"$f":"IFERROR(LOOKUP(2,1/((P$1=Список!$C$2:$C$100)*(Список!$D$2:$D$100=$I8)),Список!$F$2:$F$100),\" \")","v":" "},{"$f":"IFERROR(LOOKUP(2,1/((Q$1=Список!$C$2:$C$100)*(Список!$D$2:$D$100=$I8)),Список!$F$2:$F$100),\" \")","v":" "},{"$f":"IFERROR(LOOKUP(2,1/((R$1=Список!$C$2:$C$100)*(Список!$D$2:$D$100=$I8)),Список!$F$2:$F$100),\" \")","v":"A002"},{"$f":"IFERROR(LOOKUP(2,1/((S$1=Список!$C$2:$C$100)*(Список!$D$2:$D$100=$I8)),Список!$F$2:$F$100),\" \")","v":" "},{"$f":"IFERROR(LOOKUP(2,1/((T$1=Список!$C$2:$C$100)*(Список!$D$2:$D$100=$I8)),Список!$F$2:$F$100),\" \")","v":" "},{"$f":"IFERROR(LOOKUP(2,1/((U$1=Список!$C$2:$C$100)*(Список!$D$2:$D$100=$I8)),Список!$F$2:$F$100),\" \")","v":" "},{"$f":"IFERROR(LOOKUP(2,1/((V$1=Список!$C$2:$C$100)*(Список!$D$2:$D$100=$I8)),Список!$F$2:$F$100),\" \")","v":" "},{"$f":"IFERROR(LOOKUP(2,1/((W$1=Список!$C$2:$C$100)*(Список!$D$2:$D$100=$I8)),Список!$F$2:$F$100),\" \")","v":" "},{"$f":"IFERROR(LOOKUP(2,1/((X$1=Список!$C$2:$C$100)*(Список!$D$2:$D$100=$I8)),Список!$F$2:$F$100),\" \")","v":"A002"},{"$f":"IFERROR(LOOKUP(2,1/((Y$1=Список!$C$2:$C$100)*(Список!$D$2:$D$100=$I8)),Список!$F$2:$F$100),\" \")","v":" "},{"$f":"IFERROR(LOOKUP(2,1/((Z$1=Список!$C$2:$C$100)*(Список!$D$2:$D$100=$I8)),Список!$F$2:$F$100),\" \")","v":" "},{"$f":"IFERROR(LOOKUP(2,1/((AA$1=Список!$C$2:$C$100)*(Список!$D$2:$D$100=$I8)),Список!$F$2:$F$100),\" \")","v":" "},{"$f":"IFERROR(LOOKUP(2,1/((AB$1=Список!$C$2:$C$100)*(Список!$D$2:$D$100=$I8)),Список!$F$2:$F$100),\" \")","v":" "},{"$f":"IFERROR(LOOKUP(2,1/((AC$1=Список!$C$2:$C$100)*(Список!$D$2:$D$100=$I8)),Список!$F$2:$F$100),\" \")","v":" "},{"$f":"IFERROR(LOOKUP(2,1/((AD$1=Список!$C$2:$C$100)*(Список!$D$2:$D$100=$I8)),Список!$F$2:$F$100),\" \")","v":" "},{"$f":"IFERROR(LOOKUP(2,1/((AE$1=Список!$C$2:$C$100)*(Список!$D$2:$D$100=$I8)),Список!$F$2:$F$100),\" \")","v":" "},{"$f":"IFERROR(LOOKUP(2,1/((AF$1=Список!$C$2:$C$100)*(Список!$D$2:$D$100=$I8)),Список!$F$2:$F$100),\" \")","v":" "},{"$f":"IFERROR(LOOKUP(2,1/((AG$1=Список!$C$2:$C$100)*(Список!$D$2:$D$100=$I8)),Список!$F$2:$F$100),\" \")","v":" "},{"$f":"IFERROR(LOOKUP(2,1/((AH$1=Список!$C$2:$C$100)*(Список!$D$2:$D$100=$I8)),Список!$F$2:$F$100),\" \")","v":" "},{"$f":"IFERROR(LOOKUP(2,1/((AI$1=Список!$C$2:$C$100)*(Список!$D$2:$D$100=$I8)),Список!$F$2:$F$100),\" \")","v":" "},{"$f":"IFERROR(LOOKUP(2,1/((AJ$1=Список!$C$2:$C$100)*(Список!$D$2:$D$100=$I8)),Список!$F$2:$F$100),\" \")","v":"A002"},{"$f":"IFERROR(LOOKUP(2,1/((AK$1=Список!$C$2:$C$100)*(Список!$D$2:$D$100=$I8)),Список!$F$2:$F$100),\" \")","v":" "},{"$f":"IFERROR(LOOKUP(2,1/((AL$1=Список!$C$2:$C$100)*(Список!$D$2:$D$100=$I8)),Список!$F$2:$F$100),\" \")","v":" "},{"$f":"IFERROR(LOOKUP(2,1/((AM$1=Список!$C$2:$C$100)*(Список!$D$2:$D$100=$I8)),Список!$F$2:$F$100),\" \")","v":"A002"},{"$f":"IFERROR(LOOKUP(2,1/((AN$1=Список!$C$2:$C$100)*(Список!$D$2:$D$100=$I8)),Список!$F$2:$F$100),\" \")","v":" "},{"$f":"IFERROR(LOOKUP(2,1/((AO$1=Список!$C$2:$C$100)*(Список!$D$2:$D$100=$I8)),Список!$F$2:$F$100),\" \")","v":" "},{"$f":"IFERROR(LOOKUP(2,1/((AP$1=Список!$C$2:$C$100)*(Список!$D$2:$D$100=$I8)),Список!$F$2:$F$100),\" \")","v":"A002"},{"$f":"IFERROR(LOOKUP(2,1/((AQ$1=Список!$C$2:$C$100)*(Список!$D$2:$D$100=$I8)),Список!$F$2:$F$100),\" \")","v":" "},{"$f":"IFERROR(LOOKUP(2,1/((AR$1=Список!$C$2:$C$100)*(Список!$D$2:$D$100=$I8)),Список!$F$2:$F$100),\" \")","v":" "},{"$f":"IFERROR(LOOKUP(2,1/((AS$1=Список!$C$2:$C$100)*(Список!$D$2:$D$100=$I8)),Список!$F$2:$F$100),\" \")","v":"A002"},{"$f":"IFERROR(LOOKUP(2,1/((AT$1=Список!$C$2:$C$100)*(Список!$D$2:$D$100=$I8)),Список!$F$2:$F$100),\" \")","v":" "},{"$f":"IFERROR(LOOKUP(2,1/((AU$1=Список!$C$2:$C$100)*(Список!$D$2:$D$100=$I8)),Список!$F$2:$F$100),\" \")","v":" "},{"$f":"IFERROR(LOOKUP(2,1/((AV$1=Список!$C$2:$C$100)*(Список!$D$2:$D$100=$I8)),Список!$F$2:$F$100),\" \")","v":"A002"}]
[null,null,null,null,null,null,null,null,null,null,null,{"$f":"IFERROR(LOOKUP(2,1/((L$1=Список!$C$2:$C$100)*(Список!$D$2:$D$100=$I9)),Список!$F$2:$F$100),\" \")","v":" "},{"$f":"IFERROR(LOOKUP(2,1/((M$1=Список!$C$2:$C$100)*(Список!$D$2:$D$100=$I9)),Список!$F$2:$F$100),\" \")","v":0},{"$f":"IFERROR(LOOKUP(2,1/((N$1=Список!$C$2:$C$100)*(Список!$D$2:$D$100=$I9)),Список!$F$2:$F$100),\" \")","v":0},{"$f":"IFERROR(LOOKUP(2,1/((O$1=Список!$C$2:$C$100)*(Список!$D$2:$D$100=$I9)),Список!$F$2:$F$100),\" \")","v":" "},{"$f":"IFERROR(LOOKUP(2,1/((P$1=Список!$C$2:$C$100)*(Список!$D$2:$D$100=$I9)),Список!$F$2:$F$100),\" \")","v":0},{"$f":"IFERROR(LOOKUP(2,1/((Q$1=Список!$C$2:$C$100)*(Список!$D$2:$D$100=$I9)),Список!$F$2:$F$100),\" \")","v":0},{"$f":"IFERROR(LOOKUP(2,1/((R$1=Список!$C$2:$C$100)*(Список!$D$2:$D$100=$I9)),Список!$F$2:$F$100),\" \")","v":" "},{"$f":"IFERROR(LOOKUP(2,1/((S$1=Список!$C$2:$C$100)*(Список!$D$2:$D$100=$I9)),Список!$F$2:$F$100),\" \")","v":0},{"$f":"IFERROR(LOOKUP(2,1/((T$1=Список!$C$2:$C$100)*(Список!$D$2:$D$100=$I9)),Список!$F$2:$F$100),\" \")","v":0},{"$f":"IFERROR(LOOKUP(2,1/((U$1=Список!$C$2:$C$100)*(Список!$D$2:$D$100=$I9)),Список!$F$2:$F$100),\" \")","v":" "},{"$f":"IFERROR(LOOKUP(2,1/((V$1=Список!$C$2:$C$100)*(Список!$D$2:$D$100=$I9)),Список!$F$2:$F$100),\" \")","v":0},{"$f":"IFERROR(LOOKUP(2,1/((W$1=Список!$C$2:$C$100)*(Список!$D$2:$D$100=$I9)),Список!$F$2:$F$100),\" \")","v":0},{"$f":"IFERROR(LOOKUP(2,1/((X$1=Список!$C$2:$C$100)*(Список!$D$2:$D$100=$I9)),Список!$F$2:$F$100),\" \")","v":" "},{"$f":"IFERROR(LOOKUP(2,1/((Y$1=Список!$C$2:$C$100)*(Список!$D$2:$D$100=$I9)),Список!$F$2:$F$100),\" \")","v":0},{"$f":"IFERROR(LOOKUP(2,1/((Z$1=Список!$C$2:$C$100)*(Список!$D$2:$D$100=$I9)),Список!$F$2:$F$100),\" \")","v":0},{"$f":"IFERROR(LOOKUP(2,1/((AA$1=Список!$C$2:$C$100)*(Список!$D$2:$D$100=$I9)),Список!$F$2:$F$100),\" \")","v":" "},{"$f":"IFERROR(LOOKUP(2,1/((AB$1=Список!$C$2:$C$100)*(Список!$D$2:$D$100=$I9)),Список!$F$2:$F$100),\" \")","v":0},{"$f":"IFERROR(LOOKUP(2,1/((AC$1=Список!$C$2:$C$100)*(Список!$D$2:$D$100=$I9)),Список!$F$2:$F$100),\" \")","v":0},{"$f":"IFERROR(LOOKUP(2,1/((AD$1=Список!$C$2:$C$100)*(Список!$D$2:$D$100=$I9)),Список!$F$2:$F$100),\" \")","v":" "},{"$f":"IFERROR(LOOKUP(2,1/((AE$1=Список!$C$2:$C$100)*(Список!$D$2:$D$100=$I9)),Список!$F$2:$F$100),\" \")","v":0},{"$f":"IFERROR(LOOKUP(2,1/((AF$1=Список!$C$2:$C$100)*(Список!$D$2:$D$100=$I9)),Список!$F$2:$F$100),\" \")","v":0},{"$f":"IFERROR(LOOKUP(2,1/((AG$1=Список!$C$2:$C$100)*(Список!$D$2:$D$100=$I9)),Список!$F$2:$F$100),\" \")","v":" "},{"$f":"IFERROR(LOOKUP(2,1/((AH$1=Список!$C$2:$C$100)*(Список!$D$2:$D$100=$I9)),Список!$F$2:$F$100),\" \")","v":0},{"$f":"IFERROR(LOOKUP(2,1/((AI$1=Список!$C$2:$C$100)*(Список!$D$2:$D$100=$I9)),Список!$F$2:$F$100),\" \")","v":0},{"$f":"IFERROR(LOOKUP(2,1/((AJ$1=Список!$C$2:$C$100)*(Список!$D$2:$D$100=$I9)),Список!$F$2:$F$100),\" \")","v":" "},{"$f":"IFERROR(LOOKUP(2,1/((AK$1=Список!$C$2:$C$100)*(Список!$D$2:$D$100=$I9)),Список!$F$2:$F$100),\" \")","v":0},{"$f":"IFERROR(LOOKUP(2,1/((AL$1=Список!$C$2:$C$100)*(Список!$D$2:$D$100=$I9)),Список!$F$2:$F$100),\" \")","v":0},{"$f":"IFERROR(LOOKUP(2,1/((AM$1=Список!$C$2:$C$100)*(Список!$D$2:$D$100=$I9)),Список!$F$2:$F$100),\" \")","v":" "},{"$f":"IFERROR(LOOKUP(2,1/((AN$1=Список!$C$2:$C$100)*(Список!$D$2:$D$100=$I9)),Список!$F$2:$F$100),\" \")","v":0},{"$f":"IFERROR(LOOKUP(2,1/((AO$1=Список!$C$2:$C$100)*(Список!$D$2:$D$100=$I9)),Список!$F$2:$F$100),\" \")","v":0},{"$f":"IFERROR(LOOKUP(2,1/((AP$1=Список!$C$2:$C$100)*(Список!$D$2:$D$100=$I9)),Список!$F$2:$F$100),\" \")","v":" "},{"$f":"IFERROR(LOOKUP(2,1/((AQ$1=Список!$C$2:$C$100)*(Список!$D$2:$D$100=$I9)),Список!$F$2:$F$100),\" \")","v":0},{"$f":"IFERROR(LOOKUP(2,1/((AR$1=Список!$C$2:$C$100)*(Список!$D$2:$D$100=$I9)),Список!$F$2:$F$100),\" \")","v":0},{"$f":"IFERROR(LOOKUP(2,1/((AS$1=Список!$C$2:$C$100)*(Список!$D$2:$D$100=$I9)),Список!$F$2:$F$100),\" \")","v":" "},{"$f":"IFERROR(LOOKUP(2,1/((AT$1=Список!$C$2:$C$100)*(Список!$D$2:$D$100=$I9)),Список!$F$2:$F$100),\" \")","v":0},{"$f":"IFERROR(LOOKUP(2,1/((AU$1=Список!$C$2:$C$100)*(Список!$D$2:$D$100=$I9)),Список!$F$2:$F$100),\" \")","v":0},{"$f":"IFERROR(LOOKUP(2,1/((AV$1=Список!$C$2:$C$100)*(Список!$D$2:$D$100=$I9)),Список!$F$2:$F$100),\" \")","v":" "}]
[null,null,null,null,null,null,null,null,null,null,null,{"$f":"IFERROR(LOOKUP(2,1/((L$1=Список!$C$2:$C$100)*(Список!$D$2:$D$100=$I10)),Список!$F$2:$F$100),\" \")","v":" "},{"$f":"IFERROR(LOOKUP(2,1/((M$1=Список!$C$2:$C$100)*(Список!$D$2:$D$100=$I10)),Список!$F$2:$F$100),\" \")","v":0},{"$f":"IFERROR(LOOKUP(2,1/((N$1=Список!$C$2:$C$100)*(Список!$D$2:$D$100=$I10)),Список!$F$2:$F$100),\" \")","v":0},{"$f":"IFERROR(LOOKUP(2,1/((O$1=Список!$C$2:$C$100)*(Список!$D$2:$D$100=$I10)),Список!$F$2:$F$100),\" \")","v":" "},{"$f":"IFERROR(LOOKUP(2,1/((P$1=Список!$C$2:$C$100)*(Список!$D$2:$D$100=$I10)),Список!$F$2:$F$100),\" \")","v":0},{"$f":"IFERROR(LOOKUP(2,1/((Q$1=Список!$C$2:$C$100)*(Список!$D$2:$D$100=$I10)),Список!$F$2:$F$100),\" \")","v":0},{"$f":"IFERROR(LOOKUP(2,1/((R$1=Список!$C$2:$C$100)*(Список!$D$2:$D$100=$I10)),Список!$F$2:$F$100),\" \")","v":" "},{"$f":"IFERROR(LOOKUP(2,1/((S$1=Список!$C$2:$C$100)*(Список!$D$2:$D$100=$I10)),Список!$F$2:$F$100),\" \")","v":0},{"$f":"IFERROR(LOOKUP(2,1/((T$1=Список!$C$2:$C$100)*(Список!$D$2:$D$100=$I10)),Список!$F$2:$F$100),\" \")","v":0},{"$f":"IFERROR(LOOKUP(2,1/((U$1=Список!$C$2:$C$100)*(Список!$D$2:$D$100=$I10)),Список!$F$2:$F$100),\" \")","v":" "},{"$f":"IFERROR(LOOKUP(2,1/((V$1=Список!$C$2:$C$100)*(Список!$D$2:$D$100=$I10)),Список!$F$2:$F$100),\" \")","v":0},{"$f":"IFERROR(LOOKUP(2,1/((W$1=Список!$C$2:$C$100)*(Список!$D$2:$D$100=$I10)),Список!$F$2:$F$100),\" \")","v":0},{"$f":"IFERROR(LOOKUP(2,1/((X$1=Список!$C$2:$C$100)*(Список!$D$2:$D$100=$I10)),Список!$F$2:$F$100),\" \")","v":" "},{"$f":"IFERROR(LOOKUP(2,1/((Y$1=Список!$C$2:$C$100)*(Список!$D$2:$D$100=$I10)),Список!$F$2:$F$100),\" \")","v":0},{"$f":"IFERROR(LOOKUP(2,1/((Z$1=Список!$C$2:$C$100)*(Список!$D$2:$D$100=$I10)),Список!$F$2:$F$100),\" \")","v":0},{"$f":"IFERROR(LOOKUP(2,1/((AA$1=Список!$C$2:$C$100)*(Список!$D$2:$D$100=$I10)),Список!$F$2:$F$100),\" \")","v":" "},{"$f":"IFERROR(LOOKUP(2,1/((AB$1=Список!$C$2:$C$100)*(Список!$D$2:$D$100=$I10)),Список!$F$2:$F$100),\" \")","v":0},{"$f":"IFERROR(LOOKUP(2,1/((AC$1=Список!$C$2:$C$100)*(Список!$D$2:$D$100=$I10)),Список!$F$2:$F$100),\" \")","v":0},{"$f":"IFERROR(LOOKUP(2,1/((AD$1=Список!$C$2:$C$100)*(Список!$D$2:$D$100=$I10)),Список!$F$2:$F$100),\" \")","v":" "},{"$f":"IFERROR(LOOKUP(2,1/((AE$1=Список!$C$2:$C$100)*(Список!$D$2:$D$100=$I10)),Список!$F$2:$F$100),\" \")","v":0},{"$f":"IFERROR(LOOKUP(2,1/((AF$1=Список!$C$2:$C$100)*(Список!$D$2:$D$100=$I10)),Список!$F$2:$F$100),\" \")","v":0},{"$f":"IFERROR(LOOKUP(2,1/((AG$1=Список!$C$2:$C$100)*(Список!$D$2:$D$100=$I10)),Список!$F$2:$F$100),\" \")","v":" "},{"$f":"IFERROR(LOOKUP(2,1/((AH$1=Список!$C$2:$C$100)*(Список!$D$2:$D$100=$I10)),Список!$F$2:$F$100),\" \")","v":0},{"$f":"IFERROR(LOOKUP(2,1/((AI$1=Список!$C$2:$C$100)*(Список!$D$2:$D$100=$I10)),Список!$F$2:$F$100),\" \")","v":0},{"$f":"IFERROR(LOOKUP(2,1/((AJ$1=Список!$C$2:$C$100)*(Список!$D$2:$D$100=$I10)),Список!$F$2:$F$100),\" \")","v":" "},{"$f":"IFERROR(LOOKUP(2,1/((AK$1=Список!$C$2:$C$100)*(Список!$D$2:$D$100=$I10)),Список!$F$2:$F$100),\" \")","v":0},{"$f":"IFERROR(LOOKUP(2,1/((AL$1=Список!$C$2:$C$100)*(Список!$D$2:$D$100=$I10)),Список!$F$2:$F$100),\" \")","v":0},{"$f":"IFERROR(LOOKUP(2,1/((AM$1=Список!$C$2:$C$100)*(Список!$D$2:$D$100=$I10)),Список!$F$2:$F$100),\" \")","v":" "},{"$f":"IFERROR(LOOKUP(2,1/((AN$1=Список!$C$2:$C$100)*(Список!$D$2:$D$100=$I10)),Список!$F$2:$F$100),\" \")","v":0},{"$f":"IFERROR(LOOKUP(2,1/((AO$1=Список!$C$2:$C$100)*(Список!$D$2:$D$100=$I10)),Список!$F$2:$F$100),\" \")","v":0},{"$f":"IFERROR(LOOKUP(2,1/((AP$1=Список!$C$2:$C$100)*(Список!$D$2:$D$100=$I10)),Список!$F$2:$F$100),\" \")","v":" "},{"$f":"IFERROR(LOOKUP(2,1/((AQ$1=Список!$C$2:$C$100)*(Список!$D$2:$D$100=$I10)),Список!$F$2:$F$100),\" \")","v":0},{"$f":"IFERROR(LOOKUP(2,1/((AR$1=Список!$C$2:$C$100)*(Список!$D$2:$D$100=$I10)),Список!$F$2:$F$100),\" \")","v":0},{"$f":"IFERROR(LOOKUP(2,1/((AS$1=Список!$C$2:$C$100)*(Список!$D$2:$D$100=$I10)),Список!$F$2:$F$100),\" \")","v":" "},{"$f":"IFERROR(LOOKUP(2,1/((AT$1=Список!$C$2:$C$100)*(Список!$D$2:$D$100=$I10)),Список!$F$2:$F$100),\" \")","v":0},{"$f":"IFERROR(LOOKUP(2,1/((AU$1=Список!$C$2:$C$100)*(Список!$D$2:$D$100=$I10)),Список!$F$2:$F$100),\" \")","v":0},{"$f":"IFERROR(LOOKUP(2,1/((AV$1=Список!$C$2:$C$100)*(Список!$D$2:$D$100=$I10)),Список!$F$2:$F$100),\" \")","v":" "}]
[null,null,null,null,null,null,null,null,null,null,null,{"$f":"IFERROR(LOOKUP(2,1/((L$1=Список!$C$2:$C$100)*(Список!$D$2:$D$100=$I11)),Список!$F$2:$F$100),\" \")","v":" "},{"$f":"IFERROR(LOOKUP(2,1/((M$1=Список!$C$2:$C$100)*(Список!$D$2:$D$100=$I11)),Список!$F$2:$F$100),\" \")","v":0},{"$f":"IFERROR(LOOKUP(2,1/((N$1=Список!$C$2:$C$100)*(Список!$D$2:$D$100=$I11)),Список!$F$2:$F$100),\" \")","v":0},{"$f":"IFERROR(LOOKUP(2,1/((O$1=Список!$C$2:$C$100)*(Список!$D$2:$D$100=$I11)),Список!$F$2:$F$100),\" \")","v":" "},{"$f":"IFERROR(LOOKUP(2,1/((P$1=Список!$C$2:$C$100)*(Список!$D$2:$D$100=$I11)),Список!$F$2:$F$100),\" \")","v":0},{"$f":"IFERROR(LOOKUP(2,1/((Q$1=Список!$C$2:$C$100)*(Список!$D$2:$D$100=$I11)),Список!$F$2:$F$100),\" \")","v":0},{"$f":"IFERROR(LOOKUP(2,1/((R$1=Список!$C$2:$C$100)*(Список!$D$2:$D$100=$I11)),Список!$F$2:$F$100),\" \")","v":" "},{"$f":"IFERROR(LOOKUP(2,1/((S$1=Список!$C$2:$C$100)*(Список!$D$2:$D$100=$I11)),Список!$F$2:$F$100),\" \")","v":0},{"$f":"IFERROR(LOOKUP(2,1/((T$1=Список!$C$2:$C$100)*(Список!$D$2:$D$100=$I11)),Список!$F$2:$F$100),\" \")","v":0},{"$f":"IFERROR(LOOKUP(2,1/((U$1=Список!$C$2:$C$100)*(Список!$D$2:$D$100=$I11)),Список!$F$2:$F$100),\" \")","v":" "},{"$f":"IFERROR(LOOKUP(2,1/((V$1=Список!$C$2:$C$100)*(Список!$D$2:$D$100=$I11)),Список!$F$2:$F$100),\" \")","v":0},{"$f":"IFERROR(LOOKUP(2,1/((W$1=Список!$C$2:$C$100)*(Список!$D$2:$D$100=$I11)),Список!$F$2:$F$100),\" \")","v":0},{"$f":"IFERROR(LOOKUP(2,1/((X$1=Список!$C$2:$C$100)*(Список!$D$2:$D$100=$I11)),Список!$F$2:$F$100),\" \")","v":" "},{"$f":"IFERROR(LOOKUP(2,1/((Y$1=Список!$C$2:$C$100)*(Список!$D$2:$D$100=$I11)),Список!$F$2:$F$100),\" \")","v":0},{"$f":"IFERROR(LOOKUP(2,1/((Z$1=Список!$C$2:$C$100)*(Список!$D$2:$D$100=$I11)),Список!$F$2:$F$100),\" \")","v":0},{"$f":"IFERROR(LOOKUP(2,1/((AA$1=Список!$C$2:$C$100)*(Список!$D$2:$D$100=$I11)),Список!$F$2:$F$100),\" \")","v":" "},{"$f":"IFERROR(LOOKUP(2,1/((AB$1=Список!$C$2:$C$100)*(Список!$D$2:$D$100=$I11)),Список!$F$2:$F$100),\" \")","v":0},{"$f":"IFERROR(LOOKUP(2,1/((AC$1=Список!$C$2:$C$100)*(Список!$D$2:$D$100=$I11)),Список!$F$2:$F$100),\" \")","v":0},{"$f":"IFERROR(LOOKUP(2,1/((AD$1=Список!$C$2:$C$100)*(Список!$D$2:$D$100=$I11)),Список!$F$2:$F$100),\" \")","v":" "},{"$f":"IFERROR(LOOKUP(2,1/((AE$1=Список!$C$2:$C$100)*(Список!$D$2:$D$100=$I11)),Список!$F$2:$F$100),\" \")","v":0},{"$f":"IFERROR(LOOKUP(2,1/((AF$1=Список!$C$2:$C$100)*(Список!$D$2:$D$100=$I11)),Список!$F$2:$F$100),\" \")","v":0},{"$f":"IFERROR(LOOKUP(2,1/((AG$1=Список!$C$2:$C$100)*(Список!$D$2:$D$100=$I11)),Список!$F$2:$F$100),\" \")","v":" "},{"$f":"IFERROR(LOOKUP(2,1/((AH$1=Список!$C$2:$C$100)*(Список!$D$2:$D$100=$I11)),Список!$F$2:$F$100),\" \")","v":0},{"$f":"IFERROR(LOOKUP(2,1/((AI$1=Список!$C$2:$C$100)*(Список!$D$2:$D$100=$I11)),Список!$F$2:$F$100),\" \")","v":0},{"$f":"IFERROR(LOOKUP(2,1/((AJ$1=Список!$C$2:$C$100)*(Список!$D$2:$D$100=$I11)),Список!$F$2:$F$100),\" \")","v":" "},{"$f":"IFERROR(LOOKUP(2,1/((AK$1=Список!$C$2:$C$100)*(Список!$D$2:$D$100=$I11)),Список!$F$2:$F$100),\" \")","v":0},{"$f":"IFERROR(LOOKUP(2,1/((AL$1=Список!$C$2:$C$100)*(Список!$D$2:$D$100=$I11)),Список!$F$2:$F$100),\" \")","v":0},{"$f":"IFERROR(LOOKUP(2,1/((AM$1=Список!$C$2:$C$100)*(Список!$D$2:$D$100=$I11)),Список!$F$2:$F$100),\" \")","v":" "},{"$f":"IFERROR(LOOKUP(2,1/((AN$1=Список!$C$2:$C$100)*(Список!$D$2:$D$100=$I11)),Список!$F$2:$F$100),\" \")","v":0},{"$f":"IFERROR(LOOKUP(2,1/((AO$1=Список!$C$2:$C$100)*(Список!$D$2:$D$100=$I11)),Список!$F$2:$F$100),\" \")","v":0},{"$f":"IFERROR(LOOKUP(2,1/((AP$1=Список!$C$2:$C$100)*(Список!$D$2:$D$100=$I11)),Список!$F$2:$F$100),\" \")","v":" "},{"$f":"IFERROR(LOOKUP(2,1/((AQ$1=Список!$C$2:$C$100)*(Список!$D$2:$D$100=$I11)),Список!$F$2:$F$100),\" \")","v":0},{"$f":"IFERROR(LOOKUP(2,1/((AR$1=Список!$C$2:$C$100)*(Список!$D$2:$D$100=$I11)),Список!$F$2:$F$100),\" \")","v":0},{"$f":"IFERROR(LOOKUP(2,1/((AS$1=Список!$C$2:$C$100)*(Список!$D$2:$D$100=$I11)),Список!$F$2:$F$100),\" \")","v":" "},{"$f":"IFERROR(LOOKUP(2,1/((AT$1=Список!$C$2:$C$100)*(Список!$D$2:$D$100=$I11)),Список!$F$2:$F$100),\" \")","v":0},{"$f":"IFERROR(LOOKUP(2,1/((AU$1=Список!$C$2:$C$100)*(Список!$D$2:$D$100=$I11)),Список!$F$2:$F$100),\" \")","v":0},{"$f":"IFERROR(LOOKUP(2,1/((AV$1=Список!$C$2:$C$100)*(Список!$D$2:$D$100=$I11)),Список!$F$2:$F$100),\" \")","v":" "}]
[null,null,null,null,null,null,null,null,null,null,null,{"$f":"IFERROR(LOOKUP(2,1/((L$1=Список!$C$2:$C$100)*(Список!$D$2:$D$100=$I12)),Список!$F$2:$F$100),\" \")","v":" "},{"$f":"IFERROR(LOOKUP(2,1/((M$1=Список!$C$2:$C$100)*(Список!$D$2:$D$100=$I12)),Список!$F$2:$F$100),\" \")","v":0},{"$f":"IFERROR(LOOKUP(2,1/((N$1=Список!$C$2:$C$100)*(Список!$D$2:$D$100=$I12)),Список!$F$2:$F$100),\" \")","v":0},{"$f":"IFERROR(LOOKUP(2,1/((O$1=Список!$C$2:$C$100)*(Список!$D$2:$D$100=$I12)),Список!$F$2:$F$100),\" \")","v":" "},{"$f":"IFERROR(LOOKUP(2,1/((P$1=Список!$C$2:$C$100)*(Список!$D$2:$D$100=$I12)),Список!$F$2:$F$100),\" \")","v":0},{"$f":"IFERROR(LOOKUP(2,1/((Q$1=Список!$C$2:$C$100)*(Список!$D$2:$D$100=$I12)),Список!$F$2:$F$100),\" \")","v":0},{"$f":"IFERROR(LOOKUP(2,1/((R$1=Список!$C$2:$C$100)*(Список!$D$2:$D$100=$I12)),Список!$F$2:$F$100),\" \")","v":" "},{"$f":"IFERROR(LOOKUP(2,1/((S$1=Список!$C$2:$C$100)*(Список!$D$2:$D$100=$I12)),Список!$F$2:$F$100),\" \")","v":0},{"$f":"IFERROR(LOOKUP(2,1/((T$1=Список!$C$2:$C$100)*(Список!$D$2:$D$100=$I12)),Список!$F$2:$F$100),\" \")","v":0},{"$f":"IFERROR(LOOKUP(2,1/((U$1=Список!$C$2:$C$100)*(Список!$D$2:$D$100=$I12)),Список!$F$2:$F$100),\" \")","v":" "},{"$f":"IFERROR(LOOKUP(2,1/((V$1=Список!$C$2:$C$100)*(Список!$D$2:$D$100=$I12)),Список!$F$2:$F$100),\" \")","v":0},{"$f":"IFERROR(LOOKUP(2,1/((W$1=Список!$C$2:$C$100)*(Список!$D$2:$D$100=$I12)),Список!$F$2:$F$100),\" \")","v":0},{"$f":"IFERROR(LOOKUP(2,1/((X$1=Список!$C$2:$C$100)*(Список!$D$2:$D$100=$I12)),Список!$F$2:$F$100),\" \")","v":" "},{"$f":"IFERROR(LOOKUP(2,1/((Y$1=Список!$C$2:$C$100)*(Список!$D$2:$D$100=$I12)),Список!$F$2:$F$100),\" \")","v":0},{"$f":"IFERROR(LOOKUP(2,1/((Z$1=Список!$C$2:$C$100)*(Список!$D$2:$D$100=$I12)),Список!$F$2:$F$100),\" \")","v":0},{"$f":"IFERROR(LOOKUP(2,1/((AA$1=Список!$C$2:$C$100)*(Список!$D$2:$D$100=$I12)),Список!$F$2:$F$100),\" \")","v":" "},{"$f":"IFERROR(LOOKUP(2,1/((AB$1=Список!$C$2:$C$100)*(Список!$D$2:$D$100=$I12)),Список!$F$2:$F$100),\" \")","v":0},{"$f":"IFERROR(LOOKUP(2,1/((AC$1=Список!$C$2:$C$100)*(Список!$D$2:$D$100=$I12)),Список!$F$2:$F$100),\" \")","v":0},{"$f":"IFERROR(LOOKUP(2,1/((AD$1=Список!$C$2:$C$100)*(Список!$D$2:$D$100=$I12)),Список!$F$2:$F$100),\" \")","v":" "},{"$f":"IFERROR(LOOKUP(2,1/((AE$1=Список!$C$2:$C$100)*(Список!$D$2:$D$100=$I12)),Список!$F$2:$F$100),\" \")","v":0},{"$f":"IFERROR(LOOKUP(2,1/((AF$1=Список!$C$2:$C$100)*(Список!$D$2:$D$100=$I12)),Список!$F$2:$F$100),\" \")","v":0},{"$f":"IFERROR(LOOKUP(2,1/((AG$1=Список!$C$2:$C$100)*(Список!$D$2:$D$100=$I12)),Список!$F$2:$F$100),\" \")","v":" "},{"$f":"IFERROR(LOOKUP(2,1/((AH$1=Список!$C$2:$C$100)*(Список!$D$2:$D$100=$I12)),Список!$F$2:$F$100),\" \")","v":0},{"$f":"IFERROR(LOOKUP(2,1/((AI$1=Список!$C$2:$C$100)*(Список!$D$2:$D$100=$I12)),Список!$F$2:$F$100),\" \")","v":0},{"$f":"IFERROR(LOOKUP(2,1/((AJ$1=Список!$C$2:$C$100)*(Список!$D$2:$D$100=$I12)),Список!$F$2:$F$100),\" \")","v":" "},{"$f":"IFERROR(LOOKUP(2,1/((AK$1=Список!$C$2:$C$100)*(Список!$D$2:$D$100=$I12)),Список!$F$2:$F$100),\" \")","v":0},{"$f":"IFERROR(LOOKUP(2,1/((AL$1=Список!$C$2:$C$100)*(Список!$D$2:$D$100=$I12)),Список!$F$2:$F$100),\" \")","v":0},{"$f":"IFERROR(LOOKUP(2,1/((AM$1=Список!$C$2:$C$100)*(Список!$D$2:$D$100=$I12)),Список!$F$2:$F$100),\" \")","v":" "},{"$f":"IFERROR(LOOKUP(2,1/((AN$1=Список!$C$2:$C$100)*(Список!$D$2:$D$100=$I12)),Список!$F$2:$F$100),\" \")","v":0},{"$f":"IFERROR(LOOKUP(2,1/((AO$1=Список!$C$2:$C$100)*(Список!$D$2:$D$100=$I12)),Список!$F$2:$F$100),\" \")","v":0},{"$f":"IFERROR(LOOKUP(2,1/((AP$1=Список!$C$2:$C$100)*(Список!$D$2:$D$100=$I12)),Список!$F$2:$F$100),\" \")","v":" "},{"$f":"IFERROR(LOOKUP(2,1/((AQ$1=Список!$C$2:$C$100)*(Список!$D$2:$D$100=$I12)),Список!$F$2:$F$100),\" \")","v":0},{"$f":"IFERROR(LOOKUP(2,1/((AR$1=Список!$C$2:$C$100)*(Список!$D$2:$D$100=$I12)),Список!$F$2:$F$100),\" \")","v":0},{"$f":"IFERROR(LOOKUP(2,1/((AS$1=Список!$C$2:$C$100)*(Список!$D$2:$D$100=$I12)),Список!$F$2:$F$100),\" \")","v":" "},{"$f":"IFERROR(LOOKUP(2,1/((AT$1=Список!$C$2:$C$100)*(Список!$D$2:$D$100=$I12)),Список!$F$2:$F$100),\" \")","v":0},{"$f":"IFERROR(LOOKUP(2,1/((AU$1=Список!$C$2:$C$100)*(Список!$D$2:$D$100=$I12)),Список!$F$2:$F$100),\" \")","v":0},{"$f":"IFERROR(LOOKUP(2,1/((AV$1=Список!$C$2:$C$100)*(Список!$D$2:$D$100=$I12)),Список!$F$2:$F$100),\" \")","v":" "}]
[null,null,null,null,null,null,null,null,"Line_3",null,null,{"$f":"IFERROR(LOOKUP(2,1/((L$1=Список!$C$2:$C$100)*(Список!$D$2:$D$100=$I13)),Список!$F$2:$F$100),\" \")","v":" "},{"$f":"IFERROR(LOOKUP(2,1/((M$1=Список!$C$2:$C$100)*(Список!$D$2:$D$100=$I13)),Список!$F$2:$F$100),\" \")","v":" "},{"$f":"IFERROR(LOOKUP(2,1/((N$1=Список!$C$2:$C$100)*(Список!$D$2:$D$100=$I13)),Список!$F$2:$F$100),\" \")","v":" "},{"$f":"IFERROR(LOOKUP(2,1/((O$1=Список!$C$2:$C$100)*(Список!$D$2:$D$100=$I13)),Список!$F$2:$F$100),\" \")","v":" "},{"$f":"IFERROR(LOOKUP(2,1/((P$1=Список!$C$2:$C$100)*(Список!$D$2:$D$100=$I13)),Список!$F$2:$F$100),\" \")","v":" "},{"$f":"IFERROR(LOOKUP(2,1/((Q$1=Список!$C$2:$C$100)*(Список!$D$2:$D$100=$I13)),Список!$F$2:$F$100),\" \")","v":" "},{"$f":"IFERROR(LOOKUP(2,1/((R$1=Список!$C$2:$C$100)*(Список!$D$2:$D$100=$I13)),Список!$F$2:$F$100),\" \")","v":" "},{"$f":"IFERROR(LOOKUP(2,1/((S$1=Список!$C$2:$C$100)*(Список!$D$2:$D$100=$I13)),Список!$F$2:$F$100),\" \")","v":" "},{"$f":"IFERROR(LOOKUP(2,1/((T$1=Список!$C$2:$C$100)*(Список!$D$2:$D$100=$I13)),Список!$F$2:$F$100),\" \")","v":" "},{"$f":"IFERROR(LOOKUP(2,1/((U$1=Список!$C$2:$C$100)*(Список!$D$2:$D$100=$I13)),Список!$F$2:$F$100),\" \")","v":" "},{"$f":"IFERROR(LOOKUP(2,1/((V$1=Список!$C$2:$C$100)*(Список!$D$2:$D$100=$I13)),Список!$F$2:$F$100),\" \")","v":" "},{"$f":"IFERROR(LOOKUP(2,1/((W$1=Список!$C$2:$C$100)*(Список!$D$2:$D$100=$I13)),Список!$F$2:$F$100),\" \")","v":" "},{"$f":"IFERROR(LOOKUP(2,1/((X$1=Список!$C$2:$C$100)*(Список!$D$2:$D$100=$I13)),Список!$F$2:$F$100),\" \")","v":" "},{"$f":"IFERROR(LOOKUP(2,1/((Y$1=Список!$C$2:$C$100)*(Список!$D$2:$D$100=$I13)),Список!$F$2:$F$100),\" \")","v":" "},{"$f":"IFERROR(LOOKUP(2,1/((Z$1=Список!$C$2:$C$100)*(Список!$D$2:$D$100=$I13)),Список!$F$2:$F$100),\" \")","v":" "},{"$f":"IFERROR(LOOKUP(2,1/((AA$1=Список!$C$2:$C$100)*(Список!$D$2:$D$100=$I13)),Список!$F$2:$F$100),\" \")","v":" "},{"$f":"IFERROR(LOOKUP(2,1/((AB$1=Список!$C$2:$C$100)*(Список!$D$2:$D$100=$I13)),Список!$F$2:$F$100),\" \")","v":" "},{"$f":"IFERROR(LOOKUP(2,1/((AC$1=Список!$C$2:$C$100)*(Список!$D$2:$D$100=$I13)),Список!$F$2:$F$100),\" \")","v":" "},{"$f":"IFERROR(LOOKUP(2,1/((AD$1=Список!$C$2:$C$100)*(Список!$D$2:$D$100=$I13)),Список!$F$2:$F$100),\" \")","v":" "},{"$f":"IFERROR(LOOKUP(2,1/((AE$1=Список!$C$2:$C$100)*(Список!$D$2:$D$100=$I13)),Список!$F$2:$F$100),\" \")","v":" "},{"$f":"IFERROR(LOOKUP(2,1/((AF$1=Список!$C$2:$C$100)*(Список!$D$2:$D$100=$I13)),Список!$F$2:$F$100),\" \")","v":" "},{"$f":"IFERROR(LOOKUP(2,1/((AG$1=Список!$C$2:$C$100)*(Список!$D$2:$D$100=$I13)),Список!$F$2:$F$100),\" \")","v":" "},{"$f":"IFERROR(LOOKUP(2,1/((AH$1=Список!$C$2:$C$100)*(Список!$D$2:$D$100=$I13)),Список!$F$2:$F$100),\" \")","v":" "},{"$f":"IFERROR(LOOKUP(2,1/((AI$1=Список!$C$2:$C$100)*(Список!$D$2:$D$100=$I13)),Список!$F$2:$F$100),\" \")","v":" "},{"$f":"IFERROR(LOOKUP(2,1/((AJ$1=Список!$C$2:$C$100)*(Список!$D$2:$D$100=$I13)),Список!$F$2:$F$100),\" \")","v":" "},{"$f":"IFERROR(LOOKUP(2,1/((AK$1=Список!$C$2:$C$100)*(Список!$D$2:$D$100=$I13)),Список!$F$2:$F$100),\" \")","v":" "},{"$f":"IFERROR(LOOKUP(2,1/((AL$1=Список!$C$2:$C$100)*(Список!$D$2:$D$100=$I13)),Список!$F$2:$F$100),\" \")","v":" "},{"$f":"IFERROR(LOOKUP(2,1/((AM$1=Список!$C$2:$C$100)*(Список!$D$2:$D$100=$I13)),Список!$F$2:$F$100),\" \")","v":" "},{"$f":"IFERROR(LOOKUP(2,1/((AN$1=Список!$C$2:$C$100)*(Список!$D$2:$D$100=$I13)),Список!$F$2:$F$100),\" \")","v":" "},{"$f":"IFERROR(LOOKUP(2,1/((AO$1=Список!$C$2:$C$100)*(Список!$D$2:$D$100=$I13)),Список!$F$2:$F$100),\" \")","v":" "},{"$f":"IFERROR(LOOKUP(2,1/((AP$1=Список!$C$2:$C$100)*(Список!$D$2:$D$100=$I13)),Список!$F$2:$F$100),\" \")","v":" "},{"$f":"IFERROR(LOOKUP(2,1/((AQ$1=Список!$C$2:$C$100)*(Список!$D$2:$D$100=$I13)),Список!$F$2:$F$100),\" \")","v":" "},{"$f":"IFERROR(LOOKUP(2,1/((AR$1=Список!$C$2:$C$100)*(Список!$D$2:$D$100=$I13)),Список!$F$2:$F$100),\" \")","v":" "},{"$f":"IFERROR(LOOKUP(2,1/((AS$1=Список!$C$2:$C$100)*(Список!$D$2:$D$100=$I13)),Список!$F$2:$F$100),\" \")","v":" "},{"$f":"IFERROR(LOOKUP(2,1/((AT$1=Список!$C$2:$C$100)*(Список!$D$2:$D$100=$I13)),Список!$F$2:$F$100),\" \")","v":" "},{"$f":"IFERROR(LOOKUP(2,1/((AU$1=Список!$C$2:$C$100)*(Список!$D$2:$D$100=$I13)),Список!$F$2:$F$100),\" \")","v":" "},{"$f":"IFERROR(LOOKUP(2,1/((AV$1=Список!$C$2:$C$100)*(Список!$D$2:$D$100=$I13)),Список!$F$2:$F$100),\" \")","v":" "}]
[null,null,null,null,null,null,null,null,null,null,null,{"$f":"IFERROR(LOOKUP(2,1/((L$1=Список!$C$2:$C$100)*(Список!$D$2:$D$100=$I14)),Список!$F$2:$F$100),\" \")","v":" "},{"$f":"IFERROR(LOOKUP(2,1/((M$1=Список!$C$2:$C$100)*(Список!$D$2:$D$100=$I14)),Список!$F$2:$F$100),\" \")","v":0},{"$f":"IFERROR(LOOKUP(2,1/((N$1=Список!$C$2:$C$100)*(Список!$D$2:$D$100=$I14)),Список!$F$2:$F$100),\" \")","v":0},{"$f":"IFERROR(LOOKUP(2,1/((O$1=Список!$C$2:$C$100)*(Список!$D$2:$D$100=$I14)),Список!$F$2:$F$100),\" \")","v":" "},{"$f":"IFERROR(LOOKUP(2,1/((P$1=Список!$C$2:$C$100)*(Список!$D$2:$D$100=$I14)),Список!$F$2:$F$100),\" \")","v":0},{"$f":"IFERROR(LOOKUP(2,1/((Q$1=Список!$C$2:$C$100)*(Список!$D$2:$D$100=$I14)),Список!$F$2:$F$100),\" \")","v":0},{"$f":"IFERROR(LOOKUP(2,1/((R$1=Список!$C$2:$C$100)*(Список!$D$2:$D$100=$I14)),Список!$F$2:$F$100),\" \")","v":" "},{"$f":"IFERROR(LOOKUP(2,1/((S$1=Список!$C$2:$C$100)*(Список!$D$2:$D$100=$I14)),Список!$F$2:$F$100),\" \")","v":0},{"$f":"IFERROR(LOOKUP(2,1/((T$1=Список!$C$2:$C$100)*(Список!$D$2:$D$100=$I14)),Список!$F$2:$F$100),\" \")","v":0},{"$f":"IFERROR(LOOKUP(2,1/((U$1=Список!$C$2:$C$100)*(Список!$D$2:$D$100=$I14)),Список!$F$2:$F$100),\" \")","v":" "},{"$f":"IFERROR(LOOKUP(2,1/((V$1=Список!$C$2:$C$100)*(Список!$D$2:$D$100=$I14)),Список!$F$2:$F$100),\" \")","v":0},{"$f":"IFERROR(LOOKUP(2,1/((W$1=Список!$C$2:$C$100)*(Список!$D$2:$D$100=$I14)),Список!$F$2:$F$100),\" \")","v":0},{"$f":"IFERROR(LOOKUP(2,1/((X$1=Список!$C$2:$C$100)*(Список!$D$2:$D$100=$I14)),Список!$F$2:$F$100),\" \")","v":" "},{"$f":"IFERROR(LOOKUP(2,1/((Y$1=Список!$C$2:$C$100)*(Список!$D$2:$D$100=$I14)),Список!$F$2:$F$100),\" \")","v":0},{"$f":"IFERROR(LOOKUP(2,1/((Z$1=Список!$C$2:$C$100)*(Список!$D$2:$D$100=$I14)),Список!$F$2:$F$100),\" \")","v":0},{"$f":"IFERROR(LOOKUP(2,1/((AA$1=Список!$C$2:$C$100)*(Список!$D$2:$D$100=$I14)),Список!$F$2:$F$100),\" \")","v":" "},{"$f":"IFERROR(LOOKUP(2,1/((AB$1=Список!$C$2:$C$100)*(Список!$D$2:$D$100=$I14)),Список!$F$2:$F$100),\" \")","v":0},{"$f":"IFERROR(LOOKUP(2,1/((AC$1=Список!$C$2:$C$100)*(Список!$D$2:$D$100=$I14)),Список!$F$2:$F$100),\" \")","v":0},{"$f":"IFERROR(LOOKUP(2,1/((AD$1=Список!$C$2:$C$100)*(Список!$D$2:$D$100=$I14)),Список!$F$2:$F$100),\" \")","v":" "},{"$f":"IFERROR(LOOKUP(2,1/((AE$1=Список!$C$2:$C$100)*(Список!$D$2:$D$100=$I14)),Список!$F$2:$F$100),\" \")","v":0},{"$f":"IFERROR(LOOKUP(2,1/((AF$1=Список!$C$2:$C$100)*(Список!$D$2:$D$100=$I14)),Список!$F$2:$F$100),\" \")","v":0},{"$f":"IFERROR(LOOKUP(2,1/((AG$1=Список!$C$2:$C$100)*(Список!$D$2:$D$100=$I14)),Список!$F$2:$F$100),\" \")","v":" "},{"$f":"IFERROR(LOOKUP(2,1/((AH$1=Список!$C$2:$C$100)*(Список!$D$2:$D$100=$I14)),Список!$F$2:$F$100),\" \")","v":0},{"$f":"IFERROR(LOOKUP(2,1/((AI$1=Список!$C$2:$C$100)*(Список!$D$2:$D$100=$I14)),Список!$F$2:$F$100),\" \")","v":0},{"$f":"IFERROR(LOOKUP(2,1/((AJ$1=Список!$C$2:$C$100)*(Список!$D$2:$D$100=$I14)),Список!$F$2:$F$100),\" \")","v":" "},{"$f":"IFERROR(LOOKUP(2,1/((AK$1=Список!$C$2:$C$100)*(Список!$D$2:$D$100=$I14)),Список!$F$2:$F$100),\" \")","v":0},{"$f":"IFERROR(LOOKUP(2,1/((AL$1=Список!$C$2:$C$100)*(Список!$D$2:$D$100=$I14)),Список!$F$2:$F$100),\" \")","v":0},{"$f":"IFERROR(LOOKUP(2,1/((AM$1=Список!$C$2:$C$100)*(Список!$D$2:$D$100=$I14)),Список!$F$2:$F$100),\" \")","v":" "},{"$f":"IFERROR(LOOKUP(2,1/((AN$1=Список!$C$2:$C$100)*(Список!$D$2:$D$100=$I14)),Список!$F$2:$F$100),\" \")","v":0},{"$f":"IFERROR(LOOKUP(2,1/((AO$1=Список!$C$2:$C$100)*(Список!$D$2:$D$100=$I14)),Список!$F$2:$F$100),\" \")","v":0},{"$f":"IFERROR(LOOKUP(2,1/((AP$1=Список!$C$2:$C$100)*(Список!$D$2:$D$100=$I14)),Список!$F$2:$F$100),\" \")","v":" "},{"$f":"IFERROR(LOOKUP(2,1/((AQ$1=Список!$C$2:$C$100)*(Список!$D$2:$D$100=$I14)),Список!$F$2:$F$100),\" \")","v":0},{"$f":"IFERROR(LOOKUP(2,1/((AR$1=Список!$C$2:$C$100)*(Список!$D$2:$D$100=$I14)),Список!$F$2:$F$100),\" \")","v":0},{"$f":"IFERROR(LOOKUP(2,1/((AS$1=Список!$C$2:$C$100)*(Список!$D$2:$D$100=$I14)),Список!$F$2:$F$100),\" \")","v":" "},{"$f":"IFERROR(LOOKUP(2,1/((AT$1=Список!$C$2:$C$100)*(Список!$D$2:$D$100=$I14)),Список!$F$2:$F$100),\" \")","v":0},{"$f":"IFERROR(LOOKUP(2,1/((AU$1=Список!$C$2:$C$100)*(Список!$D$2:$D$100=$I14)),Список!$F$2:$F$100),\" \")","v":0},{"$f":"IFERROR(LOOKUP(2,1/((AV$1=Список!$C$2:$C$100)*(Список!$D$2:$D$100=$I14)),Список!$F$2:$F$100),\" \")","v":" "}]

{"sheet":"Хронология","index":3,"n_rows":19,"n_cols":48,"rows_kept":19,"cut":false,"hidden":false,"merged":[]}
["Без повторов","Замена",null,"Номер для макроса",null,null,null,null,null,null,null,"Stage_01",null,null,"Stage_02",null,null,"Stage_03",null,null,"Stage_04",null,null,"Stage_05",null,null,"Stage_06",null,null,"Stage_07",null,null,"Stage_08",null,null,"Stage_09",null,null,"Stage_10",null,null,"Stage_11",null,null,"Stage_12",null,null,"Stage_13"]
["Путь",null,null,"A001"]
[null,null,null,null,null,null,null,null,"Line_1",null,{"$f":"IF(Черновик!K3=0,\" \",Черновик!K3)","v":" "},null,{"$f":"IF(Черновик!M3=0,\" \",Черновик!M3)","v":" "},{"$f":"IF(Черновик!N3=0,\" \",Черновик!N3)","v":" "},null,{"$f":"IF(Черновик!P3=0,\" \",Черновик!P3)","v":" "},{"$f":"IF(Черновик!Q3=0,\" \",Черновик!Q3)","v":" "},{"$f":"IF(Черновик!R3=0,\" \",Черновик!R3)","v":" "},{"$f":"IF(Черновик!S3=0,\" \",Черновик!S3)","v":" "},{"$f":"IF(Черновик!T3=0,\" \",Черновик!T3)","v":" "},null,{"$f":"IF(Черновик!V3=0,\" \",Черновик!V3)","v":" "},{"$f":"IF(Черновик!W3=0,\" \",Черновик!W3)","v":" "},null,{"$f":"IF(Черновик!Y3=0,\" \",Черновик!Y3)","v":" "},{"$f":"IF(Черновик!Z3=0,\" \",Черновик!Z3)","v":" "},{"$f":"IF(Черновик!AA3=0,\" \",Черновик!AA3)","v":" "},{"$f":"IF(Черновик!AB3=0,\" \",Черновик!AB3)","v":" "},{"$f":"IF(Черновик!AC3=0,\" \",Черновик!AC3)","v":" "},null,{"$f":"IF(Черновик!AE3=0,\" \",Черновик!AE3)","v":" "},{"$f":"IF(Черновик!AF3=0,\" \",Черновик!AF3)","v":" "},{"$f":"IF(Черновик!AG3=0,\" \",Черновик!AG3)","v":" "},{"$f":"IF(Черновик!AH3=0,\" \",Черновик!AH3)","v":" "},{"$f":"IF(Черновик!AI3=0,\" \",Черновик!AI3)","v":" "},{"$f":"IF(Черновик!AJ3=0,\" \",Черновик!AJ3)","v":" "},{"$f":"IF(Черновик!AK3=0,\" \",Черновик!AK3)","v":" "},{"$f":"IF(Черновик!AL3=0,\" \",Черновик!AL3)","v":" "},null,{"$f":"IF(Черновик!AN3=0,\" \",Черновик!AN3)","v":" "},{"$f":"IF(Черновик!AO3=0,\" \",Черновик!AO3)","v":" "},null,{"$f":"IF(Черновик!AQ3=0,\" \",Черновик!AQ3)","v":" "},{"$f":"IF(Черновик!AR3=0,\" \",Черновик!AR3)","v":" "},null,{"$f":"IF(Черновик!AT3=0,\" \",Черновик!AT3)","v":" "},{"$f":"IF(Черновик!AU3=0,\" \",Черновик!AU3)","v":" "}]
["Лоза",null,null,"A002",null,null,null,null,null,null,{"$f":"IF(Черновик!K4=0,\" \",Черновик!K4)","v":" "},{"$f":"IF(Черновик!L4=0,\" \",Черновик!L4)","v":" "},{"$f":"IF(Черновик!M4=0,\" \",Черновик!M4)","v":" "},{"$f":"IF(Черновик!N4=0,\" \",Черновик!N4)","v":" "},{"$f":"IF(Черновик!O4=0,\" \",Черновик!O4)","v":" "},{"$f":"IF(Черновик!P4=0,\" \",Черновик!P4)","v":" "},{"$f":"IF(Черновик!Q4=0,\" \",Черновик!Q4)","v":" "},{"$f":"IF(Черновик!R4=0,\" \",Черновик!R4)","v":" "},{"$f":"IF(Черновик!S4=0,\" \",Черновик!S4)","v":" "},{"$f":"IF(Черновик!T4=0,\" \",Черновик!T4)","v":" "},{"$f":"IF(Черновик!U4=0,\" \",Черновик!U4)","v":" "},{"$f":"IF(Черновик!V4=0,\" \",Черновик!V4)","v":" "},{"$f":"IF(Черновик!W4=0,\" \",Черновик!W4)","v":" "},{"$f":"IF(Черновик!X4=0,\" \",Черновик!X4)","v":" "},{"$f":"IF(Черновик!Y4=0,\" \",Черновик!Y4)","v":" "},{"$f":"IF(Черновик!Z4=0,\" \",Черновик!Z4)","v":" "},{"$f":"IF(Черновик!AA4=0,\" \",Черновик!AA4)","v":" "},{"$f":"IF(Черновик!AB4=0,\" \",Черновик!AB4)","v":" "},{"$f":"IF(Черновик!AC4=0,\" \",Черновик!AC4)","v":" "},{"$f":"IF(Черновик!AD4=0,\" \",Черновик!AD4)","v":" "},{"$f":"IF(Черновик!AE4=0,\" \",Черновик!AE4)","v":" "},{"$f":"IF(Черновик!AF4=0,\" \",Черновик!AF4)","v":" "},{"$f":"IF(Черновик!AG4=0,\" \",Черновик!AG4)","v":" "},{"$f":"IF(Черновик!AH4=0,\" \",Черновик!AH4)","v":" "},{"$f":"IF(Черновик!AI4=0,\" \",Черновик!AI4)","v":" "},{"$f":"IF(Черновик!AJ4=0,\" \",Черновик!AJ4)","v":" "},{"$f":"IF(Черновик!AK4=0,\" \",Черновик!AK4)","v":" "},{"$f":"IF(Черновик!AL4=0,\" \",Черновик!AL4)","v":" "},{"$f":"IF(Черновик!AM4=0,\" \",Черновик!AM4)","v":" "},{"$f":"IF(Черновик!AN4=0,\" \",Черновик!AN4)","v":" "},{"$f":"IF(Черновик!AO4=0,\" \",Черновик!AO4)","v":" "},{"$f":"IF(Черновик!AP4=0,\" \",Черновик!AP4)","v":" "},{"$f":"IF(Черновик!AQ4=0,\" \",Черновик!AQ4)","v":" "},{"$f":"IF(Черновик!AR4=0,\" \",Черновик!AR4)","v":" "},{"$f":"IF(Черновик!AS4=0,\" \",Черновик!AS4)","v":" "},{"$f":"IF(Черновик!AT4=0,\" \",Черновик!AT4)","v":" "},{"$f":"IF(Черновик!AU4=0,\" \",Черновик!AU4)","v":" "},{"$f":"IF(Черновик!AV4=0,\" \",Черновик!AV4)","v":" "}]
[null,null,null,null,null,null,null,null,null,null,{"$f":"IF(Черновик!K5=0,\" \",Черновик!K5)","v":" "},{"$f":"IF(Черновик!L5=0,\" \",Черновик!L5)","v":" "},{"$f":"IF(Черновик!M5=0,\" \",Черновик!M5)","v":" "},{"$f":"IF(Черновик!N5=0,\" \",Черновик!N5)","v":" "},{"$f":"IF(Черновик!O5=0,\" \",Черновик!O5)","v":" "},{"$f":"IF(Черновик!P5=0,\" \",Черновик!P5)","v":" "},{"$f":"IF(Черновик!Q5=0,\" \",Черновик!Q5)","v":" "},{"$f":"IF(Черновик!R5=0,\" \",Черновик!R5)","v":" "},{"$f":"IF(Черновик!S5=0,\" \",Черновик!S5)","v":" "},{"$f":"IF(Черновик!T5=0,\" \",Черновик!T5)","v":" "},{"$f":"IF(Черновик!U5=0,\" \",Черновик!U5)","v":" "},{"$f":"IF(Черновик!V5=0,\" \",Черновик!V5)","v":" "},{"$f":"IF(Черновик!W5=0,\" \",Черновик!W5)","v":" "},{"$f":"IF(Черновик!X5=0,\" \",Черновик!X5)","v":" "},{"$f":"IF(Черновик!Y5=0,\" \",Черновик!Y5)","v":" "},{"$f":"IF(Черновик!Z5=0,\" \",Черновик!Z5)","v":" "},{"$f":"IF(Черновик!AA5=0,\" \",Черновик!AA5)","v":" "},{"$f":"IF(Черновик!AB5=0,\" \",Черновик!AB5)","v":" "},{"$f":"IF(Черновик!AC5=0,\" \",Черновик!AC5)","v":" "},{"$f":"IF(Черновик!AD5=0,\" \",Черновик!AD5)","v":" "},{"$f":"IF(Черновик!AE5=0,\" \",Черновик!AE5)","v":" "},{"$f":"IF(Черновик!AF5=0,\" \",Черновик!AF5)","v":" "},{"$f":"IF(Черновик!AG5=0,\" \",Черновик!AG5)","v":" "},{"$f":"IF(Черновик!AH5=0,\" \",Черновик!AH5)","v":" "},{"$f":"IF(Черновик!AI5=0,\" \",Черновик!AI5)","v":" "},{"$f":"IF(Черновик!AJ5=0,\" \",Черновик!AJ5)","v":" "},{"$f":"IF(Черновик!AK5=0,\" \",Черновик!AK5)","v":" "},{"$f":"IF(Черновик!AL5=0,\" \",Черновик!AL5)","v":" "},{"$f":"IF(Черновик!AM5=0,\" \",Черновик!AM5)","v":" "},{"$f":"IF(Черновик!AN5=0,\" \",Черновик!AN5)","v":" "},{"$f":"IF(Черновик!AO5=0,\" \",Черновик!AO5)","v":" "},{"$f":"IF(Черновик!AP5=0,\" \",Черновик!AP5)","v":" "},{"$f":"IF(Черновик!AQ5=0,\" \",Черновик!AQ5)","v":" "},{"$f":"IF(Черновик!AR5=0,\" \",Черновик!AR5)","v":" "},{"$f":"IF(Черновик!AS5=0,\" \",Черновик!AS5)","v":" "},{"$f":"IF(Черновик!AT5=0,\" \",Черновик!AT5)","v":" "},{"$f":"IF(Черновик!AU5=0,\" \",Черновик!AU5)","v":" "},{"$f":"IF(Черновик!AV5=0,\" \",Черновик!AV5)","v":" "}]
["\"Путь\" и \"Лоза\"",null,null,"A003",null,null,null,null,null,null,{"$f":"IF(Черновик!K6=0,\" \",Черновик!K6)","v":" "},{"$f":"IF(Черновик!L6=0,\" \",Черновик!L6)","v":" "},{"$f":"IF(Черновик!M6=0,\" \",Черновик!M6)","v":" "},{"$f":"IF(Черновик!N6=0,\" \",Черновик!N6)","v":" "},{"$f":"IF(Черновик!O6=0,\" \",Черновик!O6)","v":" "},{"$f":"IF(Черновик!P6=0,\" \",Черновик!P6)","v":" "},{"$f":"IF(Черновик!Q6=0,\" \",Черновик!Q6)","v":" "},{"$f":"IF(Черновик!R6=0,\" \",Черновик!R6)","v":" "},{"$f":"IF(Черновик!S6=0,\" \",Черновик!S6)","v":" "},{"$f":"IF(Черновик!T6=0,\" \",Черновик!T6)","v":" "},{"$f":"IF(Черновик!U6=0,\" \",Черновик!U6)","v":" "},{"$f":"IF(Черновик!V6=0,\" \",Черновик!V6)","v":" "},{"$f":"IF(Черновик!W6=0,\" \",Черновик!W6)","v":" "},{"$f":"IF(Черновик!X6=0,\" \",Черновик!X6)","v":" "},{"$f":"IF(Черновик!Y6=0,\" \",Черновик!Y6)","v":" "},{"$f":"IF(Черновик!Z6=0,\" \",Черновик!Z6)","v":" "},{"$f":"IF(Черновик!AA6=0,\" \",Черновик!AA6)","v":" "},{"$f":"IF(Черновик!AB6=0,\" \",Черновик!AB6)","v":" "},{"$f":"IF(Черновик!AC6=0,\" \",Черновик!AC6)","v":" "},{"$f":"IF(Черновик!AD6=0,\" \",Черновик!AD6)","v":" "},{"$f":"IF(Черновик!AE6=0,\" \",Черновик!AE6)","v":" "},{"$f":"IF(Черновик!AF6=0,\" \",Черновик!AF6)","v":" "},{"$f":"IF(Черновик!AG6=0,\" \",Черновик!AG6)","v":" "},{"$f":"IF(Черновик!AH6=0,\" \",Черновик!AH6)","v":" "},{"$f":"IF(Черновик!AI6=0,\" \",Черновик!AI6)","v":" "},{"$f":"IF(Черновик!AJ6=0,\" \",Черновик!AJ6)","v":" "},{"$f":"IF(Черновик!AK6=0,\" \",Черновик!AK6)","v":" "},{"$f":"IF(Черновик!AL6=0,\" \",Черновик!AL6)","v":" "},{"$f":"IF(Черновик!AM6=0,\" \",Черновик!AM6)","v":" "},{"$f":"IF(Черновик!AN6=0,\" \",Черновик!AN6)","v":" "},{"$f":"IF(Черновик!AO6=0,\" \",Черновик!AO6)","v":" "},{"$f":"IF(Черновик!AP6=0,\" \",Черновик!AP6)","v":" "},{"$f":"IF(Черновик!AQ6=0,\" \",Черновик!AQ6)","v":" "},{"$f":"IF(Черновик!AR6=0,\" \",Черновик!AR6)","v":" "},{"$f":"IF(Черновик!AS6=0,\" \",Черновик!AS6)","v":" "},{"$f":"IF(Черновик!AT6=0,\" \",Черновик!AT6)","v":" "},{"$f":"IF(Черновик!AU6=0,\" \",Черновик!AU6)","v":" "},{"$f":"IF(Черновик!AV6=0,\" \",Черновик!AV6)","v":" "}]
[null,null,null,null,null,null,null,null,null,null,{"$f":"IF(Черновик!K7=0,\" \",Черновик!K7)","v":" "},{"$f":"IF(Черновик!L7=0,\" \",Черновик!L7)","v":" "},{"$f":"IF(Черновик!M7=0,\" \",Черновик!M7)","v":" "},{"$f":"IF(Черновик!N7=0,\" \",Черновик!N7)","v":" "},{"$f":"IF(Черновик!O7=0,\" \",Черновик!O7)","v":" "},{"$f":"IF(Черновик!P7=0,\" \",Черновик!P7)","v":" "},{"$f":"IF(Черновик!Q7=0,\" \",Черновик!Q7)","v":" "},{"$f":"IF(Черновик!R7=0,\" \",Черновик!R7)","v":" "},{"$f":"IF(Черновик!S7=0,\" \",Черновик!S7)","v":" "},{"$f":"IF(Черновик!T7=0,\" \",Черновик!T7)","v":" "},{"$f":"IF(Черновик!U7=0,\" \",Черновик!U7)","v":" "},{"$f":"IF(Черновик!V7=0,\" \",Черновик!V7)","v":" "},{"$f":"IF(Черновик!W7=0,\" \",Черновик!W7)","v":" "},{"$f":"IF(Черновик!X7=0,\" \",Черновик!X7)","v":" "},{"$f":"IF(Черновик!Y7=0,\" \",Черновик!Y7)","v":" "},{"$f":"IF(Черновик!Z7=0,\" \",Черновик!Z7)","v":" "},{"$f":"IF(Черновик!AA7=0,\" \",Черновик!AA7)","v":" "},{"$f":"IF(Черновик!AB7=0,\" \",Черновик!AB7)","v":" "},{"$f":"IF(Черновик!AC7=0,\" \",Черновик!AC7)","v":" "},{"$f":"IF(Черновик!AD7=0,\" \",Черновик!AD7)","v":" "},{"$f":"IF(Черновик!AE7=0,\" \",Черновик!AE7)","v":" "},{"$f":"IF(Черновик!AF7=0,\" \",Черновик!AF7)","v":" "},{"$f":"IF(Черновик!AG7=0,\" \",Черновик!AG7)","v":" "},{"$f":"IF(Черновик!AH7=0,\" \",Черновик!AH7)","v":" "},{"$f":"IF(Черновик!AI7=0,\" \",Черновик!AI7)","v":" "},{"$f":"IF(Черновик!AJ7=0,\" \",Черновик!AJ7)","v":" "},{"$f":"IF(Черновик!AK7=0,\" \",Черновик!AK7)","v":" "},{"$f":"IF(Черновик!AL7=0,\" \",Черновик!AL7)","v":" "},{"$f":"IF(Черновик!AM7=0,\" \",Черновик!AM7)","v":" "},{"$f":"IF(Черновик!AN7=0,\" \",Черновик!AN7)","v":" "},{"$f":"IF(Черновик!AO7=0,\" \",Черновик!AO7)","v":" "},{"$f":"IF(Черновик!AP7=0,\" \",Черновик!AP7)","v":" "},{"$f":"IF(Черновик!AQ7=0,\" \",Черновик!AQ7)","v":" "},{"$f":"IF(Черновик!AR7=0,\" \",Черновик!AR7)","v":" "},{"$f":"IF(Черновик!AS7=0,\" \",Черновик!AS7)","v":" "},{"$f":"IF(Черновик!AT7=0,\" \",Черновик!AT7)","v":" "},{"$f":"IF(Черновик!AU7=0,\" \",Черновик!AU7)","v":" "},{"$f":"IF(Черновик!AV7=0,\" \",Черновик!AV7)","v":" "}]
[null,null,null,null,null,null,null,null,"Line_2",null,{"$f":"IF(Черновик!K8=0,\" \",Черновик!K8)","v":" "},null,{"$f":"IF(Черновик!M8=0,\" \",Черновик!M8)","v":" "},{"$f":"IF(Черновик!N8=0,\" \",Черновик!N8)","v":" "},null,{"$f":"IF(Черновик!P8=0,\" \",Черновик!P8)","v":" "},{"$f":"IF(Черновик!Q8=0,\" \",Черновик!Q8)","v":" "},null,{"$f":"IF(Черновик!S8=0,\" \",Черновик!S8)","v":" "},{"$f":"IF(Черновик!T8=0,\" \",Черновик!T8)","v":" "},{"$f":"IF(Черновик!U8=0,\" \",Черновик!U8)","v":" "},{"$f":"IF(Черновик!V8=0,\" \",Черновик!V8)","v":" "},{"$f":"IF(Черновик!W8=0,\" \",Черновик!W8)","v":" "},null,{"$f":"IF(Черновик!Y8=0,\" \",Черновик!Y8)","v":" "},{"$f":"IF(Черновик!Z8=0,\" \",Черновик!Z8)","v":" "},{"$f":"IF(Черновик!AA8=0,\" \",Черновик!AA8)","v":" "},{"$f":"IF(Черновик!AB8=0,\" \",Черновик!AB8)","v":" "},{"$f":"IF(Черновик!AC8=0,\" \",Черновик!AC8)","v":" "},{"$f":"IF(Черновик!AD8=0,\" \",Черновик!AD8)","v":" "},{"$f":"IF(Черновик!AE8=0,\" \",Черновик!AE8)","v":" "},{"$f":"IF(Черновик!AF8=0,\" \",Черновик!AF8)","v":" "},{"$f":"IF(Черновик!AG8=0,\" \",Черновик!AG8)","v":" "},{"$f":"IF(Черновик!AH8=0,\" \",Черновик!AH8)","v":" "},{"$f":"IF(Черновик!AI8=0,\" \",Черновик!AI8)","v":" "},null,{"$f":"IF(Черновик!AK8=0,\" \",Черновик!AK8)","v":" "},{"$f":"IF(Черновик!AL8=0,\" \",Черновик!AL8)","v":" "},null,{"$f":"IF(Черновик!AN8=0,\" \",Черновик!AN8)","v":" "},{"$f":"IF(Черновик!AO8=0,\" \",Черновик!AO8)","v":" "},null,{"$f":"IF(Черновик!AQ8=0,\" \",Черновик!AQ8)","v":" "},{"$f":"IF(Черновик!AR8=0,\" \",Черновик!AR8)","v":" "},null,{"$f":"IF(Черновик!AT8=0,\" \",Черновик!AT8)","v":" "},{"$f":"IF(Черновик!AU8=0,\" \",Черновик!AU8)","v":" "}]
[null,null,null,null,null,null,null,null,null,null,{"$f":"IF(Черновик!K9=0,\" \",Черновик!K9)","v":" "},{"$f":"IF(Черновик!L9=0,\" \",Черновик!L9)","v":" "},{"$f":"IF(Черновик!M9=0,\" \",Черновик!M9)","v":" "},{"$f":"IF(Черновик!N9=0,\" \",Черновик!N9)","v":" "},{"$f":"IF(Черновик!O9=0,\" \",Черновик!O9)","v":" "},{"$f":"IF(Черновик!P9=0,\" \",Черновик!P9)","v":" "},{"$f":"IF(Черновик!Q9=0,\" \",Черновик!Q9)","v":" "},{"$f":"IF(Черновик!R9=0,\" \",Черновик!R9)","v":" "},{"$f":"IF(Черновик!S9=0,\" \",Черновик!S9)","v":" "},{"$f":"IF(Черновик!T9=0,\" \",Черновик!T9)","v":" "},{"$f":"IF(Черновик!U9=0,\" \",Черновик!U9)","v":" "},{"$f":"IF(Черновик!V9=0,\" \",Черновик!V9)","v":" "},{"$f":"IF(Черновик!W9=0,\" \",Черновик!W9)","v":" "},{"$f":"IF(Черновик!X9=0,\" \",Черновик!X9)","v":" "},{"$f":"IF(Черновик!Y9=0,\" \",Черновик!Y9)","v":" "},{"$f":"IF(Черновик!Z9=0,\" \",Черновик!Z9)","v":" "},{"$f":"IF(Черновик!AA9=0,\" \",Черновик!AA9)","v":" "},{"$f":"IF(Черновик!AB9=0,\" \",Черновик!AB9)","v":" "},{"$f":"IF(Черновик!AC9=0,\" \",Черновик!AC9)","v":" "},{"$f":"IF(Черновик!AD9=0,\" \",Черновик!AD9)","v":" "},{"$f":"IF(Черновик!AE9=0,\" \",Черновик!AE9)","v":" "},{"$f":"IF(Черновик!AF9=0,\" \",Черновик!AF9)","v":" "},{"$f":"IF(Черновик!AG9=0,\" \",Черновик!AG9)","v":" "},{"$f":"IF(Черновик!AH9=0,\" \",Черновик!AH9)","v":" "},{"$f":"IF(Черновик!AI9=0,\" \",Черновик!AI9)","v":" "},{"$f":"IF(Черновик!AJ9=0,\" \",Черновик!AJ9)","v":" "},{"$f":"IF(Черновик!AK9=0,\" \",Черновик!AK9)","v":" "},{"$f":"IF(Черновик!AL9=0,\" \",Черновик!AL9)","v":" "},{"$f":"IF(Черновик!AM9=0,\" \",Черновик!AM9)","v":" "},{"$f":"IF(Черновик!AN9=0,\" \",Черновик!AN9)","v":" "},{"$f":"IF(Черновик!AO9=0,\" \",Черновик!AO9)","v":" "},{"$f":"IF(Черновик!AP9=0,\" \",Черновик!AP9)","v":" "},{"$f":"IF(Черновик!AQ9=0,\" \",Черновик!AQ9)","v":" "},{"$f":"IF(Черновик!AR9=0,\" \",Черновик!AR9)","v":" "},{"$f":"IF(Черновик!AS9=0,\" \",Черновик!AS9)","v":" "},{"$f":"IF(Черновик!AT9=0,\" \",Черновик!AT9)","v":" "},{"$f":"IF(Черновик!AU9=0,\" \",Черновик!AU9)","v":" "},{"$f":"IF(Черновик!AV9=0,\" \",Черновик!AV9)","v":" "}]
[null,null,null,null,null,null,null,null,null,null,{"$f":"IF(Черновик!K10=0,\" \",Черновик!K10)","v":" "},{"$f":"IF(Черновик!L10=0,\" \",Черновик!L10)","v":" "},{"$f":"IF(Черновик!M10=0,\" \",Черновик!M10)","v":" "},{"$f":"IF(Черновик!N10=0,\" \",Черновик!N10)","v":" "},{"$f":"IF(Черновик!O10=0,\" \",Черновик!O10)","v":" "},{"$f":"IF(Черновик!P10=0,\" \",Черновик!P10)","v":" "},{"$f":"IF(Черновик!Q10=0,\" \",Черновик!Q10)","v":" "},{"$f":"IF(Черновик!R10=0,\" \",Черновик!R10)","v":" "},{"$f":"IF(Черновик!S10=0,\" \",Черновик!S10)","v":" "},{"$f":"IF(Черновик!T10=0,\" \",Черновик!T10)","v":" "},{"$f":"IF(Черновик!U10=0,\" \",Черновик!U10)","v":" "},{"$f":"IF(Черновик!V10=0,\" \",Черновик!V10)","v":" "},{"$f":"IF(Черновик!W10=0,\" \",Черновик!W10)","v":" "},{"$f":"IF(Черновик!X10=0,\" \",Черновик!X10)","v":" "},{"$f":"IF(Черновик!Y10=0,\" \",Черновик!Y10)","v":" "},{"$f":"IF(Черновик!Z10=0,\" \",Черновик!Z10)","v":" "},{"$f":"IF(Черновик!AA10=0,\" \",Черновик!AA10)","v":" "},{"$f":"IF(Черновик!AB10=0,\" \",Черновик!AB10)","v":" "},{"$f":"IF(Черновик!AC10=0,\" \",Черновик!AC10)","v":" "},{"$f":"IF(Черновик!AD10=0,\" \",Черновик!AD10)","v":" "},{"$f":"IF(Черновик!AE10=0,\" \",Черновик!AE10)","v":" "},{"$f":"IF(Черновик!AF10=0,\" \",Черновик!AF10)","v":" "},{"$f":"IF(Черновик!AG10=0,\" \",Черновик!AG10)","v":" "},{"$f":"IF(Черновик!AH10=0,\" \",Черновик!AH10)","v":" "},{"$f":"IF(Черновик!AI10=0,\" \",Черновик!AI10)","v":" "},{"$f":"IF(Черновик!AJ10=0,\" \",Черновик!AJ10)","v":" "},{"$f":"IF(Черновик!AK10=0,\" \",Черновик!AK10)","v":" "},{"$f":"IF(Черновик!AL10=0,\" \",Черновик!AL10)","v":" "},{"$f":"IF(Черновик!AM10=0,\" \",Черновик!AM10)","v":" "},{"$f":"IF(Черновик!AN10=0,\" \",Черновик!AN10)","v":" "},{"$f":"IF(Черновик!AO10=0,\" \",Черновик!AO10)","v":" "},{"$f":"IF(Черновик!AP10=0,\" \",Черновик!AP10)","v":" "},{"$f":"IF(Черновик!AQ10=0,\" \",Черновик!AQ10)","v":" "},{"$f":"IF(Черновик!AR10=0,\" \",Черновик!AR10)","v":" "},{"$f":"IF(Черновик!AS10=0,\" \",Черновик!AS10)","v":" "},{"$f":"IF(Черновик!AT10=0,\" \",Черновик!AT10)","v":" "},{"$f":"IF(Черновик!AU10=0,\" \",Черновик!AU10)","v":" "},{"$f":"IF(Черновик!AV10=0,\" \",Черновик!AV10)","v":" "}]
[null,null,null,null,null,null,null,null,null,null,{"$f":"IF(Черновик!K11=0,\" \",Черновик!K11)","v":" "},{"$f":"IF(Черновик!L11=0,\" \",Черновик!L11)","v":" "},{"$f":"IF(Черновик!M11=0,\" \",Черновик!M11)","v":" "},{"$f":"IF(Черновик!N11=0,\" \",Черновик!N11)","v":" "},{"$f":"IF(Черновик!O11=0,\" \",Черновик!O11)","v":" "},{"$f":"IF(Черновик!P11=0,\" \",Черновик!P11)","v":" "},{"$f":"IF(Черновик!Q11=0,\" \",Черновик!Q11)","v":" "},{"$f":"IF(Черновик!R11=0,\" \",Черновик!R11)","v":" "},{"$f":"IF(Черновик!S11=0,\" \",Черновик!S11)","v":" "},{"$f":"IF(Черновик!T11=0,\" \",Черновик!T11)","v":" "},{"$f":"IF(Черновик!U11=0,\" \",Черновик!U11)","v":" "},{"$f":"IF(Черновик!V11=0,\" \",Черновик!V11)","v":" "},{"$f":"IF(Черновик!W11=0,\" \",Черновик!W11)","v":" "},{"$f":"IF(Черновик!X11=0,\" \",Черновик!X11)","v":" "},{"$f":"IF(Черновик!Y11=0,\" \",Черновик!Y11)","v":" "},{"$f":"IF(Черновик!Z11=0,\" \",Черновик!Z11)","v":" "},{"$f":"IF(Черновик!AA11=0,\" \",Черновик!AA11)","v":" "},{"$f":"IF(Черновик!AB11=0,\" \",Черновик!AB11)","v":" "},{"$f":"IF(Черновик!AC11=0,\" \",Черновик!AC11)","v":" "},{"$f":"IF(Черновик!AD11=0,\" \",Черновик!AD11)","v":" "},{"$f":"IF(Черновик!AE11=0,\" \",Черновик!AE11)","v":" "},{"$f":"IF(Черновик!AF11=0,\" \",Черновик!AF11)","v":" "},{"$f":"IF(Черновик!AG11=0,\" \",Черновик!AG11)","v":" "},{"$f":"IF(Черновик!AH11=0,\" \",Черновик!AH11)","v":" "},{"$f":"IF(Черновик!AI11=0,\" \",Черновик!AI11)","v":" "},{"$f":"IF(Черновик!AJ11=0,\" \",Черновик!AJ11)","v":" "},{"$f":"IF(Черновик!AK11=0,\" \",Черновик!AK11)","v":" "},{"$f":"IF(Черновик!AL11=0,\" \",Черновик!AL11)","v":" "},{"$f":"IF(Черновик!AM11=0,\" \",Черновик!AM11)","v":" "},{"$f":"IF(Черновик!AN11=0,\" \",Черновик!AN11)","v":" "},{"$f":"IF(Черновик!AO11=0,\" \",Черновик!AO11)","v":" "},{"$f":"IF(Черновик!AP11=0,\" \",Черновик!AP11)","v":" "},{"$f":"IF(Черновик!AQ11=0,\" \",Черновик!AQ11)","v":" "},{"$f":"IF(Черновик!AR11=0,\" \",Черновик!AR11)","v":" "},{"$f":"IF(Черновик!AS11=0,\" \",Черновик!AS11)","v":" "},{"$f":"IF(Черновик!AT11=0,\" \",Черновик!AT11)","v":" "},{"$f":"IF(Черновик!AU11=0,\" \",Черновик!AU11)","v":" "},{"$f":"IF(Черновик!AV11=0,\" \",Черновик!AV11)","v":" "}]
[null,null,null,null,null,null,null,null,null,null,{"$f":"IF(Черновик!K12=0,\" \",Черновик!K12)","v":" "},{"$f":"IF(Черновик!L12=0,\" \",Черновик!L12)","v":" "},{"$f":"IF(Черновик!M12=0,\" \",Черновик!M12)","v":" "},{"$f":"IF(Черновик!N12=0,\" \",Черновик!N12)","v":" "},{"$f":"IF(Черновик!O12=0,\" \",Черновик!O12)","v":" "},{"$f":"IF(Черновик!P12=0,\" \",Черновик!P12)","v":" "},{"$f":"IF(Черновик!Q12=0,\" \",Черновик!Q12)","v":" "},{"$f":"IF(Черновик!R12=0,\" \",Черновик!R12)","v":" "},{"$f":"IF(Черновик!S12=0,\" \",Черновик!S12)","v":" "},{"$f":"IF(Черновик!T12=0,\" \",Черновик!T12)","v":" "},{"$f":"IF(Черновик!U12=0,\" \",Черновик!U12)","v":" "},{"$f":"IF(Черновик!V12=0,\" \",Черновик!V12)","v":" "},{"$f":"IF(Черновик!W12=0,\" \",Черновик!W12)","v":" "},{"$f":"IF(Черновик!X12=0,\" \",Черновик!X12)","v":" "},{"$f":"IF(Черновик!Y12=0,\" \",Черновик!Y12)","v":" "},{"$f":"IF(Черновик!Z12=0,\" \",Черновик!Z12)","v":" "},{"$f":"IF(Черновик!AA12=0,\" \",Черновик!AA12)","v":" "},{"$f":"IF(Черновик!AB12=0,\" \",Черновик!AB12)","v":" "},{"$f":"IF(Черновик!AC12=0,\" \",Черновик!AC12)","v":" "},{"$f":"IF(Черновик!AD12=0,\" \",Черновик!AD12)","v":" "},{"$f":"IF(Черновик!AE12=0,\" \",Черновик!AE12)","v":" "},{"$f":"IF(Черновик!AF12=0,\" \",Черновик!AF12)","v":" "},{"$f":"IF(Черновик!AG12=0,\" \",Черновик!AG12)","v":" "},{"$f":"IF(Черновик!AH12=0,\" \",Черновик!AH12)","v":" "},{"$f":"IF(Черновик!AI12=0,\" \",Черновик!AI12)","v":" "},{"$f":"IF(Черновик!AJ12=0,\" \",Черновик!AJ12)","v":" "},{"$f":"IF(Черновик!AK12=0,\" \",Черновик!AK12)","v":" "},{"$f":"IF(Черновик!AL12=0,\" \",Черновик!AL12)","v":" "},{"$f":"IF(Черновик!AM12=0,\" \",Черновик!AM12)","v":" "},{"$f":"IF(Черновик!AN12=0,\" \",Черновик!AN12)","v":" "},{"$f":"IF(Черновик!AO12=0,\" \",Черновик!AO12)","v":" "},{"$f":"IF(Черновик!AP12=0,\" \",Черновик!AP12)","v":" "},{"$f":"IF(Черновик!AQ12=0,\" \",Черновик!AQ12)","v":" "},{"$f":"IF(Черновик!AR12=0,\" \",Черновик!AR12)","v":" "},{"$f":"IF(Черновик!AS12=0,\" \",Черновик!AS12)","v":" "},{"$f":"IF(Черновик!AT12=0,\" \",Черновик!AT12)","v":" "},{"$f":"IF(Черновик!AU12=0,\" \",Черновик!AU12)","v":" "},{"$f":"IF(Черновик!AV12=0,\" \",Черновик!AV12)","v":" "}]
[null,null,null,null,null,null,null,null,"Line_3",null,{"$f":"IF(Черновик!K13=0,\" \",Черновик!K13)","v":" "},{"$f":"IF(Черновик!L13=0,\" \",Черновик!L13)","v":" "},{"$f":"IF(Черновик!M13=0,\" \",Черновик!M13)","v":" "},{"$f":"IF(Черновик!N13=0,\" \",Черновик!N13)","v":" "},{"$f":"IF(Черновик!O13=0,\" \",Черновик!O13)","v":" "},{"$f":"IF(Черновик!P13=0,\" \",Черновик!P13)","v":" "},{"$f":"IF(Черновик!Q13=0,\" \",Черновик!Q13)","v":" "},{"$f":"IF(Черновик!R13=0,\" \",Черновик!R13)","v":" "},{"$f":"IF(Черновик!S13=0,\" \",Черновик!S13)","v":" "},{"$f":"IF(Черновик!T13=0,\" \",Черновик!T13)","v":" "},{"$f":"IF(Черновик!U13=0,\" \",Черновик!U13)","v":" "},{"$f":"IF(Черновик!V13=0,\" \",Черновик!V13)","v":" "},{"$f":"IF(Черновик!W13=0,\" \",Черновик!W13)","v":" "},{"$f":"IF(Черновик!X13=0,\" \",Черновик!X13)","v":" "},{"$f":"IF(Черновик!Y13=0,\" \",Черновик!Y13)","v":" "},{"$f":"IF(Черновик!Z13=0,\" \",Черновик!Z13)","v":" "},{"$f":"IF(Черновик!AA13=0,\" \",Черновик!AA13)","v":" "},{"$f":"IF(Черновик!AB13=0,\" \",Черновик!AB13)","v":" "},{"$f":"IF(Черновик!AC13=0,\" \",Черновик!AC13)","v":" "},{"$f":"IF(Черновик!AD13=0,\" \",Черновик!AD13)","v":" "},{"$f":"IF(Черновик!AE13=0,\" \",Черновик!AE13)","v":" "},{"$f":"IF(Черновик!AF13=0,\" \",Черновик!AF13)","v":" "},{"$f":"IF(Черновик!AG13=0,\" \",Черновик!AG13)","v":" "},{"$f":"IF(Черновик!AH13=0,\" \",Черновик!AH13)","v":" "},{"$f":"IF(Черновик!AI13=0,\" \",Черновик!AI13)","v":" "},{"$f":"IF(Черновик!AJ13=0,\" \",Черновик!AJ13)","v":" "},{"$f":"IF(Черновик!AK13=0,\" \",Черновик!AK13)","v":" "},{"$f":"IF(Черновик!AL13=0,\" \",Черновик!AL13)","v":" "},{"$f":"IF(Черновик!AM13=0,\" \",Черновик!AM13)","v":" "},{"$f":"IF(Черновик!AN13=0,\" \",Черновик!AN13)","v":" "},{"$f":"IF(Черновик!AO13=0,\" \",Черновик!AO13)","v":" "},{"$f":"IF(Черновик!AP13=0,\" \",Черновик!AP13)","v":" "},{"$f":"IF(Черновик!AQ13=0,\" \",Черновик!AQ13)","v":" "},{"$f":"IF(Черновик!AR13=0,\" \",Черновик!AR13)","v":" "},{"$f":"IF(Черновик!AS13=0,\" \",Черновик!AS13)","v":" "},{"$f":"IF(Черновик!AT13=0,\" \",Черновик!AT13)","v":" "},{"$f":"IF(Черновик!AU13=0,\" \",Черновик!AU13)","v":" "},{"$f":"IF(Черновик!AV13=0,\" \",Черновик!AV13)","v":" "}]
[null,null,null,null,null,null,null,null,null,null,{"$f":"IF(Черновик!K14=0,\" \",Черновик!K14)","v":" "},{"$f":"IF(Черновик!L14=0,\" \",Черновик!L14)","v":" "},{"$f":"IF(Черновик!M14=0,\" \",Черновик!M14)","v":" "},{"$f":"IF(Черновик!N14=0,\" \",Черновик!N14)","v":" "},{"$f":"IF(Черновик!O14=0,\" \",Черновик!O14)","v":" "},{"$f":"IF(Черновик!P14=0,\" \",Черновик!P14)","v":" "},{"$f":"IF(Черновик!Q14=0,\" \",Черновик!Q14)","v":" "},{"$f":"IF(Черновик!R14=0,\" \",Черновик!R14)","v":" "},{"$f":"IF(Черновик!S14=0,\" \",Черновик!S14)","v":" "},{"$f":"IF(Черновик!T14=0,\" \",Черновик!T14)","v":" "},{"$f":"IF(Черновик!U14=0,\" \",Черновик!U14)","v":" "},{"$f":"IF(Черновик!V14=0,\" \",Черновик!V14)","v":" "},{"$f":"IF(Черновик!W14=0,\" \",Черновик!W14)","v":" "},{"$f":"IF(Черновик!X14=0,\" \",Черновик!X14)","v":" "},{"$f":"IF(Черновик!Y14=0,\" \",Черновик!Y14)","v":" "},{"$f":"IF(Черновик!Z14=0,\" \",Черновик!Z14)","v":" "},{"$f":"IF(Черновик!AA14=0,\" \",Черновик!AA14)","v":" "},{"$f":"IF(Черновик!AB14=0,\" \",Черновик!AB14)","v":" "},{"$f":"IF(Черновик!AC14=0,\" \",Черновик!AC14)","v":" "},{"$f":"IF(Черновик!AD14=0,\" \",Черновик!AD14)","v":" "},{"$f":"IF(Черновик!AE14=0,\" \",Черновик!AE14)","v":" "},{"$f":"IF(Черновик!AF14=0,\" \",Черновик!AF14)","v":" "},{"$f":"IF(Черновик!AG14=0,\" \",Черновик!AG14)","v":" "},{"$f":"IF(Черновик!AH14=0,\" \",Черновик!AH14)","v":" "},{"$f":"IF(Черновик!AI14=0,\" \",Черновик!AI14)","v":" "},{"$f":"IF(Черновик!AJ14=0,\" \",Черновик!AJ14)","v":" "},{"$f":"IF(Черновик!AK14=0,\" \",Черновик!AK14)","v":" "},{"$f":"IF(Черновик!AL14=0,\" \",Черновик!AL14)","v":" "},{"$f":"IF(Черновик!AM14=0,\" \",Черновик!AM14)","v":" "},{"$f":"IF(Черновик!AN14=0,\" \",Черновик!AN14)","v":" "},{"$f":"IF(Черновик!AO14=0,\" \",Черновик!AO14)","v":" "},{"$f":"IF(Черновик!AP14=0,\" \",Черновик!AP14)","v":" "},{"$f":"IF(Черновик!AQ14=0,\" \",Черновик!AQ14)","v":" "},{"$f":"IF(Черновик!AR14=0,\" \",Черновик!AR14)","v":" "},{"$f":"IF(Черновик!AS14=0,\" \",Черновик!AS14)","v":" "},{"$f":"IF(Черновик!AT14=0,\" \",Черновик!AT14)","v":" "},{"$f":"IF(Черновик!AU14=0,\" \",Черновик!AU14)","v":" "},{"$f":"IF(Черновик!AV14=0,\" \",Черновик!AV14)","v":" "}]
[null,null,null,null,null,null,null,null,null,null,{"$f":"IF(Черновик!K15=0,\" \",Черновик!K15)","v":" "},{"$f":"IF(Черновик!L15=0,\" \",Черновик!L15)","v":" "},{"$f":"IF(Черновик!M15=0,\" \",Черновик!M15)","v":" "},{"$f":"IF(Черновик!N15=0,\" \",Черновик!N15)","v":" "},{"$f":"IF(Черновик!O15=0,\" \",Черновик!O15)","v":" "},{"$f":"IF(Черновик!P15=0,\" \",Черновик!P15)","v":" "},{"$f":"IF(Черновик!Q15=0,\" \",Черновик!Q15)","v":" "},{"$f":"IF(Черновик!R15=0,\" \",Черновик!R15)","v":" "},{"$f":"IF(Черновик!S15=0,\" \",Черновик!S15)","v":" "},{"$f":"IF(Черновик!T15=0,\" \",Черновик!T15)","v":" "},{"$f":"IF(Черновик!U15=0,\" \",Черновик!U15)","v":" "},{"$f":"IF(Черновик!V15=0,\" \",Черновик!V15)","v":" "},{"$f":"IF(Черновик!W15=0,\" \",Черновик!W15)","v":" "},{"$f":"IF(Черновик!X15=0,\" \",Черновик!X15)","v":" "},{"$f":"IF(Черновик!Y15=0,\" \",Черновик!Y15)","v":" "},{"$f":"IF(Черновик!Z15=0,\" \",Черновик!Z15)","v":" "},{"$f":"IF(Черновик!AA15=0,\" \",Черновик!AA15)","v":" "},{"$f":"IF(Черновик!AB15=0,\" \",Черновик!AB15)","v":" "},{"$f":"IF(Черновик!AC15=0,\" \",Черновик!AC15)","v":" "},{"$f":"IF(Черновик!AD15=0,\" \",Черновик!AD15)","v":" "},{"$f":"IF(Черновик!AE15=0,\" \",Черновик!AE15)","v":" "},{"$f":"IF(Черновик!AF15=0,\" \",Черновик!AF15)","v":" "},{"$f":"IF(Черновик!AG15=0,\" \",Черновик!AG15)","v":" "},{"$f":"IF(Черновик!AH15=0,\" \",Черновик!AH15)","v":" "},{"$f":"IF(Черновик!AI15=0,\" \",Черновик!AI15)","v":" "},{"$f":"IF(Черновик!AJ15=0,\" \",Черновик!AJ15)","v":" "},{"$f":"IF(Черновик!AK15=0,\" \",Черновик!AK15)","v":" "},{"$f":"IF(Черновик!AL15=0,\" \",Черновик!AL15)","v":" "},{"$f":"IF(Черновик!AM15=0,\" \",Черновик!AM15)","v":" "},{"$f":"IF(Черновик!AN15=0,\" \",Черновик!AN15)","v":" "},{"$f":"IF(Черновик!AO15=0,\" \",Черновик!AO15)","v":" "},{"$f":"IF(Черновик!AP15=0,\" \",Черновик!AP15)","v":" "},{"$f":"IF(Черновик!AQ15=0,\" \",Черновик!AQ15)","v":" "},{"$f":"IF(Черновик!AR15=0,\" \",Черновик!AR15)","v":" "},{"$f":"IF(Черновик!AS15=0,\" \",Черновик!AS15)","v":" "},{"$f":"IF(Черновик!AT15=0,\" \",Черновик!AT15)","v":" "},{"$f":"IF(Черновик!AU15=0,\" \",Черновик!AU15)","v":" "},{"$f":"IF(Черновик!AV15=0,\" \",Черновик!AV15)","v":" "}]
[null,null,null,null,null,null,null,null,null,null,{"$f":"IF(Черновик!K16=0,\" \",Черновик!K16)","v":" "},{"$f":"IF(Черновик!L16=0,\" \",Черновик!L16)","v":" "},{"$f":"IF(Черновик!M16=0,\" \",Черновик!M16)","v":" "},{"$f":"IF(Черновик!N16=0,\" \",Черновик!N16)","v":" "},{"$f":"IF(Черновик!O16=0,\" \",Черновик!O16)","v":" "},{"$f":"IF(Черновик!P16=0,\" \",Черновик!P16)","v":" "},{"$f":"IF(Черновик!Q16=0,\" \",Черновик!Q16)","v":" "},{"$f":"IF(Черновик!R16=0,\" \",Черновик!R16)","v":" "},{"$f":"IF(Черновик!S16=0,\" \",Черновик!S16)","v":" "},{"$f":"IF(Черновик!T16=0,\" \",Черновик!T16)","v":" "},{"$f":"IF(Черновик!U16=0,\" \",Черновик!U16)","v":" "},{"$f":"IF(Черновик!V16=0,\" \",Черновик!V16)","v":" "},{"$f":"IF(Черновик!W16=0,\" \",Черновик!W16)","v":" "},{"$f":"IF(Черновик!X16=0,\" \",Черновик!X16)","v":" "},{"$f":"IF(Черновик!Y16=0,\" \",Черновик!Y16)","v":" "},{"$f":"IF(Черновик!Z16=0,\" \",Черновик!Z16)","v":" "},{"$f":"IF(Черновик!AA16=0,\" \",Черновик!AA16)","v":" "},{"$f":"IF(Черновик!AB16=0,\" \",Черновик!AB16)","v":" "},{"$f":"IF(Черновик!AC16=0,\" \",Черновик!AC16)","v":" "},{"$f":"IF(Черновик!AD16=0,\" \",Черновик!AD16)","v":" "},{"$f":"IF(Черновик!AE16=0,\" \",Черновик!AE16)","v":" "},{"$f":"IF(Черновик!AF16=0,\" \",Черновик!AF16)","v":" "},{"$f":"IF(Черновик!AG16=0,\" \",Черновик!AG16)","v":" "},{"$f":"IF(Черновик!AH16=0,\" \",Черновик!AH16)","v":" "},{"$f":"IF(Черновик!AI16=0,\" \",Черновик!AI16)","v":" "},{"$f":"IF(Черновик!AJ16=0,\" \",Черновик!AJ16)","v":" "},{"$f":"IF(Черновик!AK16=0,\" \",Черновик!AK16)","v":" "},{"$f":"IF(Черновик!AL16=0,\" \",Черновик!AL16)","v":" "},{"$f":"IF(Черновик!AM16=0,\" \",Черновик!AM16)","v":" "},{"$f":"IF(Черновик!AN16=0,\" \",Черновик!AN16)","v":" "},{"$f":"IF(Черновик!AO16=0,\" \",Черновик!AO16)","v":" "},{"$f":"IF(Черновик!AP16=0,\" \",Черновик!AP16)","v":" "},{"$f":"IF(Черновик!AQ16=0,\" \",Черновик!AQ16)","v":" "},{"$f":"IF(Черновик!AR16=0,\" \",Черновик!AR16)","v":" "},{"$f":"IF(Черновик!AS16=0,\" \",Черновик!AS16)","v":" "},{"$f":"IF(Черновик!AT16=0,\" \",Черновик!AT16)","v":" "},{"$f":"IF(Черновик!AU16=0,\" \",Черновик!AU16)","v":" "},{"$f":"IF(Черновик!AV16=0,\" \",Черновик!AV16)","v":" "}]
[null,null,null,null,null,null,null,null,null,null,null,{"$f":"IF(Черновик!L17=0,\" \",Черновик!L17)","v":" "},{"$f":"IF(Черновик!M17=0,\" \",Черновик!M17)","v":" "},{"$f":"IF(Черновик!N17=0,\" \",Черновик!N17)","v":" "},{"$f":"IF(Черновик!O17=0,\" \",Черновик!O17)","v":" "},{"$f":"IF(Черновик!P17=0,\" \",Черновик!P17)","v":" "},{"$f":"IF(Черновик!Q17=0,\" \",Черновик!Q17)","v":" "},{"$f":"IF(Черновик!R17=0,\" \",Черновик!R17)","v":" "},{"$f":"IF(Черновик!S17=0,\" \",Черновик!S17)","v":" "},{"$f":"IF(Черновик!T17=0,\" \",Черновик!T17)","v":" "},{"$f":"IF(Черновик!U17=0,\" \",Черновик!U17)","v":" "},{"$f":"IF(Черновик!V17=0,\" \",Черновик!V17)","v":" "},{"$f":"IF(Черновик!W17=0,\" \",Черновик!W17)","v":" "},{"$f":"IF(Черновик!X17=0,\" \",Черновик!X17)","v":" "},{"$f":"IF(Черновик!Y17=0,\" \",Черновик!Y17)","v":" "},{"$f":"IF(Черновик!Z17=0,\" \",Черновик!Z17)","v":" "},{"$f":"IF(Черновик!AA17=0,\" \",Черновик!AA17)","v":" "},{"$f":"IF(Черновик!AB17=0,\" \",Черновик!AB17)","v":" "},{"$f":"IF(Черновик!AC17=0,\" \",Черновик!AC17)","v":" "},{"$f":"IF(Черновик!AD17=0,\" \",Черновик!AD17)","v":" "},{"$f":"IF(Черновик!AE17=0,\" \",Черновик!AE17)","v":" "},{"$f":"IF(Черновик!AF17=0,\" \",Черновик!AF17)","v":" "},{"$f":"IF(Черновик!AG17=0,\" \",Черновик!AG17)","v":" "},{"$f":"IF(Черновик!AH17=0,\" \",Черновик!AH17)","v":" "},{"$f":"IF(Черновик!AI17=0,\" \",Черновик!AI17)","v":" "},{"$f":"IF(Черновик!AJ17=0,\" \",Черновик!AJ17)","v":" "},{"$f":"IF(Черновик!AK17=0,\" \",Черновик!AK17)","v":" "},{"$f":"IF(Черновик!AL17=0,\" \",Черновик!AL17)","v":" "},{"$f":"IF(Черновик!AM17=0,\" \",Черновик!AM17)","v":" "},{"$f":"IF(Черновик!AN17=0,\" \",Черновик!AN17)","v":" "},{"$f":"IF(Черновик!AO17=0,\" \",Черновик!AO17)","v":" "},{"$f":"IF(Черновик!AP17=0,\" \",Черновик!AP17)","v":" "},{"$f":"IF(Черновик!AQ17=0,\" \",Черновик!AQ17)","v":" "},{"$f":"IF(Черновик!AR17=0,\" \",Черновик!AR17)","v":" "},{"$f":"IF(Черновик!AS17=0,\" \",Черновик!AS17)","v":" "},{"$f":"IF(Черновик!AT17=0,\" \",Черновик!AT17)","v":" "},{"$f":"IF(Черновик!AU17=0,\" \",Черновик!AU17)","v":" "},{"$f":"IF(Черновик!AV17=0,\" \",Черновик!AV17)","v":" "}]
[null,null,null,null,null,null,null,null,null,null,null,{"$f":"IF(Черновик!L18=0,\" \",Черновик!L18)","v":" "},{"$f":"IF(Черновик!M18=0,\" \",Черновик!M18)","v":" "},{"$f":"IF(Черновик!N18=0,\" \",Черновик!N18)","v":" "},{"$f":"IF(Черновик!O18=0,\" \",Черновик!O18)","v":" "},{"$f":"IF(Черновик!P18=0,\" \",Черновик!P18)","v":" "},{"$f":"IF(Черновик!Q18=0,\" \",Черновик!Q18)","v":" "},{"$f":"IF(Черновик!R18=0,\" \",Черновик!R18)","v":" "},{"$f":"IF(Черновик!S18=0,\" \",Черновик!S18)","v":" "},{"$f":"IF(Черновик!T18=0,\" \",Черновик!T18)","v":" "},{"$f":"IF(Черновик!U18=0,\" \",Черновик!U18)","v":" "},{"$f":"IF(Черновик!V18=0,\" \",Черновик!V18)","v":" "},{"$f":"IF(Черновик!W18=0,\" \",Черновик!W18)","v":" "},{"$f":"IF(Черновик!X18=0,\" \",Черновик!X18)","v":" "},{"$f":"IF(Черновик!Y18=0,\" \",Черновик!Y18)","v":" "},{"$f":"IF(Черновик!Z18=0,\" \",Черновик!Z18)","v":" "},{"$f":"IF(Черновик!AA18=0,\" \",Черновик!AA18)","v":" "},{"$f":"IF(Черновик!AB18=0,\" \",Черновик!AB18)","v":" "},{"$f":"IF(Черновик!AC18=0,\" \",Черновик!AC18)","v":" "},{"$f":"IF(Черновик!AD18=0,\" \",Черновик!AD18)","v":" "},{"$f":"IF(Черновик!AE18=0,\" \",Черновик!AE18)","v":" "},{"$f":"IF(Черновик!AF18=0,\" \",Черновик!AF18)","v":" "},{"$f":"IF(Черновик!AG18=0,\" \",Черновик!AG18)","v":" "},{"$f":"IF(Черновик!AH18=0,\" \",Черновик!AH18)","v":" "},{"$f":"IF(Черновик!AI18=0,\" \",Черновик!AI18)","v":" "},{"$f":"IF(Черновик!AJ18=0,\" \",Черновик!AJ18)","v":" "},{"$f":"IF(Черновик!AK18=0,\" \",Черновик!AK18)","v":" "},{"$f":"IF(Черновик!AL18=0,\" \",Черновик!AL18)","v":" "},{"$f":"IF(Черновик!AM18=0,\" \",Черновик!AM18)","v":" "},{"$f":"IF(Черновик!AN18=0,\" \",Черновик!AN18)","v":" "},{"$f":"IF(Черновик!AO18=0,\" \",Черновик!AO18)","v":" "},{"$f":"IF(Черновик!AP18=0,\" \",Черновик!AP18)","v":" "},{"$f":"IF(Черновик!AQ18=0,\" \",Черновик!AQ18)","v":" "},{"$f":"IF(Черновик!AR18=0,\" \",Черновик!AR18)","v":" "},{"$f":"IF(Черновик!AS18=0,\" \",Черновик!AS18)","v":" "},{"$f":"IF(Черновик!AT18=0,\" \",Черновик!AT18)","v":" "},{"$f":"IF(Черновик!AU18=0,\" \",Черновик!AU18)","v":" "},{"$f":"IF(Черновик!AV18=0,\" \",Черновик!AV18)","v":" "}]
[null,null,null,null,null,null,null,null,null,null,null,{"$f":"IF(Черновик!L19=0,\" \",Черновик!L19)","v":" "},{"$f":"IF(Черновик!M19=0,\" \",Черновик!M19)","v":" "},{"$f":"IF(Черновик!N19=0,\" \",Черновик!N19)","v":" "},{"$f":"IF(Черновик!O19=0,\" \",Черновик!O19)","v":" "},{"$f":"IF(Черновик!P19=0,\" \",Черновик!P19)","v":" "},{"$f":"IF(Черновик!Q19=0,\" \",Черновик!Q19)","v":" "},{"$f":"IF(Черновик!R19=0,\" \",Черновик!R19)","v":" "},{"$f":"IF(Черновик!S19=0,\" \",Черновик!S19)","v":" "},{"$f":"IF(Черновик!T19=0,\" \",Черновик!T19)","v":" "},{"$f":"IF(Черновик!U19=0,\" \",Черновик!U19)","v":" "},{"$f":"IF(Черновик!V19=0,\" \",Черновик!V19)","v":" "},{"$f":"IF(Черновик!W19=0,\" \",Черновик!W19)","v":" "},{"$f":"IF(Черновик!X19=0,\" \",Черновик!X19)","v":" "},{"$f":"IF(Черновик!Y19=0,\" \",Черновик!Y19)","v":" "},{"$f":"IF(Черновик!Z19=0,\" \",Черновик!Z19)","v":" "},{"$f":"IF(Черновик!AA19=0,\" \",Черновик!AA19)","v":" "},{"$f":"IF(Черновик!AB19=0,\" \",Черновик!AB19)","v":" "},{"$f":"IF(Черновик!AC19=0,\" \",Черновик!AC19)","v":" "},{"$f":"IF(Черновик!AD19=0,\" \",Черновик!AD19)","v":" "},{"$f":"IF(Черновик!AE19=0,\" \",Черновик!AE19)","v":" "},{"$f":"IF(Черновик!AF19=0,\" \",Черновик!AF19)","v":" "},{"$f":"IF(Черновик!AG19=0,\" \",Черновик!AG19)","v":" "},{"$f":"IF(Черновик!AH19=0,\" \",Черновик!AH19)","v":" "},{"$f":"IF(Черновик!AI19=0,\" \",Черновик!AI19)","v":" "},{"$f":"IF(Черновик!AJ19=0,\" \",Черновик!AJ19)","v":" "},{"$f":"IF(Черновик!AK19=0,\" \",Черновик!AK19)","v":" "},{"$f":"IF(Черновик!AL19=0,\" \",Черновик!AL19)","v":" "},{"$f":"IF(Черновик!AM19=0,\" \",Черновик!AM19)","v":" "},{"$f":"IF(Черновик!AN19=0,\" \",Черновик!AN19)","v":" "},{"$f":"IF(Черновик!AO19=0,\" \",Черновик!AO19)","v":" "},{"$f":"IF(Черновик!AP19=0,\" \",Черновик!AP19)","v":" "},{"$f":"IF(Черновик!AQ19=0,\" \",Черновик!AQ19)","v":" "},{"$f":"IF(Черновик!AR19=0,\" \",Черновик!AR19)","v":" "},{"$f":"IF(Черновик!AS19=0,\" \",Черновик!AS19)","v":" "},{"$f":"IF(Черновик!AT19=0,\" \",Черновик!AT19)","v":" "},{"$f":"IF(Черновик!AU19=0,\" \",Черновик!AU19)","v":" "},{"$f":"IF(Черновик!AV19=0,\" \",Черновик!AV19)","v":" "}]

{"sheet":"Как должно","index":4,"n_rows":8,"n_cols":48,"rows_kept":8,"cut":false,"hidden":false,"merged":[]}
[]
[]
[null,null,null,null,null,null,null,null,null,null,null,null,{"$f":"IF(Черновик!M3=0,\" \",Черновик!M3)","v":" "},{"$f":"IF(Черновик!N3=0,\" \",Черновик!N3)","v":" "},null,{"$f":"IF(Черновик!P3=0,\" \",Черновик!P3)","v":" "},{"$f":"IF(Черновик!Q3=0,\" \",Черновик!Q3)","v":" "},{"$f":"IF(Черновик!R3=0,\" \",Черновик!R3)","v":" "},{"$f":"IF(Черновик!S3=0,\" \",Черновик!S3)","v":" "},{"$f":"IF(Черновик!T3=0,\" \",Черновик!T3)","v":" "},null,{"$f":"IF(Черновик!V3=0,\" \",Черновик!V3)","v":" "},{"$f":"IF(Черновик!W3=0,\" \",Черновик!W3)","v":" "},null,{"$f":"IF(Черновик!Y3=0,\" \",Черновик!Y3)","v":" "},{"$f":"IF(Черновик!Z3=0,\" \",Черновик!Z3)","v":" "},{"$f":"IF(Черновик!AA3=0,\" \",Черновик!AA3)","v":" "},{"$f":"IF(Черновик!AB3=0,\" \",Черновик!AB3)","v":" "},{"$f":"IF(Черновик!AC3=0,\" \",Черновик!AC3)","v":" "},null,{"$f":"IF(Черновик!AE3=0,\" \",Черновик!AE3)","v":" "},{"$f":"IF(Черновик!AF3=0,\" \",Черновик!AF3)","v":" "},{"$f":"IF(Черновик!AG3=0,\" \",Черновик!AG3)","v":" "},{"$f":"IF(Черновик!AH3=0,\" \",Черновик!AH3)","v":" "},{"$f":"IF(Черновик!AI3=0,\" \",Черновик!AI3)","v":" "},{"$f":"IF(Черновик!AJ3=0,\" \",Черновик!AJ3)","v":" "},{"$f":"IF(Черновик!AK3=0,\" \",Черновик!AK3)","v":" "},{"$f":"IF(Черновик!AL3=0,\" \",Черновик!AL3)","v":" "},null,{"$f":"IF(Черновик!AN3=0,\" \",Черновик!AN3)","v":" "},{"$f":"IF(Черновик!AO3=0,\" \",Черновик!AO3)","v":" "},null,{"$f":"IF(Черновик!AQ3=0,\" \",Черновик!AQ3)","v":" "},{"$f":"IF(Черновик!AR3=0,\" \",Черновик!AR3)","v":" "},null,{"$f":"IF(Черновик!AT3=0,\" \",Черновик!AT3)","v":" "},{"$f":"IF(Черновик!AU3=0,\" \",Черновик!AU3)","v":" "}]
[null,null,null,null,null,null,null,null,null,null,null,{"$f":"IF(Черновик!L4=0,\" \",Черновик!L4)","v":" "},{"$f":"IF(Черновик!M4=0,\" \",Черновик!M4)","v":" "},{"$f":"IF(Черновик!N4=0,\" \",Черновик!N4)","v":" "},{"$f":"IF(Черновик!O4=0,\" \",Черновик!O4)","v":" "},{"$f":"IF(Черновик!P4=0,\" \",Черновик!P4)","v":" "},{"$f":"IF(Черновик!Q4=0,\" \",Черновик!Q4)","v":" "},{"$f":"IF(Черновик!R4=0,\" \",Черновик!R4)","v":" "},{"$f":"IF(Черновик!S4=0,\" \",Черновик!S4)","v":" "},{"$f":"IF(Черновик!T4=0,\" \",Черновик!T4)","v":" "},{"$f":"IF(Черновик!U4=0,\" \",Черновик!U4)","v":" "},{"$f":"IF(Черновик!V4=0,\" \",Черновик!V4)","v":" "},{"$f":"IF(Черновик!W4=0,\" \",Черновик!W4)","v":" "},{"$f":"IF(Черновик!X4=0,\" \",Черновик!X4)","v":" "},{"$f":"IF(Черновик!Y4=0,\" \",Черновик!Y4)","v":" "},{"$f":"IF(Черновик!Z4=0,\" \",Черновик!Z4)","v":" "},{"$f":"IF(Черновик!AA4=0,\" \",Черновик!AA4)","v":" "},{"$f":"IF(Черновик!AB4=0,\" \",Черновик!AB4)","v":" "},{"$f":"IF(Черновик!AC4=0,\" \",Черновик!AC4)","v":" "},{"$f":"IF(Черновик!AD4=0,\" \",Черновик!AD4)","v":" "},{"$f":"IF(Черновик!AE4=0,\" \",Черновик!AE4)","v":" "},{"$f":"IF(Черновик!AF4=0,\" \",Черновик!AF4)","v":" "},{"$f":"IF(Черновик!AG4=0,\" \",Черновик!AG4)","v":" "},{"$f":"IF(Черновик!AH4=0,\" \",Черновик!AH4)","v":" "},{"$f":"IF(Черновик!AI4=0,\" \",Черновик!AI4)","v":" "},{"$f":"IF(Черновик!AJ4=0,\" \",Черновик!AJ4)","v":" "},{"$f":"IF(Черновик!AK4=0,\" \",Черновик!AK4)","v":" "},{"$f":"IF(Черновик!AL4=0,\" \",Черновик!AL4)","v":" "},{"$f":"IF(Черновик!AM4=0,\" \",Черновик!AM4)","v":" "},{"$f":"IF(Черновик!AN4=0,\" \",Черновик!AN4)","v":" "},{"$f":"IF(Черновик!AO4=0,\" \",Черновик!AO4)","v":" "},{"$f":"IF(Черновик!AP4=0,\" \",Черновик!AP4)","v":" "},{"$f":"IF(Черновик!AQ4=0,\" \",Черновик!AQ4)","v":" "},{"$f":"IF(Черновик!AR4=0,\" \",Черновик!AR4)","v":" "},{"$f":"IF(Черновик!AS4=0,\" \",Черновик!AS4)","v":" "},{"$f":"IF(Черновик!AT4=0,\" \",Черновик!AT4)","v":" "},{"$f":"IF(Черновик!AU4=0,\" \",Черновик!AU4)","v":" "},{"$f":"IF(Черновик!AV4=0,\" \",Черновик!AV4)","v":" "}]
[null,null,null,null,null,null,null,null,null,null,null,{"$f":"IF(Черновик!L5=0,\" \",Черновик!L5)","v":" "},{"$f":"IF(Черновик!M5=0,\" \",Черновик!M5)","v":" "},{"$f":"IF(Черновик!N5=0,\" \",Черновик!N5)","v":" "},{"$f":"IF(Черновик!O5=0,\" \",Черновик!O5)","v":" "},{"$f":"IF(Черновик!P5=0,\" \",Черновик!P5)","v":" "},{"$f":"IF(Черновик!Q5=0,\" \",Черновик!Q5)","v":" "},{"$f":"IF(Черновик!R5=0,\" \",Черновик!R5)","v":" "},{"$f":"IF(Черновик!S5=0,\" \",Черновик!S5)","v":" "},{"$f":"IF(Черновик!T5=0,\" \",Черновик!T5)","v":" "},{"$f":"IF(Черновик!U5=0,\" \",Черновик!U5)","v":" "},{"$f":"IF(Черновик!V5=0,\" \",Черновик!V5)","v":" "},{"$f":"IF(Черновик!W5=0,\" \",Черновик!W5)","v":" "},{"$f":"IF(Черновик!X5=0,\" \",Черновик!X5)","v":" "},{"$f":"IF(Черновик!Y5=0,\" \",Черновик!Y5)","v":" "},{"$f":"IF(Черновик!Z5=0,\" \",Черновик!Z5)","v":" "},{"$f":"IF(Черновик!AA5=0,\" \",Черновик!AA5)","v":" "},{"$f":"IF(Черновик!AB5=0,\" \",Черновик!AB5)","v":" "},{"$f":"IF(Черновик!AC5=0,\" \",Черновик!AC5)","v":" "},{"$f":"IF(Черновик!AD5=0,\" \",Черновик!AD5)","v":" "},{"$f":"IF(Черновик!AE5=0,\" \",Черновик!AE5)","v":" "},{"$f":"IF(Черновик!AF5=0,\" \",Черновик!AF5)","v":" "},{"$f":"IF(Черновик!AG5=0,\" \",Черновик!AG5)","v":" "},{"$f":"IF(Черновик!AH5=0,\" \",Черновик!AH5)","v":" "},{"$f":"IF(Черновик!AI5=0,\" \",Черновик!AI5)","v":" "},{"$f":"IF(Черновик!AJ5=0,\" \",Черновик!AJ5)","v":" "},{"$f":"IF(Черновик!AK5=0,\" \",Черновик!AK5)","v":" "},{"$f":"IF(Черновик!AL5=0,\" \",Черновик!AL5)","v":" "},{"$f":"IF(Черновик!AM5=0,\" \",Черновик!AM5)","v":" "},{"$f":"IF(Черновик!AN5=0,\" \",Черновик!AN5)","v":" "},{"$f":"IF(Черновик!AO5=0,\" \",Черновик!AO5)","v":" "},{"$f":"IF(Черновик!AP5=0,\" \",Черновик!AP5)","v":" "},{"$f":"IF(Черновик!AQ5=0,\" \",Черновик!AQ5)","v":" "},{"$f":"IF(Черновик!AR5=0,\" \",Черновик!AR5)","v":" "},{"$f":"IF(Черновик!AS5=0,\" \",Черновик!AS5)","v":" "},{"$f":"IF(Черновик!AT5=0,\" \",Черновик!AT5)","v":" "},{"$f":"IF(Черновик!AU5=0,\" \",Черновик!AU5)","v":" "},{"$f":"IF(Черновик!AV5=0,\" \",Черновик!AV5)","v":" "}]
[null,null,null,null,null,null,null,null,null,null,null,{"$f":"IF(Черновик!L6=0,\" \",Черновик!L6)","v":" "},{"$f":"IF(Черновик!M6=0,\" \",Черновик!M6)","v":" "},{"$f":"IF(Черновик!N6=0,\" \",Черновик!N6)","v":" "},{"$f":"IF(Черновик!O6=0,\" \",Черновик!O6)","v":" "},{"$f":"IF(Черновик!P6=0,\" \",Черновик!P6)","v":" "},{"$f":"IF(Черновик!Q6=0,\" \",Черновик!Q6)","v":" "},{"$f":"IF(Черновик!R6=0,\" \",Черновик!R6)","v":" "},{"$f":"IF(Черновик!S6=0,\" \",Черновик!S6)","v":" "},{"$f":"IF(Черновик!T6=0,\" \",Черновик!T6)","v":" "},{"$f":"IF(Черновик!U6=0,\" \",Черновик!U6)","v":" "},{"$f":"IF(Черновик!V6=0,\" \",Черновик!V6)","v":" "},{"$f":"IF(Черновик!W6=0,\" \",Черновик!W6)","v":" "},{"$f":"IF(Черновик!X6=0,\" \",Черновик!X6)","v":" "},{"$f":"IF(Черновик!Y6=0,\" \",Черновик!Y6)","v":" "},{"$f":"IF(Черновик!Z6=0,\" \",Черновик!Z6)","v":" "},{"$f":"IF(Черновик!AA6=0,\" \",Черновик!AA6)","v":" "},{"$f":"IF(Черновик!AB6=0,\" \",Черновик!AB6)","v":" "},{"$f":"IF(Черновик!AC6=0,\" \",Черновик!AC6)","v":" "},{"$f":"IF(Черновик!AD6=0,\" \",Черновик!AD6)","v":" "},{"$f":"IF(Черновик!AE6=0,\" \",Черновик!AE6)","v":" "},{"$f":"IF(Черновик!AF6=0,\" \",Черновик!AF6)","v":" "},{"$f":"IF(Черновик!AG6=0,\" \",Черновик!AG6)","v":" "},{"$f":"IF(Черновик!AH6=0,\" \",Черновик!AH6)","v":" "},{"$f":"IF(Черновик!AI6=0,\" \",Черновик!AI6)","v":" "},{"$f":"IF(Черновик!AJ6=0,\" \",Черновик!AJ6)","v":" "},{"$f":"IF(Черновик!AK6=0,\" \",Черновик!AK6)","v":" "},{"$f":"IF(Черновик!AL6=0,\" \",Черновик!AL6)","v":" "},{"$f":"IF(Черновик!AM6=0,\" \",Черновик!AM6)","v":" "},{"$f":"IF(Черновик!AN6=0,\" \",Черновик!AN6)","v":" "},{"$f":"IF(Черновик!AO6=0,\" \",Черновик!AO6)","v":" "},{"$f":"IF(Черновик!AP6=0,\" \",Черновик!AP6)","v":" "},{"$f":"IF(Черновик!AQ6=0,\" \",Черновик!AQ6)","v":" "},{"$f":"IF(Черновик!AR6=0,\" \",Черновик!AR6)","v":" "},{"$f":"IF(Черновик!AS6=0,\" \",Черновик!AS6)","v":" "},{"$f":"IF(Черновик!AT6=0,\" \",Черновик!AT6)","v":" "},{"$f":"IF(Черновик!AU6=0,\" \",Черновик!AU6)","v":" "},{"$f":"IF(Черновик!AV6=0,\" \",Черновик!AV6)","v":" "}]
[null,null,null,null,null,null,null,null,null,null,null,{"$f":"IF(Черновик!L7=0,\" \",Черновик!L7)","v":" "},{"$f":"IF(Черновик!M7=0,\" \",Черновик!M7)","v":" "},{"$f":"IF(Черновик!N7=0,\" \",Черновик!N7)","v":" "},{"$f":"IF(Черновик!O7=0,\" \",Черновик!O7)","v":" "},{"$f":"IF(Черновик!P7=0,\" \",Черновик!P7)","v":" "},{"$f":"IF(Черновик!Q7=0,\" \",Черновик!Q7)","v":" "},{"$f":"IF(Черновик!R7=0,\" \",Черновик!R7)","v":" "},{"$f":"IF(Черновик!S7=0,\" \",Черновик!S7)","v":" "},{"$f":"IF(Черновик!T7=0,\" \",Черновик!T7)","v":" "},{"$f":"IF(Черновик!U7=0,\" \",Черновик!U7)","v":" "},{"$f":"IF(Черновик!V7=0,\" \",Черновик!V7)","v":" "},{"$f":"IF(Черновик!W7=0,\" \",Черновик!W7)","v":" "},{"$f":"IF(Черновик!X7=0,\" \",Черновик!X7)","v":" "},{"$f":"IF(Черновик!Y7=0,\" \",Черновик!Y7)","v":" "},{"$f":"IF(Черновик!Z7=0,\" \",Черновик!Z7)","v":" "},{"$f":"IF(Черновик!AA7=0,\" \",Черновик!AA7)","v":" "},{"$f":"IF(Черновик!AB7=0,\" \",Черновик!AB7)","v":" "},{"$f":"IF(Черновик!AC7=0,\" \",Черновик!AC7)","v":" "},{"$f":"IF(Черновик!AD7=0,\" \",Черновик!AD7)","v":" "},{"$f":"IF(Черновик!AE7=0,\" \",Черновик!AE7)","v":" "},{"$f":"IF(Черновик!AF7=0,\" \",Черновик!AF7)","v":" "},{"$f":"IF(Черновик!AG7=0,\" \",Черновик!AG7)","v":" "},{"$f":"IF(Черновик!AH7=0,\" \",Черновик!AH7)","v":" "},{"$f":"IF(Черновик!AI7=0,\" \",Черновик!AI7)","v":" "},{"$f":"IF(Черновик!AJ7=0,\" \",Черновик!AJ7)","v":" "},{"$f":"IF(Черновик!AK7=0,\" \",Черновик!AK7)","v":" "},{"$f":"IF(Черновик!AL7=0,\" \",Черновик!AL7)","v":" "},{"$f":"IF(Черновик!AM7=0,\" \",Черновик!AM7)","v":" "},{"$f":"IF(Черновик!AN7=0,\" \",Черновик!AN7)","v":" "},{"$f":"IF(Черновик!AO7=0,\" \",Черновик!AO7)","v":" "},{"$f":"IF(Черновик!AP7=0,\" \",Черновик!AP7)","v":" "},{"$f":"IF(Черновик!AQ7=0,\" \",Черновик!AQ7)","v":" "},{"$f":"IF(Черновик!AR7=0,\" \",Черновик!AR7)","v":" "},{"$f":"IF(Черновик!AS7=0,\" \",Черновик!AS7)","v":" "},{"$f":"IF(Черновик!AT7=0,\" \",Черновик!AT7)","v":" "},{"$f":"IF(Черновик!AU7=0,\" \",Черновик!AU7)","v":" "},{"$f":"IF(Черновик!AV7=0,\" \",Черновик!AV7)","v":" "}]
[null,null,null,null,null,null,null,null,null,null,null,null,{"$f":"IF(Черновик!M8=0,\" \",Черновик!M8)","v":" "},{"$f":"IF(Черновик!N8=0,\" \",Черновик!N8)","v":" "},null,{"$f":"IF(Черновик!P8=0,\" \",Черновик!P8)","v":" "},{"$f":"IF(Черновик!Q8=0,\" \",Черновик!Q8)","v":" "},null,{"$f":"IF(Черновик!S8=0,\" \",Черновик!S8)","v":" "},{"$f":"IF(Черновик!T8=0,\" \",Черновик!T8)","v":" "},{"$f":"IF(Черновик!U8=0,\" \",Черновик!U8)","v":" "},{"$f":"IF(Черновик!V8=0,\" \",Черновик!V8)","v":" "},{"$f":"IF(Черновик!W8=0,\" \",Черновик!W8)","v":" "},null,{"$f":"IF(Черновик!Y8=0,\" \",Черновик!Y8)","v":" "},{"$f":"IF(Черновик!Z8=0,\" \",Черновик!Z8)","v":" "},{"$f":"IF(Черновик!AA8=0,\" \",Черновик!AA8)","v":" "},{"$f":"IF(Черновик!AB8=0,\" \",Черновик!AB8)","v":" "},{"$f":"IF(Черновик!AC8=0,\" \",Черновик!AC8)","v":" "},{"$f":"IF(Черновик!AD8=0,\" \",Черновик!AD8)","v":" "},{"$f":"IF(Черновик!AE8=0,\" \",Черновик!AE8)","v":" "},{"$f":"IF(Черновик!AF8=0,\" \",Черновик!AF8)","v":" "},{"$f":"IF(Черновик!AG8=0,\" \",Черновик!AG8)","v":" "},{"$f":"IF(Черновик!AH8=0,\" \",Черновик!AH8)","v":" "},{"$f":"IF(Черновик!AI8=0,\" \",Черновик!AI8)","v":" "},null,{"$f":"IF(Черновик!AK8=0,\" \",Черновик!AK8)","v":" "},{"$f":"IF(Черновик!AL8=0,\" \",Черновик!AL8)","v":" "},null,{"$f":"IF(Черновик!AN8=0,\" \",Черновик!AN8)","v":" "},{"$f":"IF(Черновик!AO8=0,\" \",Черновик!AO8)","v":" "},null,{"$f":"IF(Черновик!AQ8=0,\" \",Черновик!AQ8)","v":" "},{"$f":"IF(Черновик!AR8=0,\" \",Черновик!AR8)","v":" "},null,{"$f":"IF(Черновик!AT8=0,\" \",Черновик!AT8)","v":" "},{"$f":"IF(Черновик!AU8=0,\" \",Черновик!AU8)","v":" "}]