{"text_format":"1","workbook":"xlsx","n_sheets":6,"sheets":["Свод_закупок","мужчины","план закуп","Лист1","размер_рост","Задание"],"not_rendered":{"charts":0,"images":0,"macros":0,"external_links":0,"defined_names":1,"comments":1,"pivot_tables":0},"unopened":[],"bounds":{"document_bytes":16777216,"sheet_cells":100000,"rows_first":2000,"rows_last":500,"rows_between":2000,"halvings":0,"cell_chars":16384,"cell_head_chars":4096},"cells_cut":0,"cells_raw":0,"read":"whole","date_system":"1900"}

{"sheet":"Свод_закупок","index":0,"n_rows":71,"n_cols":27,"rows_kept":71,"cut":false,"hidden":false,"merged":[]}
["№ п\\п","          Фамилия ","Имя ","Отчество","Должность","Наименование отдела","Одежда","Обувь","Гол. убор","Рост","Ворот","Размер футболки","Размер одежды2","Ботинки, зима","Шапка, зима","Комбинезон, зима","Куртка, зима","Обувь, лето","Китель, лето","Брюки/ юбка","Рубашка ДР","Рубашка КР","Рубашка белая ДР","Свитер/ платье","Пилотка/ кепи/ фуражка","Футболка","Галстук +зажим"]
["2021-05-20","          Фамилия ","Имя ","Отчество","Должность","Наименование отдела",null,null,null,null,null,null,null,365,1095,730,730,365,365,365,365,365,730,730,365,365,365]
[1,"Иванов","Дмитрий","Алексеевич","Механик","Производственный отдел",58,42,56,176,45,"56-58 XXL","58/176",{"$f":"IFERROR(INDEX('план закуп'!$A:$O,MATCH($A3,'план закуп'!$A:$A,0),MATCH(N$1,'план закуп'!$1:$1,0)),\"\")","v":"1"},{"$f":"IFERROR(INDEX('план закуп'!$A:$O,MATCH($A3,'план закуп'!$A:$A,0),MATCH(O$1,'план закуп'!$1:$1,0)),\"\")","v":"1"},{"$f":"IFERROR(INDEX('план закуп'!$A:$O,MATCH($A3,'план закуп'!$A:$A,0),MATCH(P$1,'план закуп'!$1:$1,0)),\"\")","v":"1"},{"$f":"IFERROR(INDEX('план закуп'!$A:$O,MATCH($A3,'план закуп'!$A:$A,0),MATCH(Q$1,'план закуп'!$1:$1,0)),\"\")","v":"1"},{"$f":"IFERROR(INDEX('план закуп'!$A:$O,MATCH($A3,'план закуп'!$A:$A,0),MATCH(R$1,'план закуп'!$1:$1,0)),\"\")","v":" "},{"$f":"IFERROR(INDEX('план закуп'!$A:$O,MATCH($A3,'план закуп'!$A:$A,0),MATCH(S$1,'план закуп'!$1:$1,0)),\"\")","v":"1"},{"$f":"IFERROR(INDEX('план закуп'!$A:$O,MATCH($A3,'план закуп'!$A:$A,0),MATCH(T$1,'план закуп'!$1:$1,0)),\"\")","v":"1"},{"$f":"IFERROR(INDEX('план закуп'!$A:$O,MATCH($A3,'план закуп'!$A:$A,0),MATCH(U$1,'план закуп'!$1:$1,0)),\"\")","v":"1"},{"$f":"IFERROR(INDEX('план закуп'!$A:$O,MATCH($A3,'план закуп'!$A:$A,0),MATCH(V$1,'план закуп'!$1:$1,0)),\"\")","v":"1"},{"$f":"IFERROR(INDEX('план закуп'!$A:$O,MATCH($A3,'план закуп'!$A:$A,0),MATCH(W$1,'план закуп'!$1:$1,0)),\"\")","v":"1"},{"$f":"IFERROR(INDEX('план закуп'!$A:$O,MATCH($A3,'план закуп'!$A:$A,0),MATCH(X$1,'план закуп'!$1:$1,0)),\"\")","v":"1"},{"$f":"IFERROR(INDEX('план закуп'!$A:$O,MATCH($A3,'план закуп'!$A:$A,0),MATCH(Y$1,'план закуп'!$1:$1,0)),\"\")","v":" "},{"$f":"IFERROR(INDEX('план закуп'!$A:$O,MATCH($A3,'план закуп'!$A:$A,0),MATCH(Z$1,'план закуп'!$1:$1,0)),\"\")","v":"1"},{"$f":"IFERROR(INDEX('план закуп'!$A:$O,MATCH($A3,'план закуп'!$A:$A,0),MATCH(AA$1,'план закуп'!$1:$1,0)),\"\")","v":" "}]
[2,"Архипов","Дамир ","Даниярович","Электрик","Производственный отдел",52,43,58,182,42,"52-54 XL","52/182",{"$f":"IFERROR(INDEX('план закуп'!$A:$O,MATCH($A4,'план закуп'!$A:$A,0),MATCH(N$1,'план закуп'!$1:$1,0)),\"\")","v":" "},{"$f":"IFERROR(INDEX('план закуп'!$A:$O,MATCH($A4,'план закуп'!$A:$A,0),MATCH(O$1,'план закуп'!$1:$1,0)),\"\")","v":"1"},{"$f":"IFERROR(INDEX('план закуп'!$A:$O,MATCH($A4,'план закуп'!$A:$A,0),MATCH(P$1,'план закуп'!$1:$1,0)),\"\")","v":" "},{"$f":"IFERROR(INDEX('план закуп'!$A:$O,MATCH($A4,'план закуп'!$A:$A,0),MATCH(Q$1,'план закуп'!$1:$1,0)),\"\")","v":" "},{"$f":"IFERROR(INDEX('план закуп'!$A:$O,MATCH($A4,'план закуп'!$A:$A,0),MATCH(R$1,'план закуп'!$1:$1,0)),\"\")","v":" "},{"$f":"IFERROR(INDEX('план закуп'!$A:$O,MATCH($A4,'план закуп'!$A:$A,0),MATCH(S$1,'план закуп'!$1:$1,0)),\"\")","v":" "},{"$f":"IFERROR(INDEX('план закуп'!$A:$O,MATCH($A4,'план закуп'!$A:$A,0),MATCH(T$1,'план закуп'!$1:$1,0)),\"\")","v":" "},{"$f":"IFERROR(INDEX('план закуп'!$A:$O,MATCH($A4,'план закуп'!$A:$A,0),MATCH(U$1,'план закуп'!$1:$1,0)),\"\")","v":" "},{"$f":"IFERROR(INDEX('план закуп'!$A:$O,MATCH($A4,'план закуп'!$A:$A,0),MATCH(V$1,'план закуп'!$1:$1,0)),\"\")","v":" "},{"$f":"IFERROR(INDEX('план закуп'!$A:$O,MATCH($A4,'план закуп'!$A:$A,0),MATCH(W$1,'план закуп'!$1:$1,0)),\"\")","v":"1"},{"$f":"IFERROR(INDEX('план закуп'!$A:$O,MATCH($A4,'план закуп'!$A:$A,0),MATCH(X$1,'план закуп'!$1:$1,0)),\"\")","v":"1"},{"$f":"IFERROR(INDEX('план закуп'!$A:$O,MATCH($A4,'план закуп'!$A:$A,0),MATCH(Y$1,'план закуп'!$1:$1,0)),\"\")","v":" "},{"$f":"IFERROR(INDEX('план закуп'!$A:$O,MATCH($A4,'план закуп'!$A:$A,0),MATCH(Z$1,'план закуп'!$1:$1,0)),\"\")","v":"1"},{"$f":"IFERROR(INDEX('план закуп'!$A:$O,MATCH($A4,'план закуп'!$A:$A,0),MATCH(AA$1,'план закуп'!$1:$1,0)),\"\")","v":" "}]
[3,"Иванов","Дмитрий","Алексеевич","Механик","Производственный отдел",54,45,58,182,43,"52-54 XL","54/182",{"$f":"IFERROR(INDEX('план закуп'!$A:$O,MATCH($A5,'план закуп'!$A:$A,0),MATCH(N$1,'план закуп'!$1:$1,0)),\"\")","v":" "},{"$f":"IFERROR(INDEX('план закуп'!$A:$O,MATCH($A5,'план закуп'!$A:$A,0),MATCH(O$1,'план закуп'!$1:$1,0)),\"\")","v":"1"},{"$f":"IFERROR(INDEX('план закуп'!$A:$O,MATCH($A5,'план закуп'!$A:$A,0),MATCH(P$1,'план закуп'!$1:$1,0)),\"\")","v":"1"},{"$f":"IFERROR(INDEX('план закуп'!$A:$O,MATCH($A5,'план закуп'!$A:$A,0),MATCH(Q$1,'план закуп'!$1:$1,0)),\"\")","v":"1"},{"$f":"IFERROR(INDEX('план закуп'!$A:$O,MATCH($A5,'план закуп'!$A:$A,0),MATCH(R$1,'план закуп'!$1:$1,0)),\"\")","v":"1"},{"$f":"IFERROR(INDEX('план закуп'!$A:$O,MATCH($A5,'план закуп'!$A:$A,0),MATCH(S$1,'план закуп'!$1:$1,0)),\"\")","v":"1"},{"$f":"IFERROR(INDEX('план закуп'!$A:$O,MATCH($A5,'план закуп'!$A:$A,0),MATCH(T$1,'план закуп'!$1:$1,0)),\"\")","v":" "},{"$f":"IFERROR(INDEX('план закуп'!$A:$O,MATCH($A5,'план закуп'!$A:$A,0),MATCH(U$1,'план закуп'!$1:$1,0)),\"\")","v":"1"},{"$f":"IFERROR(INDEX('план закуп'!$A:$O,MATCH($A5,'план закуп'!$A:$A,0),MATCH(V$1,'план закуп'!$1:$1,0)),\"\")","v":" "},{"$f":"IFERROR(INDEX('план закуп'!$A:$O,MATCH($A5,'план закуп'!$A:$A,0),MATCH(W$1,'план закуп'!$1:$1,0)),\"\")","v":" "},{"$f":"IFERROR(INDEX('план закуп'!$A:$O,MATCH($A5,'план закуп'!$A:$A,0),MATCH(X$1,'план закуп'!$1:$1,0)),\"\")","v":"1"},{"$f":"IFERROR(INDEX('план закуп'!$A:$O,MATCH($A5,'план закуп'!$A:$A,0),MATCH(Y$1,'план закуп'!$1:$1,0)),\"\")","v":" "},{"$f":"IFERROR(INDEX('план закуп'!$A:$O,MATCH($A5,'план закуп'!$A:$A,0),MATCH(Z$1,'план закуп'!$1:$1,0)),\"\")","v":"1"},{"$f":"IFERROR(INDEX('план закуп'!$A:$O,MATCH($A5,'план закуп'!$A:$A,0),MATCH(AA$1,'план закуп'!$1:$1,0)),\"\")","v":" "}]
[4,"Архипов","Дамир ","Даниярович","Электрик","Производственный отдел",52,41,56,175,42,"52-54 XL","52/176",{"$f":"IFERROR(INDEX('план закуп'!$A:$O,MATCH($A6,'план закуп'!$A:$A,0),MATCH(N$1,'план закуп'!$1:$1,0)),\"\")","v":" "},{"$f":"IFERROR(INDEX('план закуп'!$A:$O,MATCH($A6,'план закуп'!$A:$A,0),MATCH(O$1,'план закуп'!$1:$1,0)),\"\")","v":"1"},{"$f":"IFERROR(INDEX('план закуп'!$A:$O,MATCH($A6,'план закуп'!$A:$A,0),MATCH(P$1,'план закуп'!$1:$1,0)),\"\")","v":"1"},{"$f":"IFERROR(INDEX('план закуп'!$A:$O,MATCH($A6,'план закуп'!$A:$A,0),MATCH(Q$1,'план закуп'!$1:$1,0)),\"\")","v":"1"},{"$f":"IFERROR(INDEX('план закуп'!$A:$O,MATCH($A6,'план закуп'!$A:$A,0),MATCH(R$1,'план закуп'!$1:$1,0)),\"\")","v":" "},{"$f":"IFERROR(INDEX('план закуп'!$A:$O,MATCH($A6,'план закуп'!$A:$A,0),MATCH(S$1,'план закуп'!$1:$1,0)),\"\")","v":"1"},{"$f":"IFERROR(INDEX('план закуп'!$A:$O,MATCH($A6,'план закуп'!$A:$A,0),MATCH(T$1,'план закуп'!$1:$1,0)),\"\")","v":"1"},{"$f":"IFERROR(INDEX('план закуп'!$A:$O,MATCH($A6,'план закуп'!$A:$A,0),MATCH(U$1,'план закуп'!$1:$1,0)),\"\")","v":"1"},{"$f":"IFERROR(INDEX('план закуп'!$A:$O,MATCH($A6,'план закуп'!$A:$A,0),MATCH(V$1,'план закуп'!$1:$1,0)),\"\")","v":"1"},{"$f":"IFERROR(INDEX('план закуп'!$A:$O,MATCH($A6,'план закуп'!$A:$A,0),MATCH(W$1,'план закуп'!$1:$1,0)),\"\")","v":"1"},{"$f":"IFERROR(INDEX('план закуп'!$A:$O,MATCH($A6,'план закуп'!$A:$A,0),MATCH(X$1,'план закуп'!$1:$1,0)),\"\")","v":"1"},{"$f":"IFERROR(INDEX('план закуп'!$A:$O,MATCH($A6,'план закуп'!$A:$A,0),MATCH(Y$1,'план закуп'!$1:$1,0)),\"\")","v":" "},{"$f":"IFERROR(INDEX('план закуп'!$A:$O,MATCH($A6,'план закуп'!$A:$A,0),MATCH(Z$1,'план закуп'!$1:$1,0)),\"\")","v":"1"},{"$f":"IFERROR(INDEX('план закуп'!$A:$O,MATCH($A6,'план закуп'!$A:$A,0),MATCH(AA$1,'план закуп'!$1:$1,0)),\"\")","v":" "}]
{"$rows_left_out":66}
{"sheet":"мужчины","index":1,"n_rows":72,"n_cols":32,"rows_kept":72,"cut":false,"hidden":false,"merged":[]}
["№ п\\п","          Фамилия ","Имя ","Отчество","Должность","Наименование отдела","Одежда","Обувь","Гол. убор","Рост","Ворот","Размер футболки","Размер одежды2","Ботинки, зима","Шапка, зима","Комбинезон, зима","Куртка, зима","Обувь, лето","Китель, лето","Брюки/ юбка","Рубашка ДР","Рубашка КР","Рубашка белая ДР","Свитер/ платье","Пилотка/ кепи/ фуражка","Футболка","Галстук +зажим",null,"обеспечен","не обеспечен","обеспечен с истекшим сроком носки"]
[{"$f":"TODAY()","v":"2021-05-20"},"          Фамилия ","Имя ","Отчество","Должность","Наименование отдела",null,null,null,null,null,null,null,365,1095,730,730,365,365,365,365,365,730,730,365,365,365]
[1,"Иванов","Дмитрий","Алексеевич","Механик","Производственный отдел",58,42,56,176,45,"56-58 XXL","58/176","2019-12-01",null,null,"2020-02-01","2021-09-01",null,null,null,null,null,null,"+",null,"+",null,null,"+"]
[{"$f":"A3+1","v":2},"Архипов","Дамир ","Даниярович","Электрик","Производственный отдел",52,43,58,182,42,"52-54 XL","52/182","2022-01-01",null,"2023-01-01","2023-01-01","2022-06-01","2022-01-01","2022-01-01","2022-01-01","2022-01-01",null,null,"+",null,"+",null,"+"]
[3,"Иванов","Дмитрий","Алексеевич","Механик","Производственный отдел",54,45,58,182,43,"52-54 XL","54/182","2022-03-01",null,"2020-12-01","2020-10-01","2020-06-01","2020-07-01","2022-03-01","2019-12-01","2022-03-01","2021-06-01",null,"+",null,"+",null,null,null,"+"]
[4,"Архипов","Дамир ","Даниярович","Электрик","Производственный отдел",52,41,56,175,42,"52-54 XL","52/176","2022-02-01",null,"2021-03-01","2021-03-01","2022-06-01","2020-03-01","2020-03-01","2019-08-01","2020-08-01","2021-03-01","2019-01-01","+",null,"+",null,null,null,"+"]
{"$rows_left_out":67}
{"sheet":"план закуп","index":2,"n_rows":71,"n_cols":17,"rows_kept":71,"cut":false,"hidden":false,"merged":[]}
["№ п\\п","Ботинки, зима","Шапка, зима","Комбинезон, зима","Куртка, зима","Обувь, лето","Китель, лето","Брюки/ юбка","Рубашка ДР","Рубашка КР","Рубашка белая ДР","Свитер/ платье","Пилотка/ кепи/ фуражка","Футболка","Галстук +зажим"]
[{"$f":"TODAY()","v":"2021-05-20"},365,1095,730,730,365,365,365,365,365,730,730,365,365,365]
[1,{"$f":"IF(Таблица1[[#This Row],[Ботинки, зима]]<TODAY(),\"1\",\" \")","v":"1"},{"$f":"IF(Таблица1[[#This Row],[Шапка, зима]]<TODAY(),\"1\",\" \")","v":"1"},{"$f":"IF(Таблица1[[#This Row],[Комбинезон, зима]]<TODAY(),\"1\",\" \")","v":"1"},{"$f":"IF(Таблица1[[#This Row],[Куртка, зима]]<TODAY(),\"1\",\" \")","v":"1"},{"$f":"IF(Таблица1[[#This Row],[Обувь, лето]]<TODAY(),\"1\",\" \")","v":" "},{"$f":"IF(Таблица1[[#This Row],[Китель, лето]]<TODAY(),\"1\",\" \")","v":"1"},{"$f":"IF(Таблица1[[#This Row],[Брюки/ юбка]]<TODAY(),\"1\",\" \")","v":"1"},{"$f":"IF(Таблица1[[#This Row],[Рубашка ДР]]<TODAY(),\"1\",\" \")","v":"1"},{"$f":"IF(Таблица1[[#This Row],[Рубашка КР]]<TODAY(),\"1\",\" \")","v":"1"},{"$f":"IF(Таблица1[[#This Row],[Рубашка белая ДР]]<TODAY(),\"1\",\" \")","v":"1"},{"$f":"IF(Таблица1[[#This Row],[Свитер/ платье]]<TODAY(),\"1\",\" \")","v":"1"},{"$f":"IF(Таблица1[[#This Row],[Пилотка/ кепи/ фуражка]]<TODAY(),\"1\",\" \")","v":" "},{"$f":"IF(Таблица1[[#This Row],[Футболка]]<TODAY(),\"1\",\" \")","v":"1"},{"$f":"IF(Таблица1[[#This Row],[Галстук +зажим]]<TODAY(),\"1\",\" \")","v":" "}]
[{"$f":"A3+1","v":2},{"$f":"IF(Таблица1[[#This Row],[Ботинки, зима]]<TODAY(),\"1\",\" \")","v":" "},{"$f":"IF(Таблица1[[#This Row],[Шапка, зима]]<TODAY(),\"1\",\" \")","v":"1"},{"$f":"IF(Таблица1[[#This Row],[Комбинезон, зима]]<TODAY(),\"1\",\" \")","v":" "},{"$f":"IF(Таблица1[[#This Row],[Куртка, зима]]<TODAY(),\"1\",\" \")","v":" "},{"$f":"IF(Таблица1[[#This Row],[Обувь, лето]]<TODAY(),\"1\",\" \")","v":" "},{"$f":"IF(Таблица1[[#This Row],[Китель, лето]]<TODAY(),\"1\",\" \")","v":" "},{"$f":"IF(Таблица1[[#This Row],[Брюки/ юбка]]<TODAY(),\"1\",\" \")","v":" "},{"$f":"IF(Таблица1[[#This Row],[Рубашка ДР]]<TODAY(),\"1\",\" \")","v":" "},{"$f":"IF(Таблица1[[#This Row],[Рубашка КР]]<TODAY(),\"1\",\" \")","v":" "},{"$f":"IF(Таблица1[[#This Row],[Рубашка белая ДР]]<TODAY(),\"1\",\" \")","v":"1"},{"$f":"IF(Таблица1[[#This Row],[Свитер/ платье]]<TODAY(),\"1\",\" \")","v":"1"},{"$f":"IF(Таблица1[[#This Row],[Пилотка/ кепи/ фуражка]]<TODAY(),\"1\",\" \")","v":" "},{"$f":"IF(Таблица1[[#This Row],[Футболка]]<TODAY(),\"1\",\" \")","v":"1"},{"$f":"IF(Таблица1[[#This Row],[Галстук +зажим]]<TODAY(),\"1\",\" \")","v":" "},null,{"$f":"TEXT(Таблица16[[#This Row],[Шапка, зима]],Таблица16[[#This Row],[Шапка, зима]]*1)","v":"1"}]
[3,{"$f":"IF(Таблица1[[#This Row],[Ботинки, зима]]<TODAY(),\"1\",\" \")","v":" "},{"$f":"IF(Таблица1[[#This Row],[Шапка, зима]]<TODAY(),\"1\",\" \")","v":"1"},{"$f":"IF(Таблица1[[#This Row],[Комбинезон, зима]]<TODAY(),\"1\",\" \")","v":"1"},{"$f":"IF(Таблица1[[#This Row],[Куртка, зима]]<TODAY(),\"1\",\" \")","v":"1"},{"$f":"IF(Таблица1[[#This Row],[Обувь, лето]]<TODAY(),\"1\",\" \")","v":"1"},{"$f":"IF(Таблица1[[#This Row],[Китель, лето]]<TODAY(),\"1\",\" \")","v":"1"},{"$f":"IF(Таблица1[[#This Row],[Брюки/ юбка]]<TODAY(),\"1\",\" \")","v":" "},{"$f":"IF(Таблица1[[#This Row],[Рубашка ДР]]<TODAY(),\"1\",\" \")","v":"1"},{"$f":"IF(Таблица1[[#This Row],[Рубашка КР]]<TODAY(),\"1\",\" \")","v":" "},{"$f":"IF(Таблица1[[#This Row],[Рубашка белая ДР]]<TODAY(),\"1\",\" \")","v":" "},{"$f":"IF(Таблица1[[#This Row],[Свитер/ платье]]<TODAY(),\"1\",\" \")","v":"1"},{"$f":"IF(Таблица1[[#This Row],[Пилотка/ кепи/ фуражка]]<TODAY(),\"1\",\" \")","v":" "},{"$f":"IF(Таблица1[[#This Row],[Футболка]]<TODAY(),\"1\",\" \")","v":"1"},{"$f":"IF(Таблица1[[#This Row],[Галстук +зажим]]<TODAY(),\"1\",\" \")","v":" "}]
[4,{"$f":"IF(Таблица1[[#This Row],[Ботинки, зима]]<TODAY(),\"1\",\" \")","v":" "},{"$f":"IF(Таблица1[[#This Row],[Шапка, зима]]<TODAY(),\"1\",\" \")","v":"1"},{"$f":"IF(Таблица1[[#This Row],[Комбинезон, зима]]<TODAY(),\"1\",\" \")","v":"1"},{"$f":"IF(Таблица1[[#This Row],[Куртка, зима]]<TODAY(),\"1\",\" \")","v":"1"},{"$f":"IF(Таблица1[[#This Row],[Обувь, лето]]<TODAY(),\"1\",\" \")","v":" "},{"$f":"IF(Таблица1[[#This Row],[Китель, лето]]<TODAY(),\"1\",\" \")","v":"1"},{"$f":"IF(Таблица1[[#This Row],[Брюки/ юбка]]<TODAY(),\"1\",\" \")","v":"1"},{"$f":"IF(Таблица1[[#This Row],[Рубашка ДР]]<TODAY(),\"1\",\" \")","v":"1"},{"$f":"IF(Таблица1[[#This Row],[Рубашка КР]]<TODAY(),\"1\",\" \")","v":"1"},{"$f":"IF(Таблица1[[#This Row],[Рубашка белая ДР]]<TODAY(),\"1\",\" \")","v":"1"},{"$f":"IF(Таблица1[[#This Row],[Свитер/ платье]]<TODAY(),\"1\",\" \")","v":"1"},{"$f":"IF(Таблица1[[#This Row],[Пилотка/ кепи/ фуражка]]<TODAY(),\"1\",\" \")","v":" "},{"$f":"IF(Таблица1[[#This Row],[Футболка]]<TODAY(),\"1\",\" \")","v":"1"},{"$f":"IF(Таблица1[[#This Row],[Галстук +зажим]]<TODAY(),\"1\",\" \")","v":" "}]
{"$rows_left_out":66}
{"sheet":"Лист1","index":3,"n_rows":73,"n_cols":53,"rows_kept":73,"cut":false,"hidden":false,"merged":[]}
[]
[null,null,null,null,"2019-01-01","2019-02-01","2019-03-01","2019-04-01","2019-05-01","2019-06-01","2019-07-01","2019-08-01","2019-09-01","2019-10-01","2019-11-01","2019-12-01","2020-01-01","2020-02-01","2020-03-01","2020-04-01","2020-05-01","2020-06-01","2020-07-01","2020-08-01","2020-09-01","2020-10-01","2020-11-01","2020-12-01","2021-01-01","2021-02-01","2021-03-01","2021-04-01","2021-05-01","2021-06-01","2021-07-01","2021-08-01","2021-09-01","2021-10-01","2021-11-01","2021-12-01","2022-01-01","2022-02-01","2022-03-01","2022-04-01","2022-05-01","2022-06-01","2022-07-01","2022-08-01","2022-09-01","2022-10-01","2022-11-01","2022-12-01","2023-01-01"]
[null,"Обувь зима"]
[null,null,null,39,{"$f":"COUNTIFS(мужчины!$H:$H,$D4,мужчины!$N:$N,E$2)","v":0},{"$f":"COUNTIFS(мужчины!$H:$H,$D4,мужчины!$N:$N,F$2)","v":0},{"$f":"COUNTIFS(мужчины!$H:$H,$D4,мужчины!$N:$N,G$2)","v":0},{"$f":"COUNTIFS(мужчины!$H:$H,$D4,мужчины!$N:$N,H$2)","v":0},{"$f":"COUNTIFS(мужчины!$H:$H,$D4,мужчины!$N:$N,I$2)","v":0},{"$f":"COUNTIFS(мужчины!$H:$H,$D4,мужчины!$N:$N,J$2)","v":0},{"$f":"COUNTIFS(мужчины!$H:$H,$D4,мужчины!$N:$N,K$2)","v":0},{"$f":"COUNTIFS(мужчины!$H:$H,$D4,мужчины!$N:$N,L$2)","v":0},{"$f":"COUNTIFS(мужчины!$H:$H,$D4,мужчины!$N:$N,M$2)","v":0},{"$f":"COUNTIFS(мужчины!$H:$H,$D4,мужчины!$N:$N,N$2)","v":0},{"$f":"COUNTIFS(мужчины!$H:$H,$D4,мужчины!$N:$N,O$2)","v":0},{"$f":"COUNTIFS(мужчины!$H:$H,$D4,мужчины!$N:$N,P$2)","v":1},{"$f":"COUNTIFS(мужчины!$H:$H,$D4,мужчины!$N:$N,Q$2)","v":0},{"$f":"COUNTIFS(мужчины!$H:$H,$D4,мужчины!$N:$N,R$2)","v":0},{"$f":"COUNTIFS(мужчины!$H:$H,$D4,мужчины!$N:$N,S$2)","v":0},{"$f":"COUNTIFS(мужчины!$H:$H,$D4,мужчины!$N:$N,T$2)","v":0},{"$f":"COUNTIFS(мужчины!$H:$H,$D4,мужчины!$N:$N,U$2)","v":0},{"$f":"COUNTIFS(мужчины!$H:$H,$D4,мужчины!$N:$N,V$2)","v":0},{"$f":"COUNTIFS(мужчины!$H:$H,$D4,мужчины!$N:$N,W$2)","v":0},{"$f":"COUNTIFS(мужчины!$H:$H,$D4,мужчины!$N:$N,X$2)","v":0},{"$f":"COUNTIFS(мужчины!$H:$H,$D4,мужчины!$N:$N,Y$2)","v":0},{"$f":"COUNTIFS(мужчины!$H:$H,$D4,мужчины!$N:$N,Z$2)","v":0},{"$f":"COUNTIFS(мужчины!$H:$H,$D4,мужчины!$N:$N,AA$2)","v":0},{"$f":"COUNTIFS(мужчины!$H:$H,$D4,мужчины!$N:$N,AB$2)","v":0},{"$f":"COUNTIFS(мужчины!$H:$H,$D4,мужчины!$N:$N,AC$2)","v":0},{"$f":"COUNTIFS(мужчины!$H:$H,$D4,мужчины!$N:$N,AD$2)","v":0},{"$f":"COUNTIFS(мужчины!$H:$H,$D4,мужчины!$N:$N,AE$2)","v":0},{"$f":"COUNTIFS(мужчины!$H:$H,$D4,мужчины!$N:$N,AF$2)","v":0},{"$f":"COUNTIFS(мужчины!$H:$H,$D4,мужчины!$N:$N,AG$2)","v":0},{"$f":"COUNTIFS(мужчины!$H:$H,$D4,мужчины!$N:$N,AH$2)","v":0},{"$f":"COUNTIFS(мужчины!$H:$H,$D4,мужчины!$N:$N,AI$2)","v":0},{"$f":"COUNTIFS(мужчины!$H:$H,$D4,мужчины!$N:$N,AJ$2)","v":0},{"$f":"COUNTIFS(мужчины!$H:$H,$D4,мужчины!$N:$N,AK$2)","v":0},{"$f":"COUNTIFS(мужчины!$H:$H,$D4,мужчины!$N:$N,AL$2)","v":0},{"$f":"COUNTIFS(мужчины!$H:$H,$D4,мужчины!$N:$N,AM$2)","v":0},{"$f":"COUNTIFS(мужчины!$H:$H,$D4,мужчины!$N:$N,AN$2)","v":0},{"$f":"COUNTIFS(мужчины!$H:$H,$D4,мужчины!$N:$N,AO$2)","v":0},{"$f":"COUNTIFS(мужчины!$H:$H,$D4,мужчины!$N:$N,AP$2)","v":0},{"$f":"COUNTIFS(мужчины!$H:$H,$D4,мужчины!$N:$N,AQ$2)","v":0},{"$f":"COUNTIFS(мужчины!$H:$H,$D4,мужчины!$N:$N,AR$2)","v":0},{"$f":"COUNTIFS(мужчины!$H:$H,$D4,мужчины!$N:$N,AS$2)","v":0},{"$f":"COUNTIFS(мужчины!$H:$H,$D4,мужчины!$N:$N,AT$2)","v":0},{"$f":"COUNTIFS(мужчины!$H:$H,$D4,мужчины!$N:$N,AU$2)","v":0},{"$f":"COUNTIFS(мужчины!$H:$H,$D4,мужчины!$N:$N,AV$2)","v":0},{"$f":"COUNTIFS(мужчины!$H:$H,$D4,мужчины!$N:$N,AW$2)","v":0},{"$f":"COUNTIFS(мужчины!$H:$H,$D4,мужчины!$N:$N,AX$2)","v":0},{"$f":"COUNTIFS(мужчины!$H:$H,$D4,мужчины!$N:$N,AY$2)","v":0},{"$f":"COUNTIFS(мужчины!$H:$H,$D4,мужчины!$N:$N,AZ$2)","v":0},{"$f":"COUNTIFS(мужчины!$H:$H,$D4,мужчины!$N:$N,BA$2)","v":0}]
[null,null,null,40,{"$f":"COUNTIFS(мужчины!$H:$H,$D5,мужчины!$N:$N,E$2)","v":0},{"$f":"COUNTIFS(мужчины!$H:$H,$D5,мужчины!$N:$N,F$2)","v":0},{"$f":"COUNTIFS(мужчины!$H:$H,$D5,мужчины!$N:$N,G$2)","v":0},{"$f":"COUNTIFS(мужчины!$H:$H,$D5,мужчины!$N:$N,H$2)","v":0},{"$f":"COUNTIFS(мужчины!$H:$H,$D5,мужчины!$N:$N,I$2)","v":0},{"$f":"COUNTIFS(мужчины!$H:$H,$D5,мужчины!$N:$N,J$2)","v":0},{"$f":"COUNTIFS(мужчины!$H:$H,$D5,мужчины!$N:$N,K$2)","v":0},{"$f":"COUNTIFS(мужчины!$H:$H,$D5,мужчины!$N:$N,L$2)","v":0},{"$f":"COUNTIFS(мужчины!$H:$H,$D5,мужчины!$N:$N,M$2)","v":0},{"$f":"COUNTIFS(мужчины!$H:$H,$D5,мужчины!$N:$N,N$2)","v":0},{"$f":"COUNTIFS(мужчины!$H:$H,$D5,мужчины!$N:$N,O$2)","v":0},{"$f":"COUNTIFS(мужчины!$H:$H,$D5,мужчины!$N:$N,P$2)","v":0},{"$f":"COUNTIFS(мужчины!$H:$H,$D5,мужчины!$N:$N,Q$2)","v":0},{"$f":"COUNTIFS(мужчины!$H:$H,$D5,мужчины!$N:$N,R$2)","v":0},{"$f":"COUNTIFS(мужчины!$H:$H,$D5,мужчины!$N:$N,S$2)","v":0},{"$f":"COUNTIFS(мужчины!$H:$H,$D5,мужчины!$N:$N,T$2)","v":0},{"$f":"COUNTIFS(мужчины!$H:$H,$D5,мужчины!$N:$N,U$2)","v":0},{"$f":"COUNTIFS(мужчины!$H:$H,$D5,мужчины!$N:$N,V$2)","v":0},{"$f":"COUNTIFS(мужчины!$H:$H,$D5,мужчины!$N:$N,W$2)","v":0},{"$f":"COUNTIFS(мужчины!$H:$H,$D5,мужчины!$N:$N,X$2)","v":0},{"$f":"COUNTIFS(мужчины!$H:$H,$D5,мужчины!$N:$N,Y$2)","v":0},{"$f":"COUNTIFS(мужчины!$H:$H,$D5,мужчины!$N:$N,Z$2)","v":0},{"$f":"COUNTIFS(мужчины!$H:$H,$D5,мужчины!$N:$N,AA$2)","v":0},{"$f":"COUNTIFS(мужчины!$H:$H,$D5,мужчины!$N:$N,AB$2)","v":0},{"$f":"COUNTIFS(мужчины!$H:$H,$D5,мужчины!$N:$N,AC$2)","v":0},{"$f":"COUNTIFS(мужчины!$H:$H,$D5,мужчины!$N:$N,AD$2)","v":0},{"$f":"COUNTIFS(мужчины!$H:$H,$D5,мужчины!$N:$N,AE$2)","v":0},{"$f":"COUNTIFS(мужчины!$H:$H,$D5,мужчины!$N:$N,AF$2)","v":0},{"$f":"COUNTIFS(мужчины!$H:$H,$D5,мужчины!$N:$N,AG$2)","v":0},{"$f":"COUNTIFS(мужчины!$H:$H,$D5,мужчины!$N:$N,AH$2)","v":0},{"$f":"COUNTIFS(мужчины!$H:$H,$D5,мужчины!$N:$N,AI$2)","v":0},{"$f":"COUNTIFS(мужчины!$H:$H,$D5,мужчины!$N:$N,AJ$2)","v":0},{"$f":"COUNTIFS(мужчины!$H:$H,$D5,мужчины!$N:$N,AK$2)","v":0},{"$f":"COUNTIFS(мужчины!$H:$H,$D5,мужчины!$N:$N,AL$2)","v":0},{"$f":"COUNTIFS(мужчины!$H:$H,$D5,мужчины!$N:$N,AM$2)","v":0},{"$f":"COUNTIFS(мужчины!$H:$H,$D5,мужчины!$N:$N,AN$2)","v":0},{"$f":"COUNTIFS(мужчины!$H:$H,$D5,мужчины!$N:$N,AO$2)","v":1},{"$f":"COUNTIFS(мужчины!$H:$H,$D5,мужчины!$N:$N,AP$2)","v":0},{"$f":"COUNTIFS(мужчины!$H:$H,$D5,мужчины!$N:$N,AQ$2)","v":0},{"$f":"COUNTIFS(мужчины!$H:$H,$D5,мужчины!$N:$N,AR$2)","v":0},{"$f":"COUNTIFS(мужчины!$H:$H,$D5,мужчины!$N:$N,AS$2)","v":0},{"$f":"COUNTIFS(мужчины!$H:$H,$D5,мужчины!$N:$N,AT$2)","v":0},{"$f":"COUNTIFS(мужчины!$H:$H,$D5,мужчины!$N:$N,AU$2)","v":0},{"$f":"COUNTIFS(мужчины!$H:$H,$D5,мужчины!$N:$N,AV$2)","v":0},{"$f":"COUNTIFS(мужчины!$H:$H,$D5,мужчины!$N:$N,AW$2)","v":0},{"$f":"COUNTIFS(мужчины!$H:$H,$D5,мужчины!$N:$N,AX$2)","v":0},{"$f":"COUNTIFS(мужчины!$H:$H,$D5,мужчины!$N:$N,AY$2)","v":0},{"$f":"COUNTIFS(мужчины!$H:$H,$D5,мужчины!$N:$N,AZ$2)","v":0},{"$f":"COUNTIFS(мужчины!$H:$H,$D5,мужчины!$N:$N,BA$2)","v":0}]
[null,null,null,41,{"$f":"COUNTIFS(мужчины!$H:$H,$D6,мужчины!$N:$N,E$2)","v":0},{"$f":"COUNTIFS(мужчины!$H:$H,$D6,мужчины!$N:$N,F$2)","v":0},{"$f":"COUNTIFS(мужчины!$H:$H,$D6,мужчины!$N:$N,G$2)","v":0},{"$f":"COUNTIFS(мужчины!$H:$H,$D6,мужчины!$N:$N,H$2)","v":0},{"$f":"COUNTIFS(мужчины!$H:$H,$D6,мужчины!$N:$N,I$2)","v":0},{"$f":"COUNTIFS(мужчины!$H:$H,$D6,мужчины!$N:$N,J$2)","v":0},{"$f":"COUNTIFS(мужчины!$H:$H,$D6,мужчины!$N:$N,K$2)","v":0},{"$f":"COUNTIFS(мужчины!$H:$H,$D6,мужчины!$N:$N,L$2)","v":0},{"$f":"COUNTIFS(мужчины!$H:$H,$D6,мужчины!$N:$N,M$2)","v":0},{"$f":"COUNTIFS(мужчины!$H:$H,$D6,мужчины!$N:$N,N$2)","v":0},{"$f":"COUNTIFS(мужчины!$H:$H,$D6,мужчины!$N:$N,O$2)","v":0},{"$f":"COUNTIFS(мужчины!$H:$H,$D6,мужчины!$N:$N,P$2)","v":2},{"$f":"COUNTIFS(мужчины!$H:$H,$D6,мужчины!$N:$N,Q$2)","v":0},{"$f":"COUNTIFS(мужчины!$H:$H,$D6,мужчины!$N:$N,R$2)","v":0},{"$f":"COUNTIFS(мужчины!$H:$H,$D6,мужчины!$N:$N,S$2)","v":0},{"$f":"COUNTIFS(мужчины!$H:$H,$D6,мужчины!$N:$N,T$2)","v":0},{"$f":"COUNTIFS(мужчины!$H:$H,$D6,мужчины!$N:$N,U$2)","v":0},{"$f":"COUNTIFS(мужчины!$H:$H,$D6,мужчины!$N:$N,V$2)","v":0},{"$f":"COUNTIFS(мужчины!$H:$H,$D6,мужчины!$N:$N,W$2)","v":0},{"$f":"COUNTIFS(мужчины!$H:$H,$D6,мужчины!$N:$N,X$2)","v":0},{"$f":"COUNTIFS(мужчины!$H:$H,$D6,мужчины!$N:$N,Y$2)","v":0},{"$f":"COUNTIFS(мужчины!$H:$H,$D6,мужчины!$N:$N,Z$2)","v":0},{"$f":"COUNTIFS(мужчины!$H:$H,$D6,мужчины!$N:$N,AA$2)","v":0},{"$f":"COUNTIFS(мужчины!$H:$H,$D6,мужчины!$N:$N,AB$2)","v":0},{"$f":"COUNTIFS(мужчины!$H:$H,$D6,мужчины!$N:$N,AC$2)","v":1},{"$f":"COUNTIFS(мужчины!$H:$H,$D6,мужчины!$N:$N,AD$2)","v":0},{"$f":"COUNTIFS(мужчины!$H:$H,$D6,мужчины!$N:$N,AE$2)","v":0},{"$f":"COUNTIFS(мужчины!$H:$H,$D6,мужчины!$N:$N,AF$2)","v":0},{"$f":"COUNTIFS(мужчины!$H:$H,$D6,мужчины!$N:$N,AG$2)","v":0},{"$f":"COUNTIFS(мужчины!$H:$H,$D6,мужчины!$N:$N,AH$2)","v":0},{"$f":"COUNTIFS(мужчины!$H:$H,$D6,мужчины!$N:$N,AI$2)","v":0},{"$f":"COUNTIFS(мужчины!$H:$H,$D6,мужчины!$N:$N,AJ$2)","v":0},{"$f":"COUNTIFS(мужчины!$H:$H,$D6,мужчины!$N:$N,AK$2)","v":0},{"$f":"COUNTIFS(мужчины!$H:$H,$D6,мужчины!$N:$N,AL$2)","v":0},{"$f":"COUNTIFS(мужчины!$H:$H,$D6,мужчины!$N:$N,AM$2)","v":0},{"$f":"COUNTIFS(мужчины!$H:$H,$D6,мужчины!$N:$N,AN$2)","v":1},{"$f":"COUNTIFS(мужчины!$H:$H,$D6,мужчины!$N:$N,AO$2)","v":0},{"$f":"COUNTIFS(мужчины!$H:$H,$D6,мужчины!$N:$N,AP$2)","v":1},{"$f":"COUNTIFS(мужчины!$H:$H,$D6,мужчины!$N:$N,AQ$2)","v":0},{"$f":"COUNTIFS(мужчины!$H:$H,$D6,мужчины!$N:$N,AR$2)","v":0},{"$f":"COUNTIFS(мужчины!$H:$H,$D6,мужчины!$N:$N,AS$2)","v":0},{"$f":"COUNTIFS(мужчины!$H:$H,$D6,мужчины!$N:$N,AT$2)","v":0},{"$f":"COUNTIFS(мужчины!$H:$H,$D6,мужчины!$N:$N,AU$2)","v":0},{"$f":"COUNTIFS(мужчины!$H:$H,$D6,мужчины!$N:$N,AV$2)","v":0},{"$f":"COUNTIFS(мужчины!$H:$H,$D6,мужчины!$N:$N,AW$2)","v":0},{"$f":"COUNTIFS(мужчины!$H:$H,$D6,мужчины!$N:$N,AX$2)","v":0},{"$f":"COUNTIFS(мужчины!$H:$H,$D6,мужчины!$N:$N,AY$2)","v":0},{"$f":"COUNTIFS(мужчины!$H:$H,$D6,мужчины!$N:$N,AZ$2)","v":0},{"$f":"COUNTIFS(мужчины!$H:$H,$D6,мужчины!$N:$N,BA$2)","v":0}]
{"$rows_left_out":68}
{"sheet":"размер_рост","index":4,"n_rows":89,"n_cols":1,"rows_kept":89,"cut":false,"hidden":false,"merged":[]}
["размер/рост"]
["44/158"]
["44/164"]
["44/170"]
["44/176"]
["44/182"]
{"$rows_left_out":84}
{"sheet":"Задание","index":5,"n_rows":0,"n_cols":0,"rows_kept":0,"cut":false,"hidden":false,"merged":[]}