{"text_format":"1","workbook":"xlsx","n_sheets":4,"sheets":["Главная","Номенклатура","РЕЗЕРВ","ЗАКАЗ"],"not_rendered":{"charts":0,"images":4,"macros":1,"external_links":0,"defined_names":285,"comments":3,"pivot_tables":0},"unopened":[],"bounds":{"document_bytes":16777216,"sheet_cells":100000,"rows_first":2000,"rows_last":500,"rows_between":2000,"halvings":0,"cell_chars":16384,"cell_head_chars":4096},"cells_cut":0,"cells_raw":0,"read":"whole","date_system":"1900"}

{"sheet":"Главная","index":0,"n_rows":69,"n_cols":37,"rows_kept":69,"cut":false,"hidden":false,"merged":[[26,7,26,12],[8,7,8,12],[11,7,11,12],[14,7,14,12],[15,7,15,12],[16,7,16,12],[17,7,17,12],[18,7,18,12],[19,7,19,12],[20,7,20,12],[23,7,23,12],[13,7,13,12],[12,7,12,12],[24,7,25,12],[1,2,1,5],[1,7,1,11],[102,0,103,0],[0,0,0,2],[0,5,0,6],[4,7,4,12],[21,7,22,12],[19,1,19,5],[2,1,2,5],[2,6,2,12],[0,3,0,4],[0,7,0,8],[5,7,5,12],[6,7,7,12],[10,7,10,12],[9,7,9,12]]}
["Общая сумма заказа:",null,null,{"$f":"SUM(B2,G2,M2)","v":{"$error":"#REF!"}},null,"Общий вес заказа:",null,{"$f":"CONCATENATE(P1,\" кг\")","v":{"$error":"#REF!"}},null,null,null,null,"2021-06-15",null,null,{"$f":"SUM(Номенклатура!P3,#REF!,РЕЗЕРВ!O2)","v":{"$error":"#REF!"}}]
["ИТОГО по продукции А БАЙ:",{"$f":"Номенклатура!D2","v":3771},"ИТОГО по продукции ГА | Тельм М. Л.:",null,null,null,{"$f":"#REF!","v":{"$error":"#REF!"}},"РЕЗЕРВ",null,null,null,null,{"$f":"РЕЗЕРВ!C4","v":0}]
[null,null,null,null,null,null,null,null,null,null,null,null,null,2,null,{"$f":"ROUND(T9,1)","v":0},null,null,null,null,null,"вниз"]
[]
[null,null,null,null,null,null,null,"Быстрый переход"]
[null,null,null,null,null,null,null,"НОВИНКИ",null,null,null,null,null,{"$f":"#REF!-#REF!","v":{"$error":"#REF!"}}]
[null,null,null,null,null,null,null,"АБАЙ",null,null,null,null,null,null,null,null,null,null,"Сумма  от 7000\\10000",null,"t8"]
[null,null,null,null,null,null,null,null,null,null,null,null,null,null,null,null,null,null,"Сумма от 15000\\20000"]
[null,null,null,null,null,null,null,"○ ВЕСОВЫЕ НАПИТКИ ЧАЙНЫЕ ИЗ ДИКОРАСТУЩИХ ТРАВ, 100 гр.",null,null,null,null,null,null,null,null,null,null,"Сумма веса заказа"]
[null,null,null,null,null,null,null,"○ НАПИТКИ ЧАЙНЫЕ ИЗ ДИКОРАСТУЩИХ ТРАВ в крафт. упаковке, 50 гр."]
[null,null,null,null,null,null,null,"○ НАПИТКИ ЧАЙНЫЕ ИЗ ДИКОРАСТУЩИХ ТРАВ в крафт. упаковке, 100 гр."]
[null,null,null,null,null,null,null,"○ ПОДАРОЧНЫЕ НАБОРЫ в крафтовом мешочке"]
[null,null,null,null,null,null,null,"○ НАТУРАЛЬНОЕ МЫЛО РУЧНОЙ РАБОТЫ без упаковки, 80 гр."]
[null,null,null,null,null,null,null,"○ НАТУРАЛЬНОЕ МЫЛО РУЧНОЙ РАБОТЫ, 80 гр."]
[null,null,null,null,null,null,null,"○ ЭФИРНЫЕ МАСЛА. Серия \"ТАЙНА ТАЙГИ\", 20 мл. (спрей)"]
[null,null,null,null,null,null,null,"○ ЛЬНЯНЫЕ МОЧАЛКИ С ОРГАНИЧЕСКИМ МЫЛОМ, 130 гр."]
[null,null,null,null,null,null,null,"○ МОЧАЛКИ ДЛЯ УМЫВАНИЯ. Серия \"ТАЕЖНАЯ КОСМЕТИКА\", 60 гр."]
[null,null,null,null,null,null,null,"○ ФИТОЗАПАРКИ для бань, ванн и фитобочек, 30 гр."]
[null,null,null,null,null,null,null,"○  ЭКО-БАЛЬЗАМЫ. Серия \"ТАЙНА ТАЙГИ\", 50 мл."]
[null,null,null,null,null,null,null,"○ НАТУРАЛЬНЫЕ КРЕМА РУЧНОЙ РАБОТЫ. Серия \"ТАЁЖНАЯ КОСМЕТИКА\", 50 мл."]
[null,null,null,null,null,null,null,"○ ЛОСЬОНЫ АНТИСЕПТИЧЕСКИЕ. Серия \"ТАЙНА ТАЙГИ\", 100 мл."]
[null,null,null,null,null,null,null,"ГА"]
[]
[null,null,null,null,null,null,null,"○ БАЛЬЗАМЫ безалкогольные, 250 мл."]
[null,null,null,null,null,null,null,"ТЕЛЬМ М. Л."]
[]
[null,null,null,null,null,null,null,"○ МАЗИ, РАСТИРКИ, СВАРОКИ"]
[null,null,null,null,null,null,null,null,null,null,null,null,{"$f":"B28*I28","v":0},null,null,null,null,null,null,null,null,null,null,null,null,null,null,null,null,null,null,null,null,null,null,null,"https://greenberi.ru/product/napitok-chajnyj-iz-dikorastushhih-trav-batyr-dlja-zdorovja-muzhchin/"]
[null,null,null,null,null,null,null,null,null,null,null,null,0,null,null,null,null,null,null,null,null,null,null,null,null,null,null,null,null,null,null,null,null,null,null,null,"https://greenberi.ru/product/napitok-chajnyj-iz-dikorastushhih-trav-gornye-reki-serdechno-sosudistyj/"]
[null,null,null,null,null,null,null,null,null,null,null,null,0,null,null,null,null,null,null,null,null,null,null,null,null,null,null,null,null,null,null,null,null,null,null,null,"https://greenberi.ru/product/napitok-chajnyj-iz-dikorastushhih-trav-gracija-dlja-pohudenija/"]
{"$rows_left_out":40}
{"sheet":"Номенклатура","index":1,"n_rows":29,"n_cols":37,"rows_kept":29,"cut":false,"hidden":false,"merged":[[0,0,0,2],[2,0,3,0],[4,0,4,11],[0,5,0,6],[0,7,0,8],[0,3,0,4],[2,3,3,3],[2,4,3,4],[1,0,1,2],[1,3,1,4],[1,5,1,9],[1,10,1,11],[58,1,59,1],[2,35,3,35],[2,7,3,7],[2,8,3,8],[2,9,3,9],[2,10,3,10],[2,11,3,11],[1,12,2,12],[2,5,3,5],[2,1,3,1],[2,2,3,2]]}
["Общая сумма заказа:",null,null,{"$f":"Главная!D1","v":{"$error":"#REF!"}},null,"Общий вес заказа:",null,{"$f":"CONCATENATE(Главная!P1,\" кг\")","v":{"$error":"#REF!"}}]
["ИТОГО по продукции АЛТЫН БАЙ:",null,null,{"$f":"SUM(J3:J13)","v":3771},null,"До следующей скидки по продукции АЛТЫН БАЙ осталось:",null,null,null,null,{"$f":"IF(T4>12000,\"Макс. скидка!\", IF(AND(T6<12000,T5>4000),12000-T5,4000-T4))","v":4000}]
["Артикул","Наименование","До 4000 р.","От 4000 р. до 12000 р.","От 12000 р.","срок  годности, мес.",{"$f":"CONCATENATE(\"Вес: \",P3,\" кг\")","v":"Вес: 3 кг"},"Шт./гр. в коробке/упаковке","заказ","Сумма, руб.","Ссылка на карточку товара","Вес, Брутто кг.",null,2,null,{"$f":"ROUND(T10,1)","v":3},null,null,null,null,null,"вниз"]
[null,null,null,null,null,null,"Фото товара"]
[" ВЕСОВЫЕ НАПИТКИ ЧАЙНЫЕ ИЗ ДИКОРАСТУЩИХ ТРАВ, 1000 гр. (пакет зип-лок. +10 наклеек чая, +5(10) крафт пакетиков)",null,null,null,null,null,null,null,null,null,null,null,"Вернуться в оглавление"]
["4603727335019В","БАТЫР (мужской сбор)",{"$f":"V13","v":1424.6},{"$f":"V12","v":1257},{"$f":"V11","v":1173.2},"24 мес.",null,"4 кг.",2,{"$f":"IF($T$9>12000,E6*I6,IF(AND($T$7>4000,$T$8<12000),D6*I6,C6*I6))","v":2514},null,1.01,{"$f":"C6*I6","v":2849.2},{"$f":"D6*I6","v":2514},{"$f":"E6*I6","v":2346.4},{"$f":"I6*L6","v":2.02},null,null,null,null,null,{"$f":"IF(T8>4000,IF(T9>12000,3,2),1)","v":1},"Алтын Бай",{"$f":"IF(I6>0,(COUNT($X$1:X5)+1),\"\")","v":1}]
["4603727335088В","ГОРНЫЕ РЕКИ (сердечно-сосудистый)",{"$f":"C6","v":1424.6},{"$f":"D6","v":1257},{"$f":"E6","v":1173.2},"24 мес.",null,"4 кг.",null,{"$f":"IF($T$9>12000,E7*I7,IF(AND($T$7>4000,$T$8<12000),D7*I7,C7*I7))","v":0},null,1.01,0,null,0,{"$f":"I7*L7","v":0},null,null,"колонка 1",{"$f":"SUM(M6:M13)","v":4273.7999999999993},null,null,"Алтын Бай",{"$f":"IF(I7>0,(COUNT($X$1:X6)+1),\"\")","v":""}]
["4603727335026В","ГРАЦИЯ (обменный)",{"$f":"C6","v":1424.6},{"$f":"D6","v":1257},{"$f":"E6","v":1173.2},"24 мес.",null,"4 кг.",null,{"$f":"IF($T$9>12000,E8*I8,IF(AND($T$7>4000,$T$8<12000),D8*I8,C8*I8))","v":0},null,1.01,0,0,0,0,null,null,"колонка 2",{"$f":"SUM(N6:N15)","v":3771},"t8",null,"Алтын Бай",{"$f":"IF(I8>0,(COUNT($X$1:X7)+1),\"\")","v":""}]
["4603727335002В","ДОБРОЕ УТРО (иммунный)",{"$f":"C6","v":1424.6},{"$f":"D6","v":1257},{"$f":"E6","v":1173.2},"24 мес.",null,"4 кг.",1,{"$f":"IF($T$9>12000,E9*I9,IF(AND($T$7>4000,$T$8<12000),D9*I9,C9*I9))","v":1257},null,1.01,1424.6,1257,1173.2,1.01,null,null,"колонка 3",{"$f":"SUM(O6:O15)","v":3519.6000000000004},null,null,"Алтын Бай",{"$f":"IF(I9>0,(COUNT($X$1:X8)+1),\"\")","v":2}]
["4603727335385В","ДУШЕВНЫЙ ВЕЧЕР (успокаивающий)",{"$f":"C6","v":1424.6},{"$f":"D6","v":1257},{"$f":"E6","v":1173.2},"24 мес.",null,"4 кг.",null,{"$f":"IF($T$9>12000,E10*I10,IF(AND($T$7>4000,$T$8<12000),D10*I10,C10*I10))","v":0},null,1.01,0,0,0,0,null,null,"Сумма веса заказа",{"$f":"SUM(P6:P15)","v":3.0300000000000002},null,null,"Алтын Бай",{"$f":"IF(I10>0,(COUNT($X$1:X9)+1),\"\")","v":""}]
["4603727335033В","ЗОЛОТАЯ ЛУНА (женский сбор)",{"$f":"C6","v":1424.6},{"$f":"D6","v":1257},{"$f":"E6","v":1173.2},"24 мес.",null,"4 кг.",null,{"$f":"IF($T$9>12000,E11*I11,IF(AND($T$7>4000,$T$8<12000),D11*I11,C11*I11))","v":0},null,1.01,0,0,0,0,null,null,null,null,false,{"$f":"IF(U11,1122.8,1173.2)","v":1173.2},"Алтын Бай",{"$f":"IF(I11>0,(COUNT($X$1:X10)+1),\"\")","v":""}]
["4603727335460В","КЛАССИЧЕСКИЙ (ароматный)",{"$f":"C6","v":1424.6},{"$f":"D6","v":1257},{"$f":"E6","v":1173.2},"24 мес.",null,"4 кг.",null,{"$f":"IF($T$9>12000,E12*I12,IF(AND($T$7>4000,$T$8<12000),D12*I12,C12*I12))","v":0},null,1.01,0,0,0,0,null,null,null,null,null,{"$f":"IF(U11,1203,1257)","v":1257},"Алтын Бай",{"$f":"IF(I12>0,(COUNT($X$1:X11)+1),\"\")","v":""}]
["4603727335095В","ЛЕТНЯЯ НОЧЬ (общеукрепляющий)",{"$f":"C6","v":1424.6},{"$f":"D6","v":1257},{"$f":"E6","v":1173.2},"24 мес.",null,"4 кг.",null,{"$f":"IF($T$9>12000,E13*I13,IF(AND($T$7>4000,$T$8<12000),D13*I13,C13*I13))","v":0},null,1.01,0,0,0,0,null,null,null,null,null,{"$f":"IF(U11,1363.4,1424.6)","v":1424.6},"Алтын Бай",{"$f":"IF(I13>0,(COUNT($X$1:X12)+1),\"\")","v":""}]
[null,null,null,null,null,null,null,null,null,null,null,null,null,null,null,null,null,null,null,null,null,null,null,null,null,null,null,null,null,null,null,null,null,null,null,null,"https://greenberi.ru/product/mochalka-lnjanaja-s-organicheskim-mylom-s-mumijo/"]
[null,null,null,null,null,null,null,null,null,null,null,null,null,null,null,null,null,null,null,null,null,null,null,null,null,null,null,null,null,null,null,null,null,null,null,null,"https://greenberi.ru/product/mylo-kedrovoe/"]
[]
[]
[null,null,null,null,null,null,null,null,null,null,null,null,null,null,null,null,null,null,null,null,null,null,null,null,null,null,null,null,null,null,null,null,null,null,null,null,"https://greenberi.ru/product/napitok-chajnyj-iz-dikorastushhih-trav-batyr-dlja-zdorovja-muzhchin/"]
[null,null,null,null,null,null,null,null,null,null,null,null,null,null,null,null,null,null,null,null,null,null,null,null,null,null,null,null,null,null,null,null,null,null,null,null,"https://greenberi.ru/product/napitok-chajnyj-iz-dikorastushhih-trav-gornye-reki-serdechno-sosudistyj/"]
[null,null,null,null,null,null,null,null,null,null,null,null,null,null,null,null,null,null,null,null,null,null,null,null,null,null,null,null,null,null,null,null,null,null,null,null,"https://greenberi.ru/product/napitok-chajnyj-iz-dikorastushhih-trav-gracija-dlja-pohudenija/"]
[null,null,null,null,null,null,null,null,null,null,null,null,null,null,null,null,null,null,null,null,null,null,null,null,null,null,null,null,null,null,null,null,null,null,null,null,"https://greenberi.ru/product/napitok-chajnyj-iz-dikorastushhih-trav-dobroe-utro-immunnyj/"]
[null,null,null,null,null,null,null,null,null,null,null,null,null,null,null,null,null,null,null,null,null,null,null,null,null,null,null,null,null,null,null,null,null,null,null,null,"https://greenberi.ru/product/chajnyj-napitok-dushevnyj-vecher-uspokaivajushhij-100gr-list-maliny-labaznik-kurilskij-chaj-zizifora-mjata-lavanda-cvet-cheremuhi/"]
[null,null,null,null,null,null,null,null,null,null,null,null,null,null,null,null,null,null,null,null,null,null,null,null,null,null,null,null,null,null,null,null,null,null,null,null,"https://greenberi.ru/product/napitok-chajnyj-iz-dikorastushhih-trav-zolotaja-luna-dlja-zdorovja-zhenshhin/"]
[null,null,null,null,null,null,null,null,null,null,null,null,null,null,null,null,null,null,null,null,null,null,null,null,null,null,null,null,null,null,null,null,null,null,null,null,"https://greenberi.ru/product/napitok-chajnyj-iz-dikorastushhih-trav-letnjaja-noch-obshheukrepljajushhij/"]
[null,null,null,null,null,null,null,null,null,null,null,null,null,null,null,null,null,null,null,null,null,null,null,null,null,null,null,null,null,null,null,null,null,null,null,null,"https://greenberi.ru/product/napitok-chajnyj-iz-dikorastushhih-trav-rodnikovyj-dlja-pochek/"]
[null,null,null,null,null,null,null,null,null,null,null,null,null,null,null,null,null,null,null,null,null,null,null,null,null,null,null,null,null,null,null,null,null,null,null,null,"https://greenberi.ru/product/napitok-chajnyj-iz-dikorastushhih-trav-svobodnoe-dyhanie-protivoprostudnyj/"]
[null,null,null,null,null,null,null,null,null,null,null,null,null,null,null,null,null,null,null,null,null,null,null,null,null,null,null,null,null,null,null,null,null,null,null,null,"https://greenberi.ru/product/napitok-chajnyj-iz-dikorastushhih-trav-snezhnye-vershiny-zheludochno-kishechnyj/"]
[null,null,null,null,null,null,null,null,null,null,null,null,null,null,null,null,null,null,null,null,null,null,null,null,null,null,null,null,null,null,null,null,null,null,null,null,"https://greenberi.ru/product/napitok-chajnyj-iz-dikorastushhih-trav-solnechnyj-dlja-pecheni/"]
[null,null,null,null,null,null,null,null,null,null,null,null,null,null,null,null,null,null,null,null,null,null,null,null,null,null,null,null,null,null,null,null,null,null,null,null,"https://greenberi.ru/product/chajnyj-napitok-jagodka-vitaminnyj-100gr-badan-kurilskij-chaj-chabrec-list-maliny-list-smorodiny-jagoda-shipovnika-jagoda-maliny/"]

{"sheet":"РЕЗЕРВ","index":2,"n_rows":148,"n_cols":36,"rows_kept":148,"cut":false,"hidden":true,"merged":[[1,34,3,34],[3,0,3,1],[3,2,3,3],[3,4,3,8],[3,9,3,10],[1,6,2,6],[1,7,2,7],[1,8,2,8],[1,9,2,9],[1,10,2,10],[1,11,2,11],[1,0,2,0],[1,1,2,1],[1,2,2,2],[1,3,2,3],[76,0,76,10],[83,0,83,10],[89,0,89,10],[95,0,95,10],[178,0,179,0],[0,4,0,5],[0,6,0,7],[69,0,69,10],[5,0,5,10],[24,0,24,10],[38,0,38,10],[43,0,43,10],[54,0,54,10],[59,0,59,10],[4,0,4,11],[1,4,2,4],[0,2,0,3],[0,0,0,1]]}
["Общая сумма заказа:",null,{"$f":"Главная!D1","v":{"$error":"#REF!"}},null,"Общий вес заказа:",null,{"$f":"CONCATENATE(Главная!P1,\" кг\")","v":{"$error":"#REF!"}}]
["Наименование","До 4000 р.","От 4000 р. до 12000 р.","От 12000 р.","срок  годности, мес.",{"$f":"CONCATENATE(\"Общий Вес: \",O2,\" кг\")","v":"Общий Вес: 0 кг"},"Шт./гр. в коробке/упаковке","заказ","Сумма, руб.","Ссылка на карточку товара","Вес, Брутто кг.",null,2,null,{"$f":"ROUND(S10,1)","v":0},null,null,null,null,null,"вниз"]
[null,null,null,null,null,"Фото товара"]
["ИТОГО по товарам для здоровья:",null,{"$f":"SUM(I6:I97)","v":0},null,"До следующей скидки по товарам для здоровья осталось:",null,null,null,null,{"$f":"IF(S7>12000,\"Максимальная скидка!\", IF(AND(S9<12000,S8>4000),12000-S8,4000-S7))","v":4000},null,{"$f":"S5-C4","v":0}]
["В какие бы жестокие игры ни играли с нами природа и цивилизация, мы сможем выстоять, доказательство тому – огромное количество товаров для красоты и здоровья, имеющихся в нашем распоряжении. Так что заряжаемся энергией, отбиваемся от заразы, и вперёд, к новым свершениям!"]
["МАСКИ ТКАНЕВЫЕ МНОГОРАЗОВЫЕ ДВУХСЛОЙНЫЕ НЕМЕДИЦИНСКИЕ",null,null,null,null,null,null,null,null,null,null,"Вернуться в оглавление",{"$f":"C7*H7","v":0},{"$f":"D7*H7","v":0},{"$f":"H7*K7","v":0}]
["МАСКА ТКАНЕВАЯ МНОГОРАЗОВАЯ ДВУХСЛОЙНАЯ НЕМЕДИЦИНСКАЯ ЧЕРНАЯ Внешний слой масок изготавливается из смесовых тканей с примесью хлопка, плотность 260 г./кв.м., внутренний слой из 100% гипоаллергенного хлопка, плотность 125-140 г./кв.м., регулируемые мягкие резинки, каждая маска пропаривается перед упаковкой, индивидуальная вакуумная упаковка, плотное прилегание к лицу, приятно лицу, гигиенично, многоразовое использование.",70,66,64,null,null,null,null,{"$f":"IF($S$9>12000,D7*H7,IF(AND($S$7>4000,$S$8<12000),C7*H7,B7*H7))","v":0},"Открыть карточку товара",1.4E-2,{"$f":"B7*H7","v":0},0,0,{"$f":"H8*K8","v":0},null,null,"колонка 1",{"$f":"SUM(L5:L97)","v":0}]
["МАСКА ТКАНЕВАЯ МНОГОРАЗОВАЯ ДВУХСЛОЙНАЯ НЕМЕДИЦИНСКАЯ ХАКИ Внешний слой масок изготавливается из смесовых тканей с примесью хлопка, плотность 260 г./кв.м., внутренний слой из 100% гипоаллергенного хлопка, плотность 125-140 г./кв.м., регулируемые мягкие резинки, каждая маска пропаривается перед упаковкой, индивидуальная вакуумная упаковка, плотное прилегание к лицу, приятно лицу, гигиенично, многоразовое использование.",70,66,64,null,null,null,null,{"$f":"IF($S$9>12000,D8*H8,IF(AND($S$7>4000,$S$8<12000),C8*H8,B8*H8))","v":0},"Открыть карточку товара",1.4999999999999999E-2,0,0,0,0,null,null,"колонка 2",{"$f":"SUM(M4:M132)","v":0}]
["МАСКИ ДЕТСКИЕ МНОГОРАЗОВЫЕ ДВУХСЛОЙНЫЕ НЕМЕДИЦИНСКИЕ В АССОРТИМЕНТЕ Внешний слой масок изготавливается из специальных детских хлопковых тканей, плотность 147 г./кв.м., внутренний слой из 100% гипоаллергенного хлопка, плотность 125-140 г./кв.м., регулируемые мягкие резинки, каждая маска пропаривается перед упаковкой, индивидуальная вакуумная упаковка, плотное прилегание к лицу, приятно лицу, гигиенично, многоразовое использование, яркие детские расцветки.",70,66,64,null,null,null,null,0,"Открыть карточку товара",1.0999999999999999E-2,0,0,0,0,null,null,"колонка 3",{"$f":"SUM(N4:N132)","v":0}]
[null,null,null,null,null,null,null,null,null,null,null,0,0,0,0,null,null,"Сумма веса заказа",{"$f":"SUM(O4:O132)","v":0},"t8"]
[null,null,null,null,null,null,null,null,null,null,null,0,0,0,0]
[null,null,null,null,null,null,null,null,null,null,null,0,0,0,0]
[null,null,null,null,null,null,null,null,null,null,null,0,0,0,0]
[null,null,null,null,null,null,null,null,null,null,null,0,0,0,0]
[null,null,null,null,null,null,null,null,null,null,null,0,0,0,0]
[null,null,null,null,null,null,null,null,null,null,null,0,0,0,0]
[null,null,null,null,null,null,null,null,null,null,null,0,0,0,0]
[null,null,null,null,null,null,null,null,null,null,null,0,0,0,0]
[null,null,null,null,null,null,null,null,null,null,null,0,0,0,0]
[null,null,null,null,null,null,null,null,null,null,null,0,0,0,0]
[null,null,null,null,null,null,null,null,null,null,null,0,0,0,0]
[null,null,null,null,null,null,null,null,null,null,null,0]
[]
[]
[]
[]
[]
[]
[]
[]
{"$rows_left_out":119}
{"sheet":"ЗАКАЗ","index":3,"n_rows":349,"n_cols":7,"rows_kept":349,"cut":false,"hidden":false,"merged":[[5,0,5,2],[5,3,5,6],[0,0,0,6],[1,0,2,2],[1,3,2,6],[3,0,4,2],[3,3,4,6],[13,0,13,2],[13,3,13,6],[6,3,6,6],[7,0,7,2],[7,3,7,6],[8,0,8,2],[8,3,9,6],[9,0,9,2],[10,0,10,2],[10,3,11,6],[11,0,11,2],[12,0,12,2],[12,3,12,6],[14,0,14,2],[14,3,14,6],[15,0,15,2],[15,3,15,6],[16,0,16,2],[16,3,16,6],[18,1,18,6],[19,1,21,2],[19,5,19,6],[20,5,20,6],[21,5,21,6]]}
["ДОСТАВКА И ОПЛАТА"]
["Транспортная компания"]
[]
["Адрес отправки: "]
[]
["Данные получателя: ",null,null,"Наименование организации/ФИО"]
[]
["Серия номер паспорта"]
["ИНН "]
["(если на ИП или ООО отправка)"]
["КПП"]
["(если отправка на ООО)"]
["Контактное лицо"]
["Телефон"]
["Доставку оплачивает"]
["Защита груза"]
["Оплата товара",null,null,"  "]
[]
[null,{"$f":"IF(F21>1,\"СПАСИБО ЗА ВАШ ЗАКАЗ!\",\"\")","v":"СПАСИБО ЗА ВАШ ЗАКАЗ!"}]
[null,{"$f":"CONCATENATE(IF(#REF!>1,\"\",\"Обратите внимание на наши АКЦИОННЫЕ ТОВАРЫ\"),CHAR(10),IF(OR(#REF!>1,#REF!>1),\"\",\"Обратите внимание на наши НОВИНКИ\"))","v":{"$error":"#REF!"}},null,null,"Всего наименований:",{"$f":"COUNT(G25:G349)","v":"1900-01-02"}]
[null,null,null,null,"Общая сумма заказа:",{"$f":"SUM(G25:G349)","v":3771}]
[null,null,null,null,"Общий вес заказа:",{"$f":"CONCATENATE(#REF!,\" кг.\")","v":{"$error":"#REF!"}}]
[]
[null,"№","Наименование","Производитель","Кол-во","Цена","Сумма"]
[{"$f":"IFERROR(IF(AND(B25>0,B25/1),INDEX(Номенклатура!$B$6:$X$3651,MATCH(B25,Номенклатура!$X$6:$X$3651,0),1),\"\"),\"\")","v":"БАТЫР (мужской сбор)"},1,"БАТЫР (мужской сбор)","Алтын БАЙ ",{"$f":"IFERROR(IF(AND(B25>0,B25/1),INDEX(Номенклатура!$B$1:$Z$3651,MATCH(B25,Номенклатура!$X$1:$X$3651,0),8),\"\"),\"\")","v":2},1257,{"$f":"IFERROR(IF(AND(B25>0,B25/1),INDEX(Номенклатура!$B$1:$Z$3651,MATCH(B25,Номенклатура!$X$1:$X$3651,0),9),\"\"),\"\")","v":2514}]
[{"$f":"IFERROR(IF(AND(B26>0,B26/1),INDEX(Номенклатура!$B$6:$Z$3651,MATCH(B26,Номенклатура!$X$6:$X$3651,0),1),\"\"),\"\")","v":"ДОБРОЕ УТРО (иммунный)"},{"$f":"IFERROR(IF(B25>0,SMALL(Номенклатура!$X$1:$X$3651,1+B25),\"\"),\"\")","v":2},"ДОБРОЕ УТРО (иммунный)","Алтын БАЙ ",1,1257,1257]
[{"$f":"IFERROR(IF(AND(B27>0,B27/1),INDEX(Номенклатура!$B$6:$Z$3651,MATCH(B27,Номенклатура!$X$6:$X$3651,0),1),\"\"),\"\")","v":""},{"$f":"IFERROR(IF(#REF!>0,SMALL(Номенклатура!$X$1:$X$3651,1+#REF!),\"\"),\"\")","v":""},{"$f":"IFERROR(IF(AND(B27>0,B27/1),INDEX(#REF!,MATCH(B27,#REF!,0),3),\"\"),\"\")","v":""},{"$f":"IFERROR(IF(AND(B27>0,B27/1),INDEX(#REF!,MATCH(B27,#REF!,0),9),\"\"),\"\")","v":""},{"$f":"IFERROR(IF(AND(B27>0,B27/1),INDEX(#REF!,MATCH(B27,#REF!,0),5),\"\"),\"\")","v":""},{"$f":"IFERROR(IF(AND(B27>0,B27/1),INDEX(#REF!,MATCH(B27,#REF!,0),13)/INDEX(#REF!,MATCH(B27,#REF!,0),5),\"\"),\"\")","v":""},{"$f":"IFERROR(IF(AND(B27>0,B27/1),INDEX(#REF!,MATCH(B27,#REF!,0),13),\"\"),\"\")","v":""}]
[{"$f":"IFERROR(IF(AND(B28>0,B28/1),INDEX(Номенклатура!$B$6:$Z$3651,MATCH(B28,Номенклатура!$X$6:$X$3651,0),1),\"\"),\"\")","v":""},{"$f":"IFERROR(IF(B27>0,SMALL(Номенклатура!$X$1:$X$3651,1+B27),\"\"),\"\")","v":""},{"$f":"IFERROR(IF(AND(B28>0,B28/1),INDEX(#REF!,MATCH(B28,#REF!,0),3),\"\"),\"\")","v":""},{"$f":"IFERROR(IF(AND(B28>0,B28/1),INDEX(#REF!,MATCH(B28,#REF!,0),9),\"\"),\"\")","v":""},{"$f":"IFERROR(IF(AND(B28>0,B28/1),INDEX(#REF!,MATCH(B28,#REF!,0),5),\"\"),\"\")","v":""},{"$f":"IFERROR(IF(AND(B28>0,B28/1),INDEX(#REF!,MATCH(B28,#REF!,0),13)/INDEX(#REF!,MATCH(B28,#REF!,0),5),\"\"),\"\")","v":""},{"$f":"IFERROR(IF(AND(B28>0,B28/1),INDEX(#REF!,MATCH(B28,#REF!,0),13),\"\"),\"\")","v":""}]
[{"$f":"IFERROR(IF(AND(B29>0,B29/1),INDEX(Номенклатура!$B$6:$Z$3651,MATCH(B29,Номенклатура!$X$6:$X$3651,0),1),\"\"),\"\")","v":""},{"$f":"IFERROR(IF(B28>0,SMALL(Номенклатура!$X$1:$X$3651,1+B28),\"\"),\"\")","v":""},{"$f":"IFERROR(IF(AND(B29>0,B29/1),INDEX(#REF!,MATCH(B29,#REF!,0),3),\"\"),\"\")","v":""},{"$f":"IFERROR(IF(AND(B29>0,B29/1),INDEX(#REF!,MATCH(B29,#REF!,0),9),\"\"),\"\")","v":""},{"$f":"IFERROR(IF(AND(B29>0,B29/1),INDEX(#REF!,MATCH(B29,#REF!,0),5),\"\"),\"\")","v":""},{"$f":"IFERROR(IF(AND(B29>0,B29/1),INDEX(#REF!,MATCH(B29,#REF!,0),13)/INDEX(#REF!,MATCH(B29,#REF!,0),5),\"\"),\"\")","v":""},{"$f":"IFERROR(IF(AND(B29>0,B29/1),INDEX(#REF!,MATCH(B29,#REF!,0),13),\"\"),\"\")","v":""}]
[{"$f":"IFERROR(IF(AND(B30>0,B30/1),INDEX(Номенклатура!$B$6:$Z$3651,MATCH(B30,Номенклатура!$X$6:$X$3651,0),1),\"\"),\"\")","v":""},{"$f":"IFERROR(IF(B29>0,SMALL(Номенклатура!$X$1:$X$3651,1+B29),\"\"),\"\")","v":""},{"$f":"IFERROR(IF(AND(B30>0,B30/1),INDEX(#REF!,MATCH(B30,#REF!,0),3),\"\"),\"\")","v":""},{"$f":"IFERROR(IF(AND(B30>0,B30/1),INDEX(#REF!,MATCH(B30,#REF!,0),9),\"\"),\"\")","v":""},{"$f":"IFERROR(IF(AND(B30>0,B30/1),INDEX(#REF!,MATCH(B30,#REF!,0),5),\"\"),\"\")","v":""},{"$f":"IFERROR(IF(AND(B30>0,B30/1),INDEX(#REF!,MATCH(B30,#REF!,0),13)/INDEX(#REF!,MATCH(B30,#REF!,0),5),\"\"),\"\")","v":""},{"$f":"IFERROR(IF(AND(B30>0,B30/1),INDEX(#REF!,MATCH(B30,#REF!,0),13),\"\"),\"\")","v":""}]
{"$rows_left_out":319}