{"text_format":"1","workbook":"xlsx","n_sheets":4,"sheets":["Пример1","Пример 2","Пример 3","Пример 4"],"not_rendered":{"charts":0,"images":0,"macros":1,"external_links":0,"defined_names":6,"comments":1,"pivot_tables":0},"unopened":[],"bounds":{"document_bytes":16777216,"sheet_cells":100000,"rows_first":2000,"rows_last":500,"rows_between":2000,"halvings":0,"cell_chars":16384,"cell_head_chars":4096},"cells_cut":0,"cells_raw":0,"read":"whole","date_system":"1900"}

{"sheet":"Пример1","index":0,"n_rows":15,"n_cols":12,"rows_kept":15,"cut":false,"hidden":false,"merged":[[0,3,0,11],[0,0,1,0],[0,1,1,1],[0,2,1,2]]}
["Исходное наименование","№ п/п","Общая папка","Пример"]
[null,null,null,"Путь к папке","Файл (путь)","Наличие файла в папке МАКРОС проверяет по гиперссылке","Выгрузить","Файл (путь)","Наличие файла в папке МАКРОС проверяет по гиперссылке","Путь к папке","Файл (путь)","Наличие файла в папке МАКРОС проверяет по гиперссылке"]
["SEGU8042486",1,{"$f":"HYPERLINK(CONCATENATE(\"..\\Пример\\\",A3),A3)","v":"SEGU8042486"},{"$f":"HYPERLINK(CONCATENATE(C3,\"\\\",\"Сертификат\"),\"Сертификат\")","v":"Сертификат"},{"$f":"HYPERLINK(CONCATENATE(C3,\"\\\",D3,\"\\\",REPLACE(C3,11,0,\"-\"),\" (Зав).pdf\"))","v":"SEGU8042486\\Сертификат\\SEGU804248-6 (Зав).pdf"},{"$f":"HYPERLINK(CONCATENATE(C3,\"\\\",D3,\"\\\",REPLACE(C3,11,0,\"-\"),\" (Зав).pdf\"),(IF(Check_Hyperlink(E3)=\"Файл в папке\",CONCATENATE(C3,\" (Зав)\"),(IF(Check_Hyperlink(E3)=\"Нет файла\",\"Пусто\")))))","v":"SEGU8042486 (Зав)"},"Скачать",{"$f":"HYPERLINK(CONCATENATE(C3,\"\\\",D3,\"\\\",REPLACE(C3,11,0,\"-\"),\" (Зав ОГ).pdf\"))","v":"SEGU8042486\\Сертификат\\SEGU804248-6 (Зав ОГ).pdf"},{"$f":"HYPERLINK(CONCATENATE(C3,\"\\\",D3,\"\\\",REPLACE(C3,11,0,\"-\"),\" (Зав ОГ).pdf\"),(IF(Check_Hyperlink(H3)=\"Файл в папке\",CONCATENATE(C3,\" (Зав ОГ)\"),(IF(Check_Hyperlink(H3)=\"Нет файла\",\"Пусто\")))))","v":"SEGU8042486 (Зав ОГ)"},{"$f":"HYPERLINK(CONCATENATE(C3,\"\\\",\"Калибровочная таблица\"),\"Калибровочная таблица\")","v":"Калибровочная таблица"},{"$f":"HYPERLINK(CONCATENATE(C3,\"\\\",\"Калибровочная таблица\",\"\\\",\"CC-\",REPLACE(C3,5,7,\" \"),MID(C3,5,6),\"-\",MID(C3,11,1),\".pdf\"))","v":"SEGU8042486\\Калибровочная таблица\\CC-SEGU 804248-6.pdf"},{"$f":"HYPERLINK(CONCATENATE(K3),IF(Check_Hyperlink(K3)=\"Файл в папке\",CONCATENATE(\"CC-\",REPLACE(C3,5,7,\" \"),MID(C3,5,6),\"-\",MID(C3,11,1)),(IF(Check_Hyperlink(K3)=\"Нет файла\",\"Пусто\"))))","v":"CC-SEGU 804248-6"}]
["SEGU8042531",2,{"$f":"HYPERLINK(CONCATENATE(\"..\\Пример\\\",A4),A4)","v":"SEGU8042531"},"Сертификат","SEGU8042531\\Сертификат\\SEGU804253-1 (Зав).pdf",{"$f":"HYPERLINK(CONCATENATE(C4,\"\\\",D4,\"\\\",REPLACE(C4,11,0,\"-\"),\" (Зав).pdf\"),(IF(Check_Hyperlink(E4)=\"Файл в папке\",CONCATENATE(C4,\" (Зав)\"),(IF(Check_Hyperlink(E4)=\"Нет файла\",\"Пусто\")))))","v":"SEGU8042531 (Зав)"},"Скачать","SEGU8042531\\Сертификат\\SEGU804253-1 (Зав ОГ).pdf",{"$f":"HYPERLINK(CONCATENATE(C4,\"\\\",D4,\"\\\",REPLACE(C4,11,0,\"-\"),\" (Зав ОГ).pdf\"),(IF(Check_Hyperlink(H4)=\"Файл в папке\",CONCATENATE(C4,\" (Зав ОГ)\"),(IF(Check_Hyperlink(H4)=\"Нет файла\",\"Пусто\")))))","v":"SEGU8042531 (Зав ОГ)"},"Калибровочная таблица","SEGU8042531\\Калибровочная таблица\\CC-SEGU 804253-1.pdf",{"$f":"HYPERLINK(CONCATENATE(K4),IF(Check_Hyperlink(K4)=\"Файл в папке\",CONCATENATE(\"CC-\",REPLACE(C4,5,7,\" \"),MID(C4,5,6),\"-\",MID(C4,11,1)),(IF(Check_Hyperlink(K4)=\"Нет файла\",\"Пусто\"))))","v":"CC-SEGU 804253-1"}]
["SEGU8042547",3,"SEGU8042547","Сертификат","SEGU8042547\\Сертификат\\SEGU804254-7 (Зав).pdf",{"$f":"HYPERLINK(CONCATENATE(C5,\"\\\",D5,\"\\\",REPLACE(C5,11,0,\"-\"),\" (Зав).pdf\"),(IF(Check_Hyperlink(E5)=\"Файл в папке\",CONCATENATE(C5,\" (Зав)\"),(IF(Check_Hyperlink(E5)=\"Нет файла\",\"Пусто\")))))","v":"SEGU8042547 (Зав)"},"Скачать","SEGU8042547\\Сертификат\\SEGU804254-7 (Зав ОГ).pdf",{"$f":"HYPERLINK(CONCATENATE(C5,\"\\\",D5,\"\\\",REPLACE(C5,11,0,\"-\"),\" (Зав ОГ).pdf\"),(IF(Check_Hyperlink(H5)=\"Файл в папке\",CONCATENATE(C5,\" (Зав ОГ)\"),(IF(Check_Hyperlink(H5)=\"Нет файла\",\"Пусто\")))))","v":"SEGU8042547 (Зав ОГ)"},"Калибровочная таблица","SEGU8042547\\Калибровочная таблица\\CC-SEGU 804254-7.pdf",{"$f":"HYPERLINK(CONCATENATE(K5),IF(Check_Hyperlink(K5)=\"Файл в папке\",CONCATENATE(\"CC-\",REPLACE(C5,5,7,\" \"),MID(C5,5,6),\"-\",MID(C5,11,1)),(IF(Check_Hyperlink(K5)=\"Нет файла\",\"Пусто\"))))","v":"CC-SEGU 804254-7"}]
["SEGU8042552",4,"SEGU8042552","Сертификат","SEGU8042552\\Сертификат\\SEGU804255-2 (Зав).pdf",{"$f":"HYPERLINK(CONCATENATE(C6,\"\\\",D6,\"\\\",REPLACE(C6,11,0,\"-\"),\" (Зав).pdf\"),(IF(Check_Hyperlink(E6)=\"Файл в папке\",CONCATENATE(C6,\" (Зав)\"),(IF(Check_Hyperlink(E6)=\"Нет файла\",\"Пусто\")))))","v":"SEGU8042552 (Зав)"},"Скачать","SEGU8042552\\Сертификат\\SEGU804255-2 (Зав ОГ).pdf",{"$f":"HYPERLINK(CONCATENATE(C6,\"\\\",D6,\"\\\",REPLACE(C6,11,0,\"-\"),\" (Зав ОГ).pdf\"),(IF(Check_Hyperlink(H6)=\"Файл в папке\",CONCATENATE(C6,\" (Зав ОГ)\"),(IF(Check_Hyperlink(H6)=\"Нет файла\",\"Пусто\")))))","v":"Пусто"},"Калибровочная таблица","SEGU8042552\\Калибровочная таблица\\CC-SEGU 804255-2.pdf",{"$f":"HYPERLINK(CONCATENATE(K6),IF(Check_Hyperlink(K6)=\"Файл в папке\",CONCATENATE(\"CC-\",REPLACE(C6,5,7,\" \"),MID(C6,5,6),\"-\",MID(C6,11,1)),(IF(Check_Hyperlink(K6)=\"Нет файла\",\"Пусто\"))))","v":"CC-SEGU 804255-2"}]
["SEGU8042568",5,"SEGU8042568","Сертификат","SEGU8042568\\Сертификат\\SEGU804256-8 (Зав).pdf",{"$f":"HYPERLINK(CONCATENATE(C7,\"\\\",D7,\"\\\",REPLACE(C7,11,0,\"-\"),\" (Зав).pdf\"),(IF(Check_Hyperlink(E7)=\"Файл в папке\",CONCATENATE(C7,\" (Зав)\"),(IF(Check_Hyperlink(E7)=\"Нет файла\",\"Пусто\")))))","v":"Пусто"},"Скачать","SEGU8042568\\Сертификат\\SEGU804256-8 (Зав ОГ).pdf",{"$f":"HYPERLINK(CONCATENATE(C7,\"\\\",D7,\"\\\",REPLACE(C7,11,0,\"-\"),\" (Зав ОГ).pdf\"),(IF(Check_Hyperlink(H7)=\"Файл в папке\",CONCATENATE(C7,\" (Зав ОГ)\"),(IF(Check_Hyperlink(H7)=\"Нет файла\",\"Пусто\")))))","v":"Пусто"},"Калибровочная таблица","SEGU8042568\\Калибровочная таблица\\CC-SEGU 804256-8.pdf",{"$f":"HYPERLINK(CONCATENATE(K7),IF(Check_Hyperlink(K7)=\"Файл в папке\",CONCATENATE(\"CC-\",REPLACE(C7,5,7,\" \"),MID(C7,5,6),\"-\",MID(C7,11,1)),(IF(Check_Hyperlink(K7)=\"Нет файла\",\"Пусто\"))))","v":"Пусто"}]
["SEGU8042573",6,"SEGU8042573","Сертификат","SEGU8042573\\Сертификат\\SEGU804257-3 (Зав).pdf",{"$f":"HYPERLINK(CONCATENATE(C8,\"\\\",D8,\"\\\",REPLACE(C8,11,0,\"-\"),\" (Зав).pdf\"),(IF(Check_Hyperlink(E8)=\"Файл в папке\",CONCATENATE(C8,\" (Зав)\"),(IF(Check_Hyperlink(E8)=\"Нет файла\",\"Пусто\")))))","v":"Пусто"},"Скачать","SEGU8042573\\Сертификат\\SEGU804257-3 (Зав ОГ).pdf",{"$f":"HYPERLINK(CONCATENATE(C8,\"\\\",D8,\"\\\",REPLACE(C8,11,0,\"-\"),\" (Зав ОГ).pdf\"),(IF(Check_Hyperlink(H8)=\"Файл в папке\",CONCATENATE(C8,\" (Зав ОГ)\"),(IF(Check_Hyperlink(H8)=\"Нет файла\",\"Пусто\")))))","v":"Пусто"},"Калибровочная таблица","SEGU8042573\\Калибровочная таблица\\CC-SEGU 804257-3.pdf",{"$f":"HYPERLINK(CONCATENATE(K8),IF(Check_Hyperlink(K8)=\"Файл в папке\",CONCATENATE(\"CC-\",REPLACE(C8,5,7,\" \"),MID(C8,5,6),\"-\",MID(C8,11,1)),(IF(Check_Hyperlink(K8)=\"Нет файла\",\"Пусто\"))))","v":"Пусто"}]
["SEGU8042640",7,"SEGU8042640","Сертификат","SEGU8042640\\Сертификат\\SEGU804264-0 (Зав).pdf",{"$f":"HYPERLINK(CONCATENATE(C9,\"\\\",D9,\"\\\",REPLACE(C9,11,0,\"-\"),\" (Зав).pdf\"),(IF(Check_Hyperlink(E9)=\"Файл в папке\",CONCATENATE(C9,\" (Зав)\"),(IF(Check_Hyperlink(E9)=\"Нет файла\",\"Пусто\")))))","v":"Пусто"},"Скачать","SEGU8042640\\Сертификат\\SEGU804264-0 (Зав ОГ).pdf",{"$f":"HYPERLINK(CONCATENATE(C9,\"\\\",D9,\"\\\",REPLACE(C9,11,0,\"-\"),\" (Зав ОГ).pdf\"),(IF(Check_Hyperlink(H9)=\"Файл в папке\",CONCATENATE(C9,\" (Зав ОГ)\"),(IF(Check_Hyperlink(H9)=\"Нет файла\",\"Пусто\")))))","v":"Пусто"},"Калибровочная таблица","SEGU8042640\\Калибровочная таблица\\CC-SEGU 804264-0.pdf",{"$f":"HYPERLINK(CONCATENATE(K9),IF(Check_Hyperlink(K9)=\"Файл в папке\",CONCATENATE(\"CC-\",REPLACE(C9,5,7,\" \"),MID(C9,5,6),\"-\",MID(C9,11,1)),(IF(Check_Hyperlink(K9)=\"Нет файла\",\"Пусто\"))))","v":"Пусто"}]
["SEGU8042655",8,"SEGU8042655","Сертификат","SEGU8042655\\Сертификат\\SEGU804265-5 (Зав).pdf",{"$f":"HYPERLINK(CONCATENATE(C10,\"\\\",D10,\"\\\",REPLACE(C10,11,0,\"-\"),\" (Зав).pdf\"),(IF(Check_Hyperlink(E10)=\"Файл в папке\",CONCATENATE(C10,\" (Зав)\"),(IF(Check_Hyperlink(E10)=\"Нет файла\",\"Пусто\")))))","v":"Пусто"},"Скачать","SEGU8042655\\Сертификат\\SEGU804265-5 (Зав ОГ).pdf",{"$f":"HYPERLINK(CONCATENATE(C10,\"\\\",D10,\"\\\",REPLACE(C10,11,0,\"-\"),\" (Зав ОГ).pdf\"),(IF(Check_Hyperlink(H10)=\"Файл в папке\",CONCATENATE(C10,\" (Зав ОГ)\"),(IF(Check_Hyperlink(H10)=\"Нет файла\",\"Пусто\")))))","v":"Пусто"},"Калибровочная таблица","SEGU8042655\\Калибровочная таблица\\CC-SEGU 804265-5.pdf",{"$f":"HYPERLINK(CONCATENATE(K10),IF(Check_Hyperlink(K10)=\"Файл в папке\",CONCATENATE(\"CC-\",REPLACE(C10,5,7,\" \"),MID(C10,5,6),\"-\",MID(C10,11,1)),(IF(Check_Hyperlink(K10)=\"Нет файла\",\"Пусто\"))))","v":"Пусто"}]
["SEGU8042660",9,"SEGU8042660","Сертификат","SEGU8042660\\Сертификат\\SEGU804266-0 (Зав).pdf",{"$f":"HYPERLINK(CONCATENATE(C11,\"\\\",D11,\"\\\",REPLACE(C11,11,0,\"-\"),\" (Зав).pdf\"),(IF(Check_Hyperlink(E11)=\"Файл в папке\",CONCATENATE(C11,\" (Зав)\"),(IF(Check_Hyperlink(E11)=\"Нет файла\",\"Пусто\")))))","v":"Пусто"},"Скачать","SEGU8042660\\Сертификат\\SEGU804266-0 (Зав ОГ).pdf",{"$f":"HYPERLINK(CONCATENATE(C11,\"\\\",D11,\"\\\",REPLACE(C11,11,0,\"-\"),\" (Зав ОГ).pdf\"),(IF(Check_Hyperlink(H11)=\"Файл в папке\",CONCATENATE(C11,\" (Зав ОГ)\"),(IF(Check_Hyperlink(H11)=\"Нет файла\",\"Пусто\")))))","v":"Пусто"},"Калибровочная таблица","SEGU8042660\\Калибровочная таблица\\CC-SEGU 804266-0.pdf",{"$f":"HYPERLINK(CONCATENATE(K11),IF(Check_Hyperlink(K11)=\"Файл в папке\",CONCATENATE(\"CC-\",REPLACE(C11,5,7,\" \"),MID(C11,5,6),\"-\",MID(C11,11,1)),(IF(Check_Hyperlink(K11)=\"Нет файла\",\"Пусто\"))))","v":"Пусто"}]
["SEGU8042676",10,"SEGU8042676","Сертификат","SEGU8042676\\Сертификат\\SEGU804267-6 (Зав).pdf",{"$f":"HYPERLINK(CONCATENATE(C12,\"\\\",D12,\"\\\",REPLACE(C12,11,0,\"-\"),\" (Зав).pdf\"),(IF(Check_Hyperlink(E12)=\"Файл в папке\",CONCATENATE(C12,\" (Зав)\"),(IF(Check_Hyperlink(E12)=\"Нет файла\",\"Пусто\")))))","v":"Пусто"},"Скачать","SEGU8042676\\Сертификат\\SEGU804267-6 (Зав ОГ).pdf",{"$f":"HYPERLINK(CONCATENATE(C12,\"\\\",D12,\"\\\",REPLACE(C12,11,0,\"-\"),\" (Зав ОГ).pdf\"),(IF(Check_Hyperlink(H12)=\"Файл в папке\",CONCATENATE(C12,\" (Зав ОГ)\"),(IF(Check_Hyperlink(H12)=\"Нет файла\",\"Пусто\")))))","v":"Пусто"},"Калибровочная таблица","SEGU8042676\\Калибровочная таблица\\CC-SEGU 804267-6.pdf",{"$f":"HYPERLINK(CONCATENATE(K12),IF(Check_Hyperlink(K12)=\"Файл в папке\",CONCATENATE(\"CC-\",REPLACE(C12,5,7,\" \"),MID(C12,5,6),\"-\",MID(C12,11,1)),(IF(Check_Hyperlink(K12)=\"Нет файла\",\"Пусто\"))))","v":"Пусто"}]
["SEGU8042716",11,"SEGU8042716","Сертификат","SEGU8042716\\Сертификат\\SEGU804271-6 (Зав).pdf",{"$f":"HYPERLINK(CONCATENATE(C13,\"\\\",D13,\"\\\",REPLACE(C13,11,0,\"-\"),\" (Зав).pdf\"),(IF(Check_Hyperlink(E13)=\"Файл в папке\",CONCATENATE(C13,\" (Зав)\"),(IF(Check_Hyperlink(E13)=\"Нет файла\",\"Пусто\")))))","v":"Пусто"},"Скачать","SEGU8042716\\Сертификат\\SEGU804271-6 (Зав ОГ).pdf",{"$f":"HYPERLINK(CONCATENATE(C13,\"\\\",D13,\"\\\",REPLACE(C13,11,0,\"-\"),\" (Зав ОГ).pdf\"),(IF(Check_Hyperlink(H13)=\"Файл в папке\",CONCATENATE(C13,\" (Зав ОГ)\"),(IF(Check_Hyperlink(H13)=\"Нет файла\",\"Пусто\")))))","v":"Пусто"},"Калибровочная таблица","SEGU8042716\\Калибровочная таблица\\CC-SEGU 804271-6.pdf",{"$f":"HYPERLINK(CONCATENATE(K13),IF(Check_Hyperlink(K13)=\"Файл в папке\",CONCATENATE(\"CC-\",REPLACE(C13,5,7,\" \"),MID(C13,5,6),\"-\",MID(C13,11,1)),(IF(Check_Hyperlink(K13)=\"Нет файла\",\"Пусто\"))))","v":"Пусто"}]
["SEGU8042721",12,"SEGU8042721","Сертификат","SEGU8042721\\Сертификат\\SEGU804272-1 (Зав).pdf",{"$f":"HYPERLINK(CONCATENATE(C14,\"\\\",D14,\"\\\",REPLACE(C14,11,0,\"-\"),\" (Зав).pdf\"),(IF(Check_Hyperlink(E14)=\"Файл в папке\",CONCATENATE(C14,\" (Зав)\"),(IF(Check_Hyperlink(E14)=\"Нет файла\",\"Пусто\")))))","v":"Пусто"},"Скачать","SEGU8042721\\Сертификат\\SEGU804272-1 (Зав ОГ).pdf",{"$f":"HYPERLINK(CONCATENATE(C14,\"\\\",D14,\"\\\",REPLACE(C14,11,0,\"-\"),\" (Зав ОГ).pdf\"),(IF(Check_Hyperlink(H14)=\"Файл в папке\",CONCATENATE(C14,\" (Зав ОГ)\"),(IF(Check_Hyperlink(H14)=\"Нет файла\",\"Пусто\")))))","v":"Пусто"},"Калибровочная таблица","SEGU8042721\\Калибровочная таблица\\CC-SEGU 804272-1.pdf",{"$f":"HYPERLINK(CONCATENATE(K14),IF(Check_Hyperlink(K14)=\"Файл в папке\",CONCATENATE(\"CC-\",REPLACE(C14,5,7,\" \"),MID(C14,5,6),\"-\",MID(C14,11,1)),(IF(Check_Hyperlink(K14)=\"Нет файла\",\"Пусто\"))))","v":"Пусто"}]
["SEGU8042737",13,"SEGU8042737","Сертификат","SEGU8042737\\Сертификат\\SEGU804273-7 (Зав).pdf",{"$f":"HYPERLINK(CONCATENATE(C15,\"\\\",D15,\"\\\",REPLACE(C15,11,0,\"-\"),\" (Зав).pdf\"),(IF(Check_Hyperlink(E15)=\"Файл в папке\",CONCATENATE(C15,\" (Зав)\"),(IF(Check_Hyperlink(E15)=\"Нет файла\",\"Пусто\")))))","v":"Пусто"},"Скачать","SEGU8042737\\Сертификат\\SEGU804273-7 (Зав ОГ).pdf",{"$f":"HYPERLINK(CONCATENATE(C15,\"\\\",D15,\"\\\",REPLACE(C15,11,0,\"-\"),\" (Зав ОГ).pdf\"),(IF(Check_Hyperlink(H15)=\"Файл в папке\",CONCATENATE(C15,\" (Зав ОГ)\"),(IF(Check_Hyperlink(H15)=\"Нет файла\",\"Пусто\")))))","v":"Пусто"},"Калибровочная таблица","SEGU8042737\\Калибровочная таблица\\CC-SEGU 804273-7.pdf",{"$f":"HYPERLINK(CONCATENATE(K15),IF(Check_Hyperlink(K15)=\"Файл в папке\",CONCATENATE(\"CC-\",REPLACE(C15,5,7,\" \"),MID(C15,5,6),\"-\",MID(C15,11,1)),(IF(Check_Hyperlink(K15)=\"Нет файла\",\"Пусто\"))))","v":"Пусто"}]

{"sheet":"Пример 2","index":1,"n_rows":15,"n_cols":8,"rows_kept":15,"cut":false,"hidden":false,"merged":[[0,3,0,7],[0,0,1,0],[0,1,1,1],[0,2,1,2]]}
["Исходное наименование","№ п/п","Общая папка","Пример"]
[null,null,null,"Путь к папке","Файл (путь)","Наличие файла в папке МАКРОС проверяет по гиперссылке","Файл (путь)","Наличие файла в папке МАКРОС проверяет по гиперссылке"]
["SEGU8042486",1,{"$f":"HYPERLINK(CONCATENATE(\"..\\Пример\\\",A3),A3)","v":"SEGU8042486"},{"$f":"HYPERLINK(CONCATENATE(C3,\"\\\",\"2,5 лет\"),\"Акт ОСВ\")","v":"Акт ОСВ"},{"$f":"HYPERLINK(CONCATENATE(C3,\"\\\",\"2,5 лет\",\"\\\",REPLACE(C3,11,0,\"-\"),\" (2,5 лет).pdf\"))","v":"SEGU8042486\\2,5 лет\\SEGU804248-6 (2,5 лет).pdf"},{"$f":"HYPERLINK(CONCATENATE(C3,\"\\\",\"2,5 лет\",\"\\\",REPLACE(C3,11,0,\"-\"),\" (2,5 лет).pdf\"),(IF(Check_Hyperlink(E3)=\"Файл в папке\",CONCATENATE(C3,\" (2,5 лет)\"),(IF(Check_Hyperlink(E3)=\"Нет файла\",\"Пусто\")))))","v":"SEGU8042486 (2,5 лет)"},{"$f":"HYPERLINK(CONCATENATE(C3,\"\\\",\"2,5 лет\",\"\\\",REPLACE(C3,11,0,\"-\"),\" (2,5 лет ОГ).pdf\"))","v":"SEGU8042486\\2,5 лет\\SEGU804248-6 (2,5 лет ОГ).pdf"},{"$f":"HYPERLINK(CONCATENATE(C3,\"\\\",\"2,5 лет\",\"\\\",REPLACE(C3,11,0,\"-\"),\" (2,5 лет ОГ).pdf\"),(IF(Check_Hyperlink(G3)=\"Файл в папке\",CONCATENATE(C3,\" (2,5 лет ОГ)\"),(IF(Check_Hyperlink(G3)=\"Нет файла\",\"Пусто\")))))","v":"SEGU8042486 (2,5 лет ОГ)"}]
["SEGU8042531",2,{"$f":"HYPERLINK(CONCATENATE(\"..\\Пример\\\",A4),A4)","v":"SEGU8042531"},"Акт ОСВ","SEGU8042531\\2,5 лет\\SEGU804253-1 (2,5 лет).pdf",{"$f":"HYPERLINK(CONCATENATE(C4,\"\\\",\"2,5 лет\",\"\\\",REPLACE(C4,11,0,\"-\"),\" (2,5 лет).pdf\"),(IF(Check_Hyperlink(E4)=\"Файл в папке\",CONCATENATE(C4,\" (2,5 лет)\"),(IF(Check_Hyperlink(E4)=\"Нет файла\",\"Пусто\")))))","v":"SEGU8042531 (2,5 лет)"},"SEGU8042531\\2,5 лет\\SEGU804253-1 (2,5 лет ОГ).pdf",{"$f":"HYPERLINK(CONCATENATE(C4,\"\\\",\"2,5 лет\",\"\\\",REPLACE(C4,11,0,\"-\"),\" (2,5 лет ОГ).pdf\"),(IF(Check_Hyperlink(G4)=\"Файл в папке\",CONCATENATE(C4,\" (2,5 лет ОГ)\"),(IF(Check_Hyperlink(G4)=\"Нет файла\",\"Пусто\")))))","v":"SEGU8042531 (2,5 лет ОГ)"}]
["SEGU8042547",3,"SEGU8042547","Акт ОСВ","SEGU8042547\\2,5 лет\\SEGU804254-7 (2,5 лет).pdf",{"$f":"HYPERLINK(CONCATENATE(C5,\"\\\",\"2,5 лет\",\"\\\",REPLACE(C5,11,0,\"-\"),\" (2,5 лет).pdf\"),(IF(Check_Hyperlink(E5)=\"Файл в папке\",CONCATENATE(C5,\" (2,5 лет)\"),(IF(Check_Hyperlink(E5)=\"Нет файла\",\"Пусто\")))))","v":"SEGU8042547 (2,5 лет)"},"SEGU8042547\\2,5 лет\\SEGU804254-7 (2,5 лет ОГ).pdf",{"$f":"HYPERLINK(CONCATENATE(C5,\"\\\",\"2,5 лет\",\"\\\",REPLACE(C5,11,0,\"-\"),\" (2,5 лет ОГ).pdf\"),(IF(Check_Hyperlink(G5)=\"Файл в папке\",CONCATENATE(C5,\" (2,5 лет ОГ)\"),(IF(Check_Hyperlink(G5)=\"Нет файла\",\"Пусто\")))))","v":"SEGU8042547 (2,5 лет ОГ)"}]
["SEGU8042552",4,"SEGU8042552","Акт ОСВ","SEGU8042552\\2,5 лет\\SEGU804255-2 (2,5 лет).pdf",{"$f":"HYPERLINK(CONCATENATE(C6,\"\\\",\"2,5 лет\",\"\\\",REPLACE(C6,11,0,\"-\"),\" (2,5 лет).pdf\"),(IF(Check_Hyperlink(E6)=\"Файл в папке\",CONCATENATE(C6,\" (2,5 лет)\"),(IF(Check_Hyperlink(E6)=\"Нет файла\",\"Пусто\")))))","v":"SEGU8042552 (2,5 лет)"},"SEGU8042552\\2,5 лет\\SEGU804255-2 (2,5 лет ОГ).pdf",{"$f":"HYPERLINK(CONCATENATE(C6,\"\\\",\"2,5 лет\",\"\\\",REPLACE(C6,11,0,\"-\"),\" (2,5 лет ОГ).pdf\"),(IF(Check_Hyperlink(G6)=\"Файл в папке\",CONCATENATE(C6,\" (2,5 лет ОГ)\"),(IF(Check_Hyperlink(G6)=\"Нет файла\",\"Пусто\")))))","v":"SEGU8042552 (2,5 лет ОГ)"}]
["SEGU8042568",5,"SEGU8042568","Акт ОСВ","SEGU8042568\\2,5 лет\\SEGU804256-8 (2,5 лет).pdf",{"$f":"HYPERLINK(CONCATENATE(C7,\"\\\",\"2,5 лет\",\"\\\",REPLACE(C7,11,0,\"-\"),\" (2,5 лет).pdf\"),(IF(Check_Hyperlink(E7)=\"Файл в папке\",CONCATENATE(C7,\" (2,5 лет)\"),(IF(Check_Hyperlink(E7)=\"Нет файла\",\"Пусто\")))))","v":"Пусто"},"SEGU8042568\\2,5 лет\\SEGU804256-8 (2,5 лет ОГ).pdf",{"$f":"HYPERLINK(CONCATENATE(C7,\"\\\",\"2,5 лет\",\"\\\",REPLACE(C7,11,0,\"-\"),\" (2,5 лет ОГ).pdf\"),(IF(Check_Hyperlink(G7)=\"Файл в папке\",CONCATENATE(C7,\" (2,5 лет ОГ)\"),(IF(Check_Hyperlink(G7)=\"Нет файла\",\"Пусто\")))))","v":"Пусто"}]
["SEGU8042573",6,"SEGU8042573","Акт ОСВ","SEGU8042573\\2,5 лет\\SEGU804257-3 (2,5 лет).pdf",{"$f":"HYPERLINK(CONCATENATE(C8,\"\\\",\"2,5 лет\",\"\\\",REPLACE(C8,11,0,\"-\"),\" (2,5 лет).pdf\"),(IF(Check_Hyperlink(E8)=\"Файл в папке\",CONCATENATE(C8,\" (2,5 лет)\"),(IF(Check_Hyperlink(E8)=\"Нет файла\",\"Пусто\")))))","v":"Пусто"},"SEGU8042573\\2,5 лет\\SEGU804257-3 (2,5 лет ОГ).pdf",{"$f":"HYPERLINK(CONCATENATE(C8,\"\\\",\"2,5 лет\",\"\\\",REPLACE(C8,11,0,\"-\"),\" (2,5 лет ОГ).pdf\"),(IF(Check_Hyperlink(G8)=\"Файл в папке\",CONCATENATE(C8,\" (2,5 лет ОГ)\"),(IF(Check_Hyperlink(G8)=\"Нет файла\",\"Пусто\")))))","v":"Пусто"}]
["SEGU8042640",7,"SEGU8042640","Акт ОСВ","SEGU8042640\\2,5 лет\\SEGU804264-0 (2,5 лет).pdf",{"$f":"HYPERLINK(CONCATENATE(C9,\"\\\",\"2,5 лет\",\"\\\",REPLACE(C9,11,0,\"-\"),\" (2,5 лет).pdf\"),(IF(Check_Hyperlink(E9)=\"Файл в папке\",CONCATENATE(C9,\" (2,5 лет)\"),(IF(Check_Hyperlink(E9)=\"Нет файла\",\"Пусто\")))))","v":"Пусто"},"SEGU8042640\\2,5 лет\\SEGU804264-0 (2,5 лет ОГ).pdf",{"$f":"HYPERLINK(CONCATENATE(C9,\"\\\",\"2,5 лет\",\"\\\",REPLACE(C9,11,0,\"-\"),\" (2,5 лет ОГ).pdf\"),(IF(Check_Hyperlink(G9)=\"Файл в папке\",CONCATENATE(C9,\" (2,5 лет ОГ)\"),(IF(Check_Hyperlink(G9)=\"Нет файла\",\"Пусто\")))))","v":"Пусто"}]
["SEGU8042655",8,"SEGU8042655","Акт ОСВ","SEGU8042655\\2,5 лет\\SEGU804265-5 (2,5 лет).pdf",{"$f":"HYPERLINK(CONCATENATE(C10,\"\\\",\"2,5 лет\",\"\\\",REPLACE(C10,11,0,\"-\"),\" (2,5 лет).pdf\"),(IF(Check_Hyperlink(E10)=\"Файл в папке\",CONCATENATE(C10,\" (2,5 лет)\"),(IF(Check_Hyperlink(E10)=\"Нет файла\",\"Пусто\")))))","v":"Пусто"},"SEGU8042655\\2,5 лет\\SEGU804265-5 (2,5 лет ОГ).pdf",{"$f":"HYPERLINK(CONCATENATE(C10,\"\\\",\"2,5 лет\",\"\\\",REPLACE(C10,11,0,\"-\"),\" (2,5 лет ОГ).pdf\"),(IF(Check_Hyperlink(G10)=\"Файл в папке\",CONCATENATE(C10,\" (2,5 лет ОГ)\"),(IF(Check_Hyperlink(G10)=\"Нет файла\",\"Пусто\")))))","v":"Пусто"}]
["SEGU8042660",9,"SEGU8042660","Акт ОСВ","SEGU8042660\\2,5 лет\\SEGU804266-0 (2,5 лет).pdf",{"$f":"HYPERLINK(CONCATENATE(C11,\"\\\",\"2,5 лет\",\"\\\",REPLACE(C11,11,0,\"-\"),\" (2,5 лет).pdf\"),(IF(Check_Hyperlink(E11)=\"Файл в папке\",CONCATENATE(C11,\" (2,5 лет)\"),(IF(Check_Hyperlink(E11)=\"Нет файла\",\"Пусто\")))))","v":"Пусто"},"SEGU8042660\\2,5 лет\\SEGU804266-0 (2,5 лет ОГ).pdf",{"$f":"HYPERLINK(CONCATENATE(C11,\"\\\",\"2,5 лет\",\"\\\",REPLACE(C11,11,0,\"-\"),\" (2,5 лет ОГ).pdf\"),(IF(Check_Hyperlink(G11)=\"Файл в папке\",CONCATENATE(C11,\" (2,5 лет ОГ)\"),(IF(Check_Hyperlink(G11)=\"Нет файла\",\"Пусто\")))))","v":"Пусто"}]
["SEGU8042676",10,"SEGU8042676","Акт ОСВ","SEGU8042676\\2,5 лет\\SEGU804267-6 (2,5 лет).pdf",{"$f":"HYPERLINK(CONCATENATE(C12,\"\\\",\"2,5 лет\",\"\\\",REPLACE(C12,11,0,\"-\"),\" (2,5 лет).pdf\"),(IF(Check_Hyperlink(E12)=\"Файл в папке\",CONCATENATE(C12,\" (2,5 лет)\"),(IF(Check_Hyperlink(E12)=\"Нет файла\",\"Пусто\")))))","v":"Пусто"},"SEGU8042676\\2,5 лет\\SEGU804267-6 (2,5 лет ОГ).pdf",{"$f":"HYPERLINK(CONCATENATE(C12,\"\\\",\"2,5 лет\",\"\\\",REPLACE(C12,11,0,\"-\"),\" (2,5 лет ОГ).pdf\"),(IF(Check_Hyperlink(G12)=\"Файл в папке\",CONCATENATE(C12,\" (2,5 лет ОГ)\"),(IF(Check_Hyperlink(G12)=\"Нет файла\",\"Пусто\")))))","v":"Пусто"}]
["SEGU8042716",11,"SEGU8042716","Акт ОСВ","SEGU8042716\\2,5 лет\\SEGU804271-6 (2,5 лет).pdf",{"$f":"HYPERLINK(CONCATENATE(C13,\"\\\",\"2,5 лет\",\"\\\",REPLACE(C13,11,0,\"-\"),\" (2,5 лет).pdf\"),(IF(Check_Hyperlink(E13)=\"Файл в папке\",CONCATENATE(C13,\" (2,5 лет)\"),(IF(Check_Hyperlink(E13)=\"Нет файла\",\"Пусто\")))))","v":"Пусто"},"SEGU8042716\\2,5 лет\\SEGU804271-6 (2,5 лет ОГ).pdf",{"$f":"HYPERLINK(CONCATENATE(C13,\"\\\",\"2,5 лет\",\"\\\",REPLACE(C13,11,0,\"-\"),\" (2,5 лет ОГ).pdf\"),(IF(Check_Hyperlink(G13)=\"Файл в папке\",CONCATENATE(C13,\" (2,5 лет ОГ)\"),(IF(Check_Hyperlink(G13)=\"Нет файла\",\"Пусто\")))))","v":"Пусто"}]
["SEGU8042721",12,"SEGU8042721","Акт ОСВ","SEGU8042721\\2,5 лет\\SEGU804272-1 (2,5 лет).pdf",{"$f":"HYPERLINK(CONCATENATE(C14,\"\\\",\"2,5 лет\",\"\\\",REPLACE(C14,11,0,\"-\"),\" (2,5 лет).pdf\"),(IF(Check_Hyperlink(E14)=\"Файл в папке\",CONCATENATE(C14,\" (2,5 лет)\"),(IF(Check_Hyperlink(E14)=\"Нет файла\",\"Пусто\")))))","v":"Пусто"},"SEGU8042721\\2,5 лет\\SEGU804272-1 (2,5 лет ОГ).pdf",{"$f":"HYPERLINK(CONCATENATE(C14,\"\\\",\"2,5 лет\",\"\\\",REPLACE(C14,11,0,\"-\"),\" (2,5 лет ОГ).pdf\"),(IF(Check_Hyperlink(G14)=\"Файл в папке\",CONCATENATE(C14,\" (2,5 лет ОГ)\"),(IF(Check_Hyperlink(G14)=\"Нет файла\",\"Пусто\")))))","v":"Пусто"}]
["SEGU8042737",13,"SEGU8042737","Акт ОСВ","SEGU8042737\\2,5 лет\\SEGU804273-7 (2,5 лет).pdf",{"$f":"HYPERLINK(CONCATENATE(C15,\"\\\",\"2,5 лет\",\"\\\",REPLACE(C15,11,0,\"-\"),\" (2,5 лет).pdf\"),(IF(Check_Hyperlink(E15)=\"Файл в папке\",CONCATENATE(C15,\" (2,5 лет)\"),(IF(Check_Hyperlink(E15)=\"Нет файла\",\"Пусто\")))))","v":"Пусто"},"SEGU8042737\\2,5 лет\\SEGU804273-7 (2,5 лет ОГ).pdf",{"$f":"HYPERLINK(CONCATENATE(C15,\"\\\",\"2,5 лет\",\"\\\",REPLACE(C15,11,0,\"-\"),\" (2,5 лет ОГ).pdf\"),(IF(Check_Hyperlink(G15)=\"Файл в папке\",CONCATENATE(C15,\" (2,5 лет ОГ)\"),(IF(Check_Hyperlink(G15)=\"Нет файла\",\"Пусто\")))))","v":"Пусто"}]

{"sheet":"Пример 3","index":2,"n_rows":15,"n_cols":8,"rows_kept":15,"cut":false,"hidden":false,"merged":[[0,3,0,7],[0,0,1,0],[0,1,1,1],[0,2,1,2]]}
["Исходное наименование","№ п/п","Общая папка","Пример"]
[null,null,null,"Путь к папке","Файл (путь)","Наличие файла в папке МАКРОС проверяет по гиперссылке","Файл (путь)","Наличие файла в папке МАКРОС проверяет по гиперссылке"]
["SEGU8042486",1,{"$f":"HYPERLINK(CONCATENATE(\"..\\Пример\\\",A3),A3)","v":"SEGU8042486"},{"$f":"HYPERLINK(CONCATENATE(C3,\"\\\",\"5 лет\"),\"Акт ОСВ\")","v":"Акт ОСВ"},{"$f":"HYPERLINK(CONCATENATE(C3,\"\\\",\"5 лет\",\"\\\",REPLACE(C3,11,0,\"-\"),\" (5 лет).pdf\"))","v":"SEGU8042486\\5 лет\\SEGU804248-6 (5 лет).pdf"},{"$f":"HYPERLINK(CONCATENATE(C3,\"\\\",\"5 лет\",\"\\\",REPLACE(C3,11,0,\"-\"),\" (5 лет).pdf\"),(IF(Check_Hyperlink(E3)=\"Файл в папке\",CONCATENATE(C3,\" (5 лет)\"),(IF(Check_Hyperlink(E3)=\"Нет файла\",\"Пусто\")))))","v":"SEGU8042486 (5 лет)"},{"$f":"HYPERLINK(CONCATENATE(C3,\"\\\",\"5 лет\",\"\\\",REPLACE(C3,11,0,\"-\"),\" (5 лет ОГ).pdf\"))","v":"SEGU8042486\\5 лет\\SEGU804248-6 (5 лет ОГ).pdf"},{"$f":"HYPERLINK(CONCATENATE(C3,\"\\\",\"5 лет\",\"\\\",REPLACE(C3,11,0,\"-\"),\" (5 лет ОГ).pdf\"),(IF(Check_Hyperlink(G3)=\"Файл в папке\",CONCATENATE(C3,\" (5 лет ОГ)\"),(IF(Check_Hyperlink(G3)=\"Нет файла\",\"Пусто\")))))","v":"SEGU8042486 (5 лет ОГ)"}]
["SEGU8042531",2,{"$f":"HYPERLINK(CONCATENATE(\"..\\Пример\\\",A4),A4)","v":"SEGU8042531"},"Акт ОСВ",{"$f":"HYPERLINK(CONCATENATE(C4,\"\\\",\"5 лет\",\"\\\",REPLACE(C4,11,0,\"-\"),\" (5 лет).pdf\"))","v":"SEGU8042531\\5 лет\\SEGU804253-1 (5 лет).pdf"},{"$f":"HYPERLINK(CONCATENATE(C4,\"\\\",\"5 лет\",\"\\\",REPLACE(C4,11,0,\"-\"),\" (5 лет).pdf\"),(IF(Check_Hyperlink(E4)=\"Файл в папке\",CONCATENATE(C4,\" (5 лет)\"),(IF(Check_Hyperlink(E4)=\"Нет файла\",\"Пусто\")))))","v":"SEGU8042531 (5 лет)"},"SEGU8042531\\5 лет\\SEGU804253-1 (5 лет ОГ).pdf",{"$f":"HYPERLINK(CONCATENATE(C4,\"\\\",\"5 лет\",\"\\\",REPLACE(C4,11,0,\"-\"),\" (5 лет ОГ).pdf\"),(IF(Check_Hyperlink(G4)=\"Файл в папке\",CONCATENATE(C4,\" (5 лет ОГ)\"),(IF(Check_Hyperlink(G4)=\"Нет файла\",\"Пусто\")))))","v":"SEGU8042531 (5 лет ОГ)"}]
["SEGU8042547",3,"SEGU8042547","Акт ОСВ","SEGU8042547\\5 лет\\SEGU804254-7 (5 лет).pdf",{"$f":"HYPERLINK(CONCATENATE(C5,\"\\\",\"5 лет\",\"\\\",REPLACE(C5,11,0,\"-\"),\" (5 лет).pdf\"),(IF(Check_Hyperlink(E5)=\"Файл в папке\",CONCATENATE(C5,\" (5 лет)\"),(IF(Check_Hyperlink(E5)=\"Нет файла\",\"Пусто\")))))","v":"SEGU8042547 (5 лет)"},"SEGU8042547\\5 лет\\SEGU804254-7 (5 лет ОГ).pdf",{"$f":"HYPERLINK(CONCATENATE(C5,\"\\\",\"5 лет\",\"\\\",REPLACE(C5,11,0,\"-\"),\" (5 лет ОГ).pdf\"),(IF(Check_Hyperlink(G5)=\"Файл в папке\",CONCATENATE(C5,\" (5 лет ОГ)\"),(IF(Check_Hyperlink(G5)=\"Нет файла\",\"Пусто\")))))","v":"SEGU8042547 (5 лет ОГ)"}]
["SEGU8042552",4,"SEGU8042552","Акт ОСВ","SEGU8042552\\5 лет\\SEGU804255-2 (5 лет).pdf",{"$f":"HYPERLINK(CONCATENATE(C6,\"\\\",\"5 лет\",\"\\\",REPLACE(C6,11,0,\"-\"),\" (5 лет).pdf\"),(IF(Check_Hyperlink(E6)=\"Файл в папке\",CONCATENATE(C6,\" (5 лет)\"),(IF(Check_Hyperlink(E6)=\"Нет файла\",\"Пусто\")))))","v":"SEGU8042552 (5 лет)"},"SEGU8042552\\5 лет\\SEGU804255-2 (5 лет ОГ).pdf",{"$f":"HYPERLINK(CONCATENATE(C6,\"\\\",\"5 лет\",\"\\\",REPLACE(C6,11,0,\"-\"),\" (5 лет ОГ).pdf\"),(IF(Check_Hyperlink(G6)=\"Файл в папке\",CONCATENATE(C6,\" (5 лет ОГ)\"),(IF(Check_Hyperlink(G6)=\"Нет файла\",\"Пусто\")))))","v":"SEGU8042552 (5 лет ОГ)"}]
["SEGU8042568",5,"SEGU8042568","Акт ОСВ","SEGU8042568\\5 лет\\SEGU804256-8 (5 лет).pdf",{"$f":"HYPERLINK(CONCATENATE(C7,\"\\\",\"5 лет\",\"\\\",REPLACE(C7,11,0,\"-\"),\" (5 лет).pdf\"),(IF(Check_Hyperlink(E7)=\"Файл в папке\",CONCATENATE(C7,\" (5 лет)\"),(IF(Check_Hyperlink(E7)=\"Нет файла\",\"Пусто\")))))","v":"Пусто"},"SEGU8042568\\5 лет\\SEGU804256-8 (5 лет ОГ).pdf",{"$f":"HYPERLINK(CONCATENATE(C7,\"\\\",\"5 лет\",\"\\\",REPLACE(C7,11,0,\"-\"),\" (5 лет ОГ).pdf\"),(IF(Check_Hyperlink(G7)=\"Файл в папке\",CONCATENATE(C7,\" (5 лет ОГ)\"),(IF(Check_Hyperlink(G7)=\"Нет файла\",\"Пусто\")))))","v":"Пусто"}]
["SEGU8042573",6,"SEGU8042573","Акт ОСВ","SEGU8042573\\5 лет\\SEGU804257-3 (5 лет).pdf",{"$f":"HYPERLINK(CONCATENATE(C8,\"\\\",\"5 лет\",\"\\\",REPLACE(C8,11,0,\"-\"),\" (5 лет).pdf\"),(IF(Check_Hyperlink(E8)=\"Файл в папке\",CONCATENATE(C8,\" (5 лет)\"),(IF(Check_Hyperlink(E8)=\"Нет файла\",\"Пусто\")))))","v":"Пусто"},"SEGU8042573\\5 лет\\SEGU804257-3 (5 лет ОГ).pdf",{"$f":"HYPERLINK(CONCATENATE(C8,\"\\\",\"5 лет\",\"\\\",REPLACE(C8,11,0,\"-\"),\" (5 лет ОГ).pdf\"),(IF(Check_Hyperlink(G8)=\"Файл в папке\",CONCATENATE(C8,\" (5 лет ОГ)\"),(IF(Check_Hyperlink(G8)=\"Нет файла\",\"Пусто\")))))","v":"Пусто"}]
["SEGU8042640",7,"SEGU8042640","Акт ОСВ","SEGU8042640\\5 лет\\SEGU804264-0 (5 лет).pdf",{"$f":"HYPERLINK(CONCATENATE(C9,\"\\\",\"5 лет\",\"\\\",REPLACE(C9,11,0,\"-\"),\" (5 лет).pdf\"),(IF(Check_Hyperlink(E9)=\"Файл в папке\",CONCATENATE(C9,\" (5 лет)\"),(IF(Check_Hyperlink(E9)=\"Нет файла\",\"Пусто\")))))","v":"Пусто"},"SEGU8042640\\5 лет\\SEGU804264-0 (5 лет ОГ).pdf",{"$f":"HYPERLINK(CONCATENATE(C9,\"\\\",\"5 лет\",\"\\\",REPLACE(C9,11,0,\"-\"),\" (5 лет ОГ).pdf\"),(IF(Check_Hyperlink(G9)=\"Файл в папке\",CONCATENATE(C9,\" (5 лет ОГ)\"),(IF(Check_Hyperlink(G9)=\"Нет файла\",\"Пусто\")))))","v":"Пусто"}]
["SEGU8042655",8,"SEGU8042655","Акт ОСВ","SEGU8042655\\5 лет\\SEGU804265-5 (5 лет).pdf",{"$f":"HYPERLINK(CONCATENATE(C10,\"\\\",\"5 лет\",\"\\\",REPLACE(C10,11,0,\"-\"),\" (5 лет).pdf\"),(IF(Check_Hyperlink(E10)=\"Файл в папке\",CONCATENATE(C10,\" (5 лет)\"),(IF(Check_Hyperlink(E10)=\"Нет файла\",\"Пусто\")))))","v":"Пусто"},"SEGU8042655\\5 лет\\SEGU804265-5 (5 лет ОГ).pdf",{"$f":"HYPERLINK(CONCATENATE(C10,\"\\\",\"5 лет\",\"\\\",REPLACE(C10,11,0,\"-\"),\" (5 лет ОГ).pdf\"),(IF(Check_Hyperlink(G10)=\"Файл в папке\",CONCATENATE(C10,\" (5 лет ОГ)\"),(IF(Check_Hyperlink(G10)=\"Нет файла\",\"Пусто\")))))","v":"Пусто"}]
["SEGU8042660",9,"SEGU8042660","Акт ОСВ","SEGU8042660\\5 лет\\SEGU804266-0 (5 лет).pdf",{"$f":"HYPERLINK(CONCATENATE(C11,\"\\\",\"5 лет\",\"\\\",REPLACE(C11,11,0,\"-\"),\" (5 лет).pdf\"),(IF(Check_Hyperlink(E11)=\"Файл в папке\",CONCATENATE(C11,\" (5 лет)\"),(IF(Check_Hyperlink(E11)=\"Нет файла\",\"Пусто\")))))","v":"Пусто"},"SEGU8042660\\5 лет\\SEGU804266-0 (5 лет ОГ).pdf",{"$f":"HYPERLINK(CONCATENATE(C11,\"\\\",\"5 лет\",\"\\\",REPLACE(C11,11,0,\"-\"),\" (5 лет ОГ).pdf\"),(IF(Check_Hyperlink(G11)=\"Файл в папке\",CONCATENATE(C11,\" (5 лет ОГ)\"),(IF(Check_Hyperlink(G11)=\"Нет файла\",\"Пусто\")))))","v":"Пусто"}]
["SEGU8042676",10,"SEGU8042676","Акт ОСВ","SEGU8042676\\5 лет\\SEGU804267-6 (5 лет).pdf",{"$f":"HYPERLINK(CONCATENATE(C12,\"\\\",\"5 лет\",\"\\\",REPLACE(C12,11,0,\"-\"),\" (5 лет).pdf\"),(IF(Check_Hyperlink(E12)=\"Файл в папке\",CONCATENATE(C12,\" (5 лет)\"),(IF(Check_Hyperlink(E12)=\"Нет файла\",\"Пусто\")))))","v":"Пусто"},"SEGU8042676\\5 лет\\SEGU804267-6 (5 лет ОГ).pdf",{"$f":"HYPERLINK(CONCATENATE(C12,\"\\\",\"5 лет\",\"\\\",REPLACE(C12,11,0,\"-\"),\" (5 лет ОГ).pdf\"),(IF(Check_Hyperlink(G12)=\"Файл в папке\",CONCATENATE(C12,\" (5 лет ОГ)\"),(IF(Check_Hyperlink(G12)=\"Нет файла\",\"Пусто\")))))","v":"Пусто"}]
["SEGU8042716",11,"SEGU8042716","Акт ОСВ","SEGU8042716\\5 лет\\SEGU804271-6 (5 лет).pdf",{"$f":"HYPERLINK(CONCATENATE(C13,\"\\\",\"5 лет\",\"\\\",REPLACE(C13,11,0,\"-\"),\" (5 лет).pdf\"),(IF(Check_Hyperlink(E13)=\"Файл в папке\",CONCATENATE(C13,\" (5 лет)\"),(IF(Check_Hyperlink(E13)=\"Нет файла\",\"Пусто\")))))","v":"Пусто"},"SEGU8042716\\5 лет\\SEGU804271-6 (5 лет ОГ).pdf",{"$f":"HYPERLINK(CONCATENATE(C13,\"\\\",\"5 лет\",\"\\\",REPLACE(C13,11,0,\"-\"),\" (5 лет ОГ).pdf\"),(IF(Check_Hyperlink(G13)=\"Файл в папке\",CONCATENATE(C13,\" (5 лет ОГ)\"),(IF(Check_Hyperlink(G13)=\"Нет файла\",\"Пусто\")))))","v":"Пусто"}]
["SEGU8042721",12,"SEGU8042721","Акт ОСВ","SEGU8042721\\5 лет\\SEGU804272-1 (5 лет).pdf",{"$f":"HYPERLINK(CONCATENATE(C14,\"\\\",\"5 лет\",\"\\\",REPLACE(C14,11,0,\"-\"),\" (5 лет).pdf\"),(IF(Check_Hyperlink(E14)=\"Файл в папке\",CONCATENATE(C14,\" (5 лет)\"),(IF(Check_Hyperlink(E14)=\"Нет файла\",\"Пусто\")))))","v":"Пусто"},"SEGU8042721\\5 лет\\SEGU804272-1 (5 лет ОГ).pdf",{"$f":"HYPERLINK(CONCATENATE(C14,\"\\\",\"5 лет\",\"\\\",REPLACE(C14,11,0,\"-\"),\" (5 лет ОГ).pdf\"),(IF(Check_Hyperlink(G14)=\"Файл в папке\",CONCATENATE(C14,\" (5 лет ОГ)\"),(IF(Check_Hyperlink(G14)=\"Нет файла\",\"Пусто\")))))","v":"Пусто"}]
["SEGU8042737",13,"SEGU8042737","Акт ОСВ","SEGU8042737\\5 лет\\SEGU804273-7 (5 лет).pdf",{"$f":"HYPERLINK(CONCATENATE(C15,\"\\\",\"5 лет\",\"\\\",REPLACE(C15,11,0,\"-\"),\" (5 лет).pdf\"),(IF(Check_Hyperlink(E15)=\"Файл в папке\",CONCATENATE(C15,\" (5 лет)\"),(IF(Check_Hyperlink(E15)=\"Нет файла\",\"Пусто\")))))","v":"Пусто"},"SEGU8042737\\5 лет\\SEGU804273-7 (5 лет ОГ).pdf",{"$f":"HYPERLINK(CONCATENATE(C15,\"\\\",\"5 лет\",\"\\\",REPLACE(C15,11,0,\"-\"),\" (5 лет ОГ).pdf\"),(IF(Check_Hyperlink(G15)=\"Файл в папке\",CONCATENATE(C15,\" (5 лет ОГ)\"),(IF(Check_Hyperlink(G15)=\"Нет файла\",\"Пусто\")))))","v":"Пусто"}]

{"sheet":"Пример 4","index":3,"n_rows":15,"n_cols":8,"rows_kept":15,"cut":false,"hidden":false,"merged":[[0,3,0,7],[0,0,1,0],[0,1,1,1],[0,2,1,2]]}
["Исходное наименование","№ п/п","Общая папка","Пример"]
[null,null,null,"Путь к папке","Файл (путь)","Наличие файла в папке МАКРОС проверяет по гиперссылке","Файл (путь)","Наличие файла в папке МАКРОС проверяет по гиперссылке"]
["SEGU8042486",1,{"$f":"HYPERLINK(CONCATENATE(\"..\\Пример\\\",A3),A3)","v":"SEGU8042486"},{"$f":"HYPERLINK(CONCATENATE(C3,\"\\\",\"7,5 лет\"),\"Акт ОСВ\")","v":"Акт ОСВ"},{"$f":"HYPERLINK(CONCATENATE(C3,\"\\\",\"7,5 лет\",\"\\\",REPLACE(C3,11,0,\"-\"),\" (7,5 лет).pdf\"))","v":"SEGU8042486\\7,5 лет\\SEGU804248-6 (7,5 лет).pdf"},{"$f":"HYPERLINK(CONCATENATE(C3,\"\\\",\"7,5 лет\",\"\\\",REPLACE(C3,11,0,\"-\"),\" (7,5 лет).pdf\"),(IF(Check_Hyperlink(E3)=\"Файл в папке\",CONCATENATE(C3,\" (7,5 лет)\"),(IF(Check_Hyperlink(E3)=\"Нет файла\",\"Пусто\")))))","v":"SEGU8042486 (7,5 лет)"},{"$f":"HYPERLINK(CONCATENATE(C3,\"\\\",\"7,5 лет\",\"\\\",REPLACE(C3,11,0,\"-\"),\" (7,5 лет ОГ).pdf\"))","v":"SEGU8042486\\7,5 лет\\SEGU804248-6 (7,5 лет ОГ).pdf"},{"$f":"HYPERLINK(CONCATENATE(C3,\"\\\",\"7,5 лет\",\"\\\",REPLACE(C3,11,0,\"-\"),\" (7,5 лет ОГ).pdf\"),(IF(Check_Hyperlink(G3)=\"Файл в папке\",CONCATENATE(C3,\" (7,5 лет ОГ)\"),(IF(Check_Hyperlink(G3)=\"Нет файла\",\"Пусто\")))))","v":"SEGU8042486 (7,5 лет ОГ)"}]
["SEGU8042531",2,{"$f":"HYPERLINK(CONCATENATE(\"..\\Пример\\\",A4),A4)","v":"SEGU8042531"},"Акт ОСВ",{"$f":"HYPERLINK(CONCATENATE(C4,\"\\\",\"7,5 лет\",\"\\\",REPLACE(C4,11,0,\"-\"),\" (7,5 лет).pdf\"))","v":"SEGU8042531\\7,5 лет\\SEGU804253-1 (7,5 лет).pdf"},{"$f":"HYPERLINK(CONCATENATE(C4,\"\\\",\"7,5 лет\",\"\\\",REPLACE(C4,11,0,\"-\"),\" (7,5 лет).pdf\"),(IF(Check_Hyperlink(E4)=\"Файл в папке\",CONCATENATE(C4,\" (7,5 лет)\"),(IF(Check_Hyperlink(E4)=\"Нет файла\",\"Пусто\")))))","v":"SEGU8042531 (7,5 лет)"},"SEGU8042531\\7,5 лет\\SEGU804253-1 (7,5 лет ОГ).pdf",{"$f":"HYPERLINK(CONCATENATE(C4,\"\\\",\"7,5 лет\",\"\\\",REPLACE(C4,11,0,\"-\"),\" (7,5 лет ОГ).pdf\"),(IF(Check_Hyperlink(G4)=\"Файл в папке\",CONCATENATE(C4,\" (7,5 лет ОГ)\"),(IF(Check_Hyperlink(G4)=\"Нет файла\",\"Пусто\")))))","v":"SEGU8042531 (7,5 лет ОГ)"}]
["SEGU8042547",3,"SEGU8042547","Акт ОСВ","SEGU8042547\\7,5 лет\\SEGU804254-7 (7,5 лет).pdf",{"$f":"HYPERLINK(CONCATENATE(C5,\"\\\",\"7,5 лет\",\"\\\",REPLACE(C5,11,0,\"-\"),\" (7,5 лет).pdf\"),(IF(Check_Hyperlink(E5)=\"Файл в папке\",CONCATENATE(C5,\" (7,5 лет)\"),(IF(Check_Hyperlink(E5)=\"Нет файла\",\"Пусто\")))))","v":"Пусто"},"SEGU8042547\\7,5 лет\\SEGU804254-7 (7,5 лет ОГ).pdf",{"$f":"HYPERLINK(CONCATENATE(C5,\"\\\",\"7,5 лет\",\"\\\",REPLACE(C5,11,0,\"-\"),\" (7,5 лет ОГ).pdf\"),(IF(Check_Hyperlink(G5)=\"Файл в папке\",CONCATENATE(C5,\" (7,5 лет ОГ)\"),(IF(Check_Hyperlink(G5)=\"Нет файла\",\"Пусто\")))))","v":"Пусто"}]
["SEGU8042552",4,"SEGU8042552","Акт ОСВ","SEGU8042552\\7,5 лет\\SEGU804255-2 (7,5 лет).pdf",{"$f":"HYPERLINK(CONCATENATE(C6,\"\\\",\"7,5 лет\",\"\\\",REPLACE(C6,11,0,\"-\"),\" (7,5 лет).pdf\"),(IF(Check_Hyperlink(E6)=\"Файл в папке\",CONCATENATE(C6,\" (7,5 лет)\"),(IF(Check_Hyperlink(E6)=\"Нет файла\",\"Пусто\")))))","v":"Пусто"},"SEGU8042552\\7,5 лет\\SEGU804255-2 (7,5 лет ОГ).pdf",{"$f":"HYPERLINK(CONCATENATE(C6,\"\\\",\"7,5 лет\",\"\\\",REPLACE(C6,11,0,\"-\"),\" (7,5 лет ОГ).pdf\"),(IF(Check_Hyperlink(G6)=\"Файл в папке\",CONCATENATE(C6,\" (7,5 лет ОГ)\"),(IF(Check_Hyperlink(G6)=\"Нет файла\",\"Пусто\")))))","v":"Пусто"}]
["SEGU8042568",5,"SEGU8042568","Акт ОСВ","SEGU8042568\\7,5 лет\\SEGU804256-8 (7,5 лет).pdf",{"$f":"HYPERLINK(CONCATENATE(C7,\"\\\",\"7,5 лет\",\"\\\",REPLACE(C7,11,0,\"-\"),\" (7,5 лет).pdf\"),(IF(Check_Hyperlink(E7)=\"Файл в папке\",CONCATENATE(C7,\" (7,5 лет)\"),(IF(Check_Hyperlink(E7)=\"Нет файла\",\"Пусто\")))))","v":"Пусто"},"SEGU8042568\\7,5 лет\\SEGU804256-8 (7,5 лет ОГ).pdf",{"$f":"HYPERLINK(CONCATENATE(C7,\"\\\",\"7,5 лет\",\"\\\",REPLACE(C7,11,0,\"-\"),\" (7,5 лет ОГ).pdf\"),(IF(Check_Hyperlink(G7)=\"Файл в папке\",CONCATENATE(C7,\" (7,5 лет ОГ)\"),(IF(Check_Hyperlink(G7)=\"Нет файла\",\"Пусто\")))))","v":"Пусто"}]
["SEGU8042573",6,"SEGU8042573","Акт ОСВ","SEGU8042573\\7,5 лет\\SEGU804257-3 (7,5 лет).pdf",{"$f":"HYPERLINK(CONCATENATE(C8,\"\\\",\"7,5 лет\",\"\\\",REPLACE(C8,11,0,\"-\"),\" (7,5 лет).pdf\"),(IF(Check_Hyperlink(E8)=\"Файл в папке\",CONCATENATE(C8,\" (7,5 лет)\"),(IF(Check_Hyperlink(E8)=\"Нет файла\",\"Пусто\")))))","v":"Пусто"},"SEGU8042573\\7,5 лет\\SEGU804257-3 (7,5 лет ОГ).pdf",{"$f":"HYPERLINK(CONCATENATE(C8,\"\\\",\"7,5 лет\",\"\\\",REPLACE(C8,11,0,\"-\"),\" (7,5 лет ОГ).pdf\"),(IF(Check_Hyperlink(G8)=\"Файл в папке\",CONCATENATE(C8,\" (7,5 лет ОГ)\"),(IF(Check_Hyperlink(G8)=\"Нет файла\",\"Пусто\")))))","v":"Пусто"}]
["SEGU8042640",7,"SEGU8042640","Акт ОСВ","SEGU8042640\\7,5 лет\\SEGU804264-0 (7,5 лет).pdf",{"$f":"HYPERLINK(CONCATENATE(C9,\"\\\",\"7,5 лет\",\"\\\",REPLACE(C9,11,0,\"-\"),\" (7,5 лет).pdf\"),(IF(Check_Hyperlink(E9)=\"Файл в папке\",CONCATENATE(C9,\" (7,5 лет)\"),(IF(Check_Hyperlink(E9)=\"Нет файла\",\"Пусто\")))))","v":"Пусто"},"SEGU8042640\\7,5 лет\\SEGU804264-0 (7,5 лет ОГ).pdf",{"$f":"HYPERLINK(CONCATENATE(C9,\"\\\",\"7,5 лет\",\"\\\",REPLACE(C9,11,0,\"-\"),\" (7,5 лет ОГ).pdf\"),(IF(Check_Hyperlink(G9)=\"Файл в папке\",CONCATENATE(C9,\" (7,5 лет ОГ)\"),(IF(Check_Hyperlink(G9)=\"Нет файла\",\"Пусто\")))))","v":"Пусто"}]
["SEGU8042655",8,"SEGU8042655","Акт ОСВ","SEGU8042655\\7,5 лет\\SEGU804265-5 (7,5 лет).pdf",{"$f":"HYPERLINK(CONCATENATE(C10,\"\\\",\"7,5 лет\",\"\\\",REPLACE(C10,11,0,\"-\"),\" (7,5 лет).pdf\"),(IF(Check_Hyperlink(E10)=\"Файл в папке\",CONCATENATE(C10,\" (7,5 лет)\"),(IF(Check_Hyperlink(E10)=\"Нет файла\",\"Пусто\")))))","v":"Пусто"},"SEGU8042655\\7,5 лет\\SEGU804265-5 (7,5 лет ОГ).pdf",{"$f":"HYPERLINK(CONCATENATE(C10,\"\\\",\"7,5 лет\",\"\\\",REPLACE(C10,11,0,\"-\"),\" (7,5 лет ОГ).pdf\"),(IF(Check_Hyperlink(G10)=\"Файл в папке\",CONCATENATE(C10,\" (7,5 лет ОГ)\"),(IF(Check_Hyperlink(G10)=\"Нет файла\",\"Пусто\")))))","v":"Пусто"}]
["SEGU8042660",9,"SEGU8042660","Акт ОСВ","SEGU8042660\\7,5 лет\\SEGU804266-0 (7,5 лет).pdf",{"$f":"HYPERLINK(CONCATENATE(C11,\"\\\",\"7,5 лет\",\"\\\",REPLACE(C11,11,0,\"-\"),\" (7,5 лет).pdf\"),(IF(Check_Hyperlink(E11)=\"Файл в папке\",CONCATENATE(C11,\" (7,5 лет)\"),(IF(Check_Hyperlink(E11)=\"Нет файла\",\"Пусто\")))))","v":"Пусто"},"SEGU8042660\\7,5 лет\\SEGU804266-0 (7,5 лет ОГ).pdf",{"$f":"HYPERLINK(CONCATENATE(C11,\"\\\",\"7,5 лет\",\"\\\",REPLACE(C11,11,0,\"-\"),\" (7,5 лет ОГ).pdf\"),(IF(Check_Hyperlink(G11)=\"Файл в папке\",CONCATENATE(C11,\" (7,5 лет ОГ)\"),(IF(Check_Hyperlink(G11)=\"Нет файла\",\"Пусто\")))))","v":"Пусто"}]
["SEGU8042676",10,"SEGU8042676","Акт ОСВ","SEGU8042676\\7,5 лет\\SEGU804267-6 (7,5 лет).pdf",{"$f":"HYPERLINK(CONCATENATE(C12,\"\\\",\"7,5 лет\",\"\\\",REPLACE(C12,11,0,\"-\"),\" (7,5 лет).pdf\"),(IF(Check_Hyperlink(E12)=\"Файл в папке\",CONCATENATE(C12,\" (7,5 лет)\"),(IF(Check_Hyperlink(E12)=\"Нет файла\",\"Пусто\")))))","v":"Пусто"},"SEGU8042676\\7,5 лет\\SEGU804267-6 (7,5 лет ОГ).pdf",{"$f":"HYPERLINK(CONCATENATE(C12,\"\\\",\"7,5 лет\",\"\\\",REPLACE(C12,11,0,\"-\"),\" (7,5 лет ОГ).pdf\"),(IF(Check_Hyperlink(G12)=\"Файл в папке\",CONCATENATE(C12,\" (7,5 лет ОГ)\"),(IF(Check_Hyperlink(G12)=\"Нет файла\",\"Пусто\")))))","v":"Пусто"}]
["SEGU8042716",11,"SEGU8042716","Акт ОСВ","SEGU8042716\\7,5 лет\\SEGU804271-6 (7,5 лет).pdf",{"$f":"HYPERLINK(CONCATENATE(C13,\"\\\",\"7,5 лет\",\"\\\",REPLACE(C13,11,0,\"-\"),\" (7,5 лет).pdf\"),(IF(Check_Hyperlink(E13)=\"Файл в папке\",CONCATENATE(C13,\" (7,5 лет)\"),(IF(Check_Hyperlink(E13)=\"Нет файла\",\"Пусто\")))))","v":"Пусто"},"SEGU8042716\\7,5 лет\\SEGU804271-6 (7,5 лет ОГ).pdf",{"$f":"HYPERLINK(CONCATENATE(C13,\"\\\",\"7,5 лет\",\"\\\",REPLACE(C13,11,0,\"-\"),\" (7,5 лет ОГ).pdf\"),(IF(Check_Hyperlink(G13)=\"Файл в папке\",CONCATENATE(C13,\" (7,5 лет ОГ)\"),(IF(Check_Hyperlink(G13)=\"Нет файла\",\"Пусто\")))))","v":"Пусто"}]
["SEGU8042721",12,"SEGU8042721","Акт ОСВ","SEGU8042721\\7,5 лет\\SEGU804272-1 (7,5 лет).pdf",{"$f":"HYPERLINK(CONCATENATE(C14,\"\\\",\"7,5 лет\",\"\\\",REPLACE(C14,11,0,\"-\"),\" (7,5 лет).pdf\"),(IF(Check_Hyperlink(E14)=\"Файл в папке\",CONCATENATE(C14,\" (7,5 лет)\"),(IF(Check_Hyperlink(E14)=\"Нет файла\",\"Пусто\")))))","v":"Пусто"},"SEGU8042721\\7,5 лет\\SEGU804272-1 (7,5 лет ОГ).pdf",{"$f":"HYPERLINK(CONCATENATE(C14,\"\\\",\"7,5 лет\",\"\\\",REPLACE(C14,11,0,\"-\"),\" (7,5 лет ОГ).pdf\"),(IF(Check_Hyperlink(G14)=\"Файл в папке\",CONCATENATE(C14,\" (7,5 лет ОГ)\"),(IF(Check_Hyperlink(G14)=\"Нет файла\",\"Пусто\")))))","v":"Пусто"}]
["SEGU8042737",13,"SEGU8042737","Акт ОСВ","SEGU8042737\\7,5 лет\\SEGU804273-7 (7,5 лет).pdf",{"$f":"HYPERLINK(CONCATENATE(C15,\"\\\",\"7,5 лет\",\"\\\",REPLACE(C15,11,0,\"-\"),\" (7,5 лет).pdf\"),(IF(Check_Hyperlink(E15)=\"Файл в папке\",CONCATENATE(C15,\" (7,5 лет)\"),(IF(Check_Hyperlink(E15)=\"Нет файла\",\"Пусто\")))))","v":"Пусто"},"SEGU8042737\\7,5 лет\\SEGU804273-7 (7,5 лет ОГ).pdf",{"$f":"HYPERLINK(CONCATENATE(C15,\"\\\",\"7,5 лет\",\"\\\",REPLACE(C15,11,0,\"-\"),\" (7,5 лет ОГ).pdf\"),(IF(Check_Hyperlink(G15)=\"Файл в папке\",CONCATENATE(C15,\" (7,5 лет ОГ)\"),(IF(Check_Hyperlink(G15)=\"Нет файла\",\"Пусто\")))))","v":"Пусто"}]