{"text_format":"1","workbook":"xlsx","n_sheets":2,"sheets":["Лист1","Иванов"],"not_rendered":{"charts":0,"images":0,"macros":1,"external_links":0,"defined_names":1,"comments":0,"pivot_tables":0},"unopened":[],"bounds":{"document_bytes":16777216,"sheet_cells":100000,"rows_first":2000,"rows_last":500,"rows_between":2000,"halvings":0,"cell_chars":16384,"cell_head_chars":4096},"cells_cut":0,"cells_raw":0,"read":"whole","date_system":"1900"}

{"sheet":"Лист1","index":0,"n_rows":15,"n_cols":19,"rows_kept":15,"cut":false,"hidden":false,"merged":[[12,8,12,10],[13,8,13,10],[14,8,14,10],[5,14,9,14],[3,13,4,14],[10,13,11,14],[5,18,9,18],[3,17,4,18],[10,17,11,18],[5,8,9,8],[3,7,3,9],[11,8,11,10]]}
[]
[]
[]
[null,null,null,null,null,null,null,"Скрытие не нужных дней",null,null,null,null,null,"Выбор месяца",null,null,null,"Выбор года"]
[]
[null,null,null,null,null,null,null,null,{"$f":"MOD(DAY(DATE(S6,O6,31)),31)","v":0},null,null,null,null,null,10,null,null,null,2021]
[]
[]
{"$rows_left_out":8}
{"sheet":"Иванов","index":1,"n_rows":20,"n_cols":38,"rows_kept":20,"cut":false,"hidden":false,"merged":[[17,0,17,1],[17,35,17,36],[19,12,19,23],[16,0,16,1],[8,37,10,37],[12,37,14,37],[0,35,0,36],[1,3,2,3],[1,35,1,36],[0,30,0,34],[4,37,6,37],[0,0,0,1],[1,2,2,2],[1,0,1,1],[0,2,0,21],[0,22,0,29]]}
["Социальный работник                               ",null,"График работы социального работника ",null,null,null,null,null,null,null,null,null,null,null,null,null,null,null,null,null,null,null,{"$f":"IF(Лист1!$O$6=1,\"Январь\",IF(Лист1!$O$6=2,\"Февраль\",IF(Лист1!$O$6=3,\"Март\",IF(Лист1!$O$6=4,\"Апрель\",IF(Лист1!$O$6=5,\"Май\",IF(Лист1!$O$6=6,\"Июнь\",IF(Лист1!$O$6=7,\"Июль\",IF(Лист1!$O$6=8,\"Август\",IF(Лист1!$O$6=9,\"Сентябрь\",IF(Лист1!$O$6=10,\"Октябрь\",IF(Лист1!$O$6=11,\"Ноябрь\",IF(Лист1!$O$6=12,\"Декабрь\"))))))))))))","v":"Октябрь"},null,null,null,null,null,null,null,{"$f":"Лист1!S6","v":2021}]
[null,null,"время ","период",{"$f":"IFERROR(DATEVALUE(COLUMN()-COLUMN($D$2)&\".\"&Лист1!$O$6&\".\"&Лист1!$S$6),\" \")","v":"2021-10-01"},{"$f":"IFERROR(DATEVALUE(COLUMN()-COLUMN($D$2)&\".\"&Лист1!$O$6&\".\"&Лист1!$S$6),\" \")","v":"2021-10-02"},{"$f":"IFERROR(DATEVALUE(COLUMN()-COLUMN($D$2)&\".\"&Лист1!$O$6&\".\"&Лист1!$S$6),\" \")","v":"2021-10-03"},{"$f":"IFERROR(DATEVALUE(COLUMN()-COLUMN($D$2)&\".\"&Лист1!$O$6&\".\"&Лист1!$S$6),\" \")","v":"2021-10-04"},{"$f":"IFERROR(DATEVALUE(COLUMN()-COLUMN($D$2)&\".\"&Лист1!$O$6&\".\"&Лист1!$S$6),\" \")","v":"2021-10-05"},{"$f":"IFERROR(DATEVALUE(COLUMN()-COLUMN($D$2)&\".\"&Лист1!$O$6&\".\"&Лист1!$S$6),\" \")","v":"2021-10-06"},{"$f":"IFERROR(DATEVALUE(COLUMN()-COLUMN($D$2)&\".\"&Лист1!$O$6&\".\"&Лист1!$S$6),\" \")","v":"2021-10-07"},{"$f":"IFERROR(DATEVALUE(COLUMN()-COLUMN($D$2)&\".\"&Лист1!$O$6&\".\"&Лист1!$S$6),\" \")","v":"2021-10-08"},{"$f":"IFERROR(DATEVALUE(COLUMN()-COLUMN($D$2)&\".\"&Лист1!$O$6&\".\"&Лист1!$S$6),\" \")","v":"2021-10-09"},{"$f":"IFERROR(DATEVALUE(COLUMN()-COLUMN($D$2)&\".\"&Лист1!$O$6&\".\"&Лист1!$S$6),\" \")","v":"2021-10-10"},{"$f":"IFERROR(DATEVALUE(COLUMN()-COLUMN($D$2)&\".\"&Лист1!$O$6&\".\"&Лист1!$S$6),\" \")","v":"2021-10-11"},{"$f":"IFERROR(DATEVALUE(COLUMN()-COLUMN($D$2)&\".\"&Лист1!$O$6&\".\"&Лист1!$S$6),\" \")","v":"2021-10-12"},{"$f":"IFERROR(DATEVALUE(COLUMN()-COLUMN($D$2)&\".\"&Лист1!$O$6&\".\"&Лист1!$S$6),\" \")","v":"2021-10-13"},{"$f":"IFERROR(DATEVALUE(COLUMN()-COLUMN($D$2)&\".\"&Лист1!$O$6&\".\"&Лист1!$S$6),\" \")","v":"2021-10-14"},{"$f":"IFERROR(DATEVALUE(COLUMN()-COLUMN($D$2)&\".\"&Лист1!$O$6&\".\"&Лист1!$S$6),\" \")","v":"2021-10-15"},{"$f":"IFERROR(DATEVALUE(COLUMN()-COLUMN($D$2)&\".\"&Лист1!$O$6&\".\"&Лист1!$S$6),\" \")","v":"2021-10-16"},{"$f":"IFERROR(DATEVALUE(COLUMN()-COLUMN($D$2)&\".\"&Лист1!$O$6&\".\"&Лист1!$S$6),\" \")","v":"2021-10-17"},{"$f":"IFERROR(DATEVALUE(COLUMN()-COLUMN($D$2)&\".\"&Лист1!$O$6&\".\"&Лист1!$S$6),\" \")","v":"2021-10-18"},{"$f":"IFERROR(DATEVALUE(COLUMN()-COLUMN($D$2)&\".\"&Лист1!$O$6&\".\"&Лист1!$S$6),\" \")","v":"2021-10-19"},{"$f":"IFERROR(DATEVALUE(COLUMN()-COLUMN($D$2)&\".\"&Лист1!$O$6&\".\"&Лист1!$S$6),\" \")","v":"2021-10-20"},{"$f":"IFERROR(DATEVALUE(COLUMN()-COLUMN($D$2)&\".\"&Лист1!$O$6&\".\"&Лист1!$S$6),\" \")","v":"2021-10-21"},{"$f":"IFERROR(DATEVALUE(COLUMN()-COLUMN($D$2)&\".\"&Лист1!$O$6&\".\"&Лист1!$S$6),\" \")","v":"2021-10-22"},{"$f":"IFERROR(DATEVALUE(COLUMN()-COLUMN($D$2)&\".\"&Лист1!$O$6&\".\"&Лист1!$S$6),\" \")","v":"2021-10-23"},{"$f":"IFERROR(DATEVALUE(COLUMN()-COLUMN($D$2)&\".\"&Лист1!$O$6&\".\"&Лист1!$S$6),\" \")","v":"2021-10-24"},{"$f":"IFERROR(DATEVALUE(COLUMN()-COLUMN($D$2)&\".\"&Лист1!$O$6&\".\"&Лист1!$S$6),\" \")","v":"2021-10-25"},{"$f":"IFERROR(DATEVALUE(COLUMN()-COLUMN($D$2)&\".\"&Лист1!$O$6&\".\"&Лист1!$S$6),\" \")","v":"2021-10-26"},{"$f":"IFERROR(DATEVALUE(COLUMN()-COLUMN($D$2)&\".\"&Лист1!$O$6&\".\"&Лист1!$S$6),\" \")","v":"2021-10-27"},{"$f":"IFERROR(DATEVALUE(COLUMN()-COLUMN($D$2)&\".\"&Лист1!$O$6&\".\"&Лист1!$S$6),\" \")","v":"2021-10-28"},{"$f":"IFERROR(DATEVALUE(COLUMN()-COLUMN($D$2)&\".\"&Лист1!$O$6&\".\"&Лист1!$S$6),\" \")","v":"2021-10-29"},{"$f":"IFERROR(DATEVALUE(COLUMN()-COLUMN($D$2)&\".\"&Лист1!$O$6&\".\"&Лист1!$S$6),\" \")","v":"2021-10-30"},{"$f":"IFERROR(DATEVALUE(COLUMN()-COLUMN($D$2)&\".\"&Лист1!$O$6&\".\"&Лист1!$S$6),\" \")","v":"2021-10-31"},null,null,"Всего"]
["Дни посещений","Услуги",null,null,{"$f":"TEXT(E2,\"ддд\")","v":"Пт"},{"$f":"TEXT(F2,\"ддд\")","v":"Сб"},"Вс","Пн","Вт","Ср","Чт",{"$f":"TEXT(L2,\"ддд\")","v":"Пт"},"Сб","Вс","Пн","Вт","Ср","Чт","Пт","Сб","Вс","Пн","Вт","Ср","Чт","Пт","Сб","Вс","Пн","Вт","Ср","Чт","Пт","Сб","Вс","минут","услуг","услуг"]
["Иванов ","1 группа"]
["вт, чт","покупка продуктов",35,"2р/н",{"$f":"IF(IF(ISNUMBER(-MID(\" \"&$A5,SEARCH(E$3,\" \"&$A5)-2,1)),MID(\" \"&$A5,SEARCH(E$3,\" \"&$A5)-2,4)=COUNTIF($E$3:E$3,E$3)&\" \"&E$3,ISNUMBER(SEARCH(E$3,$A5))),$C5,\"\")","v":""},{"$f":"IF(IF(ISNUMBER(-MID(\" \"&$A5,SEARCH(F$3,\" \"&$A5)-2,1)),MID(\" \"&$A5,SEARCH(F$3,\" \"&$A5)-2,4)=COUNTIF($E$3:F$3,F$3)&\" \"&F$3,ISNUMBER(SEARCH(F$3,$A5))),$C5,\"\")","v":""},{"$f":"IF(IF(ISNUMBER(-MID(\" \"&$A5,SEARCH(G$3,\" \"&$A5)-2,1)),MID(\" \"&$A5,SEARCH(G$3,\" \"&$A5)-2,4)=COUNTIF($E$3:G$3,G$3)&\" \"&G$3,ISNUMBER(SEARCH(G$3,$A5))),$C5,\"\")","v":""},{"$f":"IF(IF(ISNUMBER(-MID(\" \"&$A5,SEARCH(H$3,\" \"&$A5)-2,1)),MID(\" \"&$A5,SEARCH(H$3,\" \"&$A5)-2,4)=COUNTIF($E$3:H$3,H$3)&\" \"&H$3,ISNUMBER(SEARCH(H$3,$A5))),$C5,\"\")","v":""},{"$f":"IF(IF(ISNUMBER(-MID(\" \"&$A5,SEARCH(I$3,\" \"&$A5)-2,1)),MID(\" \"&$A5,SEARCH(I$3,\" \"&$A5)-2,4)=COUNTIF($E$3:I$3,I$3)&\" \"&I$3,ISNUMBER(SEARCH(I$3,$A5))),$C5,\"\")","v":35},{"$f":"IF(IF(ISNUMBER(-MID(\" \"&$A5,SEARCH(J$3,\" \"&$A5)-2,1)),MID(\" \"&$A5,SEARCH(J$3,\" \"&$A5)-2,4)=COUNTIF($E$3:J$3,J$3)&\" \"&J$3,ISNUMBER(SEARCH(J$3,$A5))),$C5,\"\")","v":""},{"$f":"IF(IF(ISNUMBER(-MID(\" \"&$A5,SEARCH(K$3,\" \"&$A5)-2,1)),MID(\" \"&$A5,SEARCH(K$3,\" \"&$A5)-2,4)=COUNTIF($E$3:K$3,K$3)&\" \"&K$3,ISNUMBER(SEARCH(K$3,$A5))),$C5,\"\")","v":35},{"$f":"IF(IF(ISNUMBER(-MID(\" \"&$A5,SEARCH(L$3,\" \"&$A5)-2,1)),MID(\" \"&$A5,SEARCH(L$3,\" \"&$A5)-2,4)=COUNTIF($E$3:L$3,L$3)&\" \"&L$3,ISNUMBER(SEARCH(L$3,$A5))),$C5,\"\")","v":""},{"$f":"IF(IF(ISNUMBER(-MID(\" \"&$A5,SEARCH(M$3,\" \"&$A5)-2,1)),MID(\" \"&$A5,SEARCH(M$3,\" \"&$A5)-2,4)=COUNTIF($E$3:M$3,M$3)&\" \"&M$3,ISNUMBER(SEARCH(M$3,$A5))),$C5,\"\")","v":""},{"$f":"IF(IF(ISNUMBER(-MID(\" \"&$A5,SEARCH(N$3,\" \"&$A5)-2,1)),MID(\" \"&$A5,SEARCH(N$3,\" \"&$A5)-2,4)=COUNTIF($E$3:N$3,N$3)&\" \"&N$3,ISNUMBER(SEARCH(N$3,$A5))),$C5,\"\")","v":""},{"$f":"IF(IF(ISNUMBER(-MID(\" \"&$A5,SEARCH(O$3,\" \"&$A5)-2,1)),MID(\" \"&$A5,SEARCH(O$3,\" \"&$A5)-2,4)=COUNTIF($E$3:O$3,O$3)&\" \"&O$3,ISNUMBER(SEARCH(O$3,$A5))),$C5,\"\")","v":""},{"$f":"IF(IF(ISNUMBER(-MID(\" \"&$A5,SEARCH(P$3,\" \"&$A5)-2,1)),MID(\" \"&$A5,SEARCH(P$3,\" \"&$A5)-2,4)=COUNTIF($E$3:P$3,P$3)&\" \"&P$3,ISNUMBER(SEARCH(P$3,$A5))),$C5,\"\")","v":35},{"$f":"IF(IF(ISNUMBER(-MID(\" \"&$A5,SEARCH(Q$3,\" \"&$A5)-2,1)),MID(\" \"&$A5,SEARCH(Q$3,\" \"&$A5)-2,4)=COUNTIF($E$3:Q$3,Q$3)&\" \"&Q$3,ISNUMBER(SEARCH(Q$3,$A5))),$C5,\"\")","v":""},{"$f":"IF(IF(ISNUMBER(-MID(\" \"&$A5,SEARCH(R$3,\" \"&$A5)-2,1)),MID(\" \"&$A5,SEARCH(R$3,\" \"&$A5)-2,4)=COUNTIF($E$3:R$3,R$3)&\" \"&R$3,ISNUMBER(SEARCH(R$3,$A5))),$C5,\"\")","v":35},{"$f":"IF(IF(ISNUMBER(-MID(\" \"&$A5,SEARCH(S$3,\" \"&$A5)-2,1)),MID(\" \"&$A5,SEARCH(S$3,\" \"&$A5)-2,4)=COUNTIF($E$3:S$3,S$3)&\" \"&S$3,ISNUMBER(SEARCH(S$3,$A5))),$C5,\"\")","v":""},{"$f":"IF(IF(ISNUMBER(-MID(\" \"&$A5,SEARCH(T$3,\" \"&$A5)-2,1)),MID(\" \"&$A5,SEARCH(T$3,\" \"&$A5)-2,4)=COUNTIF($E$3:T$3,T$3)&\" \"&T$3,ISNUMBER(SEARCH(T$3,$A5))),$C5,\"\")","v":""},{"$f":"IF(IF(ISNUMBER(-MID(\" \"&$A5,SEARCH(U$3,\" \"&$A5)-2,1)),MID(\" \"&$A5,SEARCH(U$3,\" \"&$A5)-2,4)=COUNTIF($E$3:U$3,U$3)&\" \"&U$3,ISNUMBER(SEARCH(U$3,$A5))),$C5,\"\")","v":""},{"$f":"IF(IF(ISNUMBER(-MID(\" \"&$A5,SEARCH(V$3,\" \"&$A5)-2,1)),MID(\" \"&$A5,SEARCH(V$3,\" \"&$A5)-2,4)=COUNTIF($E$3:V$3,V$3)&\" \"&V$3,ISNUMBER(SEARCH(V$3,$A5))),$C5,\"\")","v":""},{"$f":"IF(IF(ISNUMBER(-MID(\" \"&$A5,SEARCH(W$3,\" \"&$A5)-2,1)),MID(\" \"&$A5,SEARCH(W$3,\" \"&$A5)-2,4)=COUNTIF($E$3:W$3,W$3)&\" \"&W$3,ISNUMBER(SEARCH(W$3,$A5))),$C5,\"\")","v":35},{"$f":"IF(IF(ISNUMBER(-MID(\" \"&$A5,SEARCH(X$3,\" \"&$A5)-2,1)),MID(\" \"&$A5,SEARCH(X$3,\" \"&$A5)-2,4)=COUNTIF($E$3:X$3,X$3)&\" \"&X$3,ISNUMBER(SEARCH(X$3,$A5))),$C5,\"\")","v":""},{"$f":"IF(IF(ISNUMBER(-MID(\" \"&$A5,SEARCH(Y$3,\" \"&$A5)-2,1)),MID(\" \"&$A5,SEARCH(Y$3,\" \"&$A5)-2,4)=COUNTIF($E$3:Y$3,Y$3)&\" \"&Y$3,ISNUMBER(SEARCH(Y$3,$A5))),$C5,\"\")","v":35},{"$f":"IF(IF(ISNUMBER(-MID(\" \"&$A5,SEARCH(Z$3,\" \"&$A5)-2,1)),MID(\" \"&$A5,SEARCH(Z$3,\" \"&$A5)-2,4)=COUNTIF($E$3:Z$3,Z$3)&\" \"&Z$3,ISNUMBER(SEARCH(Z$3,$A5))),$C5,\"\")","v":""},{"$f":"IF(IF(ISNUMBER(-MID(\" \"&$A5,SEARCH(AA$3,\" \"&$A5)-2,1)),MID(\" \"&$A5,SEARCH(AA$3,\" \"&$A5)-2,4)=COUNTIF($E$3:AA$3,AA$3)&\" \"&AA$3,ISNUMBER(SEARCH(AA$3,$A5))),$C5,\"\")","v":""},{"$f":"IF(IF(ISNUMBER(-MID(\" \"&$A5,SEARCH(AB$3,\" \"&$A5)-2,1)),MID(\" \"&$A5,SEARCH(AB$3,\" \"&$A5)-2,4)=COUNTIF($E$3:AB$3,AB$3)&\" \"&AB$3,ISNUMBER(SEARCH(AB$3,$A5))),$C5,\"\")","v":""},{"$f":"IF(IF(ISNUMBER(-MID(\" \"&$A5,SEARCH(AC$3,\" \"&$A5)-2,1)),MID(\" \"&$A5,SEARCH(AC$3,\" \"&$A5)-2,4)=COUNTIF($E$3:AC$3,AC$3)&\" \"&AC$3,ISNUMBER(SEARCH(AC$3,$A5))),$C5,\"\")","v":""},{"$f":"IF(IF(ISNUMBER(-MID(\" \"&$A5,SEARCH(AD$3,\" \"&$A5)-2,1)),MID(\" \"&$A5,SEARCH(AD$3,\" \"&$A5)-2,4)=COUNTIF($E$3:AD$3,AD$3)&\" \"&AD$3,ISNUMBER(SEARCH(AD$3,$A5))),$C5,\"\")","v":35},{"$f":"IF(IF(ISNUMBER(-MID(\" \"&$A5,SEARCH(AE$3,\" \"&$A5)-2,1)),MID(\" \"&$A5,SEARCH(AE$3,\" \"&$A5)-2,4)=COUNTIF($E$3:AE$3,AE$3)&\" \"&AE$3,ISNUMBER(SEARCH(AE$3,$A5))),$C5,\"\")","v":""},{"$f":"IF(IF(ISNUMBER(-MID(\" \"&$A5,SEARCH(AF$3,\" \"&$A5)-2,1)),MID(\" \"&$A5,SEARCH(AF$3,\" \"&$A5)-2,4)=COUNTIF($E$3:AF$3,AF$3)&\" \"&AF$3,ISNUMBER(SEARCH(AF$3,$A5))),$C5,\"\")","v":35},{"$f":"IF(IF(ISNUMBER(-MID(\" \"&$A5,SEARCH(AG$3,\" \"&$A5)-2,1)),MID(\" \"&$A5,SEARCH(AG$3,\" \"&$A5)-2,4)=COUNTIF($E$3:AG$3,AG$3)&\" \"&AG$3,ISNUMBER(SEARCH(AG$3,$A5))),$C5,\"\")","v":""},{"$f":"IF(IF(ISNUMBER(-MID(\" \"&$A5,SEARCH(AH$3,\" \"&$A5)-2,1)),MID(\" \"&$A5,SEARCH(AH$3,\" \"&$A5)-2,4)=COUNTIF($E$3:AH$3,AH$3)&\" \"&AH$3,ISNUMBER(SEARCH(AH$3,$A5))),$C5,\"\")","v":""},{"$f":"IF(IF(ISNUMBER(-MID(\" \"&$A5,SEARCH(AI$3,\" \"&$A5)-2,1)),MID(\" \"&$A5,SEARCH(AI$3,\" \"&$A5)-2,4)=COUNTIF($E$3:AI$3,AI$3)&\" \"&AI$3,ISNUMBER(SEARCH(AI$3,$A5))),$C5,\"\")","v":""},{"$f":"SUM(E5:INDEX(E5:AI5,31-Лист1!$I$6))","v":280},{"$f":"COUNT(E5:INDEX(E5:AI5,31-Лист1!$I$6))","v":8},{"$f":"SUM(AK5:AK7)","v":22}]
["пн, ср, пт"," помощь в приготовлении пищи",20,"2р/н",{"$f":"IF(IF(ISNUMBER(-MID(\" \"&$A6,SEARCH(E$3,\" \"&$A6)-2,1)),MID(\" \"&$A6,SEARCH(E$3,\" \"&$A6)-2,4)=COUNTIF($E$3:E$3,E$3)&\" \"&E$3,ISNUMBER(SEARCH(E$3,$A6))),$C6,\"\")","v":20},{"$f":"IF(IF(ISNUMBER(-MID(\" \"&$A6,SEARCH(F$3,\" \"&$A6)-2,1)),MID(\" \"&$A6,SEARCH(F$3,\" \"&$A6)-2,4)=COUNTIF($E$3:F$3,F$3)&\" \"&F$3,ISNUMBER(SEARCH(F$3,$A6))),$C6,\"\")","v":""},{"$f":"IF(IF(ISNUMBER(-MID(\" \"&$A6,SEARCH(G$3,\" \"&$A6)-2,1)),MID(\" \"&$A6,SEARCH(G$3,\" \"&$A6)-2,4)=COUNTIF($E$3:G$3,G$3)&\" \"&G$3,ISNUMBER(SEARCH(G$3,$A6))),$C6,\"\")","v":""},{"$f":"IF(IF(ISNUMBER(-MID(\" \"&$A6,SEARCH(H$3,\" \"&$A6)-2,1)),MID(\" \"&$A6,SEARCH(H$3,\" \"&$A6)-2,4)=COUNTIF($E$3:H$3,H$3)&\" \"&H$3,ISNUMBER(SEARCH(H$3,$A6))),$C6,\"\")","v":20},{"$f":"IF(IF(ISNUMBER(-MID(\" \"&$A6,SEARCH(I$3,\" \"&$A6)-2,1)),MID(\" \"&$A6,SEARCH(I$3,\" \"&$A6)-2,4)=COUNTIF($E$3:I$3,I$3)&\" \"&I$3,ISNUMBER(SEARCH(I$3,$A6))),$C6,\"\")","v":""},{"$f":"IF(IF(ISNUMBER(-MID(\" \"&$A6,SEARCH(J$3,\" \"&$A6)-2,1)),MID(\" \"&$A6,SEARCH(J$3,\" \"&$A6)-2,4)=COUNTIF($E$3:J$3,J$3)&\" \"&J$3,ISNUMBER(SEARCH(J$3,$A6))),$C6,\"\")","v":20},{"$f":"IF(IF(ISNUMBER(-MID(\" \"&$A6,SEARCH(K$3,\" \"&$A6)-2,1)),MID(\" \"&$A6,SEARCH(K$3,\" \"&$A6)-2,4)=COUNTIF($E$3:K$3,K$3)&\" \"&K$3,ISNUMBER(SEARCH(K$3,$A6))),$C6,\"\")","v":""},{"$f":"IF(IF(ISNUMBER(-MID(\" \"&$A6,SEARCH(L$3,\" \"&$A6)-2,1)),MID(\" \"&$A6,SEARCH(L$3,\" \"&$A6)-2,4)=COUNTIF($E$3:L$3,L$3)&\" \"&L$3,ISNUMBER(SEARCH(L$3,$A6))),$C6,\"\")","v":20},{"$f":"IF(IF(ISNUMBER(-MID(\" \"&$A6,SEARCH(M$3,\" \"&$A6)-2,1)),MID(\" \"&$A6,SEARCH(M$3,\" \"&$A6)-2,4)=COUNTIF($E$3:M$3,M$3)&\" \"&M$3,ISNUMBER(SEARCH(M$3,$A6))),$C6,\"\")","v":""},{"$f":"IF(IF(ISNUMBER(-MID(\" \"&$A6,SEARCH(N$3,\" \"&$A6)-2,1)),MID(\" \"&$A6,SEARCH(N$3,\" \"&$A6)-2,4)=COUNTIF($E$3:N$3,N$3)&\" \"&N$3,ISNUMBER(SEARCH(N$3,$A6))),$C6,\"\")","v":""},{"$f":"IF(IF(ISNUMBER(-MID(\" \"&$A6,SEARCH(O$3,\" \"&$A6)-2,1)),MID(\" \"&$A6,SEARCH(O$3,\" \"&$A6)-2,4)=COUNTIF($E$3:O$3,O$3)&\" \"&O$3,ISNUMBER(SEARCH(O$3,$A6))),$C6,\"\")","v":20},{"$f":"IF(IF(ISNUMBER(-MID(\" \"&$A6,SEARCH(P$3,\" \"&$A6)-2,1)),MID(\" \"&$A6,SEARCH(P$3,\" \"&$A6)-2,4)=COUNTIF($E$3:P$3,P$3)&\" \"&P$3,ISNUMBER(SEARCH(P$3,$A6))),$C6,\"\")","v":""},{"$f":"IF(IF(ISNUMBER(-MID(\" \"&$A6,SEARCH(Q$3,\" \"&$A6)-2,1)),MID(\" \"&$A6,SEARCH(Q$3,\" \"&$A6)-2,4)=COUNTIF($E$3:Q$3,Q$3)&\" \"&Q$3,ISNUMBER(SEARCH(Q$3,$A6))),$C6,\"\")","v":20},{"$f":"IF(IF(ISNUMBER(-MID(\" \"&$A6,SEARCH(R$3,\" \"&$A6)-2,1)),MID(\" \"&$A6,SEARCH(R$3,\" \"&$A6)-2,4)=COUNTIF($E$3:R$3,R$3)&\" \"&R$3,ISNUMBER(SEARCH(R$3,$A6))),$C6,\"\")","v":""},{"$f":"IF(IF(ISNUMBER(-MID(\" \"&$A6,SEARCH(S$3,\" \"&$A6)-2,1)),MID(\" \"&$A6,SEARCH(S$3,\" \"&$A6)-2,4)=COUNTIF($E$3:S$3,S$3)&\" \"&S$3,ISNUMBER(SEARCH(S$3,$A6))),$C6,\"\")","v":20},{"$f":"IF(IF(ISNUMBER(-MID(\" \"&$A6,SEARCH(T$3,\" \"&$A6)-2,1)),MID(\" \"&$A6,SEARCH(T$3,\" \"&$A6)-2,4)=COUNTIF($E$3:T$3,T$3)&\" \"&T$3,ISNUMBER(SEARCH(T$3,$A6))),$C6,\"\")","v":""},{"$f":"IF(IF(ISNUMBER(-MID(\" \"&$A6,SEARCH(U$3,\" \"&$A6)-2,1)),MID(\" \"&$A6,SEARCH(U$3,\" \"&$A6)-2,4)=COUNTIF($E$3:U$3,U$3)&\" \"&U$3,ISNUMBER(SEARCH(U$3,$A6))),$C6,\"\")","v":""},{"$f":"IF(IF(ISNUMBER(-MID(\" \"&$A6,SEARCH(V$3,\" \"&$A6)-2,1)),MID(\" \"&$A6,SEARCH(V$3,\" \"&$A6)-2,4)=COUNTIF($E$3:V$3,V$3)&\" \"&V$3,ISNUMBER(SEARCH(V$3,$A6))),$C6,\"\")","v":20},{"$f":"IF(IF(ISNUMBER(-MID(\" \"&$A6,SEARCH(W$3,\" \"&$A6)-2,1)),MID(\" \"&$A6,SEARCH(W$3,\" \"&$A6)-2,4)=COUNTIF($E$3:W$3,W$3)&\" \"&W$3,ISNUMBER(SEARCH(W$3,$A6))),$C6,\"\")","v":""},{"$f":"IF(IF(ISNUMBER(-MID(\" \"&$A6,SEARCH(X$3,\" \"&$A6)-2,1)),MID(\" \"&$A6,SEARCH(X$3,\" \"&$A6)-2,4)=COUNTIF($E$3:X$3,X$3)&\" \"&X$3,ISNUMBER(SEARCH(X$3,$A6))),$C6,\"\")","v":20},{"$f":"IF(IF(ISNUMBER(-MID(\" \"&$A6,SEARCH(Y$3,\" \"&$A6)-2,1)),MID(\" \"&$A6,SEARCH(Y$3,\" \"&$A6)-2,4)=COUNTIF($E$3:Y$3,Y$3)&\" \"&Y$3,ISNUMBER(SEARCH(Y$3,$A6))),$C6,\"\")","v":""},{"$f":"IF(IF(ISNUMBER(-MID(\" \"&$A6,SEARCH(Z$3,\" \"&$A6)-2,1)),MID(\" \"&$A6,SEARCH(Z$3,\" \"&$A6)-2,4)=COUNTIF($E$3:Z$3,Z$3)&\" \"&Z$3,ISNUMBER(SEARCH(Z$3,$A6))),$C6,\"\")","v":20},{"$f":"IF(IF(ISNUMBER(-MID(\" \"&$A6,SEARCH(AA$3,\" \"&$A6)-2,1)),MID(\" \"&$A6,SEARCH(AA$3,\" \"&$A6)-2,4)=COUNTIF($E$3:AA$3,AA$3)&\" \"&AA$3,ISNUMBER(SEARCH(AA$3,$A6))),$C6,\"\")","v":""},{"$f":"IF(IF(ISNUMBER(-MID(\" \"&$A6,SEARCH(AB$3,\" \"&$A6)-2,1)),MID(\" \"&$A6,SEARCH(AB$3,\" \"&$A6)-2,4)=COUNTIF($E$3:AB$3,AB$3)&\" \"&AB$3,ISNUMBER(SEARCH(AB$3,$A6))),$C6,\"\")","v":""},{"$f":"IF(IF(ISNUMBER(-MID(\" \"&$A6,SEARCH(AC$3,\" \"&$A6)-2,1)),MID(\" \"&$A6,SEARCH(AC$3,\" \"&$A6)-2,4)=COUNTIF($E$3:AC$3,AC$3)&\" \"&AC$3,ISNUMBER(SEARCH(AC$3,$A6))),$C6,\"\")","v":20},{"$f":"IF(IF(ISNUMBER(-MID(\" \"&$A6,SEARCH(AD$3,\" \"&$A6)-2,1)),MID(\" \"&$A6,SEARCH(AD$3,\" \"&$A6)-2,4)=COUNTIF($E$3:AD$3,AD$3)&\" \"&AD$3,ISNUMBER(SEARCH(AD$3,$A6))),$C6,\"\")","v":""},{"$f":"IF(IF(ISNUMBER(-MID(\" \"&$A6,SEARCH(AE$3,\" \"&$A6)-2,1)),MID(\" \"&$A6,SEARCH(AE$3,\" \"&$A6)-2,4)=COUNTIF($E$3:AE$3,AE$3)&\" \"&AE$3,ISNUMBER(SEARCH(AE$3,$A6))),$C6,\"\")","v":20},{"$f":"IF(IF(ISNUMBER(-MID(\" \"&$A6,SEARCH(AF$3,\" \"&$A6)-2,1)),MID(\" \"&$A6,SEARCH(AF$3,\" \"&$A6)-2,4)=COUNTIF($E$3:AF$3,AF$3)&\" \"&AF$3,ISNUMBER(SEARCH(AF$3,$A6))),$C6,\"\")","v":""},{"$f":"IF(IF(ISNUMBER(-MID(\" \"&$A6,SEARCH(AG$3,\" \"&$A6)-2,1)),MID(\" \"&$A6,SEARCH(AG$3,\" \"&$A6)-2,4)=COUNTIF($E$3:AG$3,AG$3)&\" \"&AG$3,ISNUMBER(SEARCH(AG$3,$A6))),$C6,\"\")","v":20},{"$f":"IF(IF(ISNUMBER(-MID(\" \"&$A6,SEARCH(AH$3,\" \"&$A6)-2,1)),MID(\" \"&$A6,SEARCH(AH$3,\" \"&$A6)-2,4)=COUNTIF($E$3:AH$3,AH$3)&\" \"&AH$3,ISNUMBER(SEARCH(AH$3,$A6))),$C6,\"\")","v":""},{"$f":"IF(IF(ISNUMBER(-MID(\" \"&$A6,SEARCH(AI$3,\" \"&$A6)-2,1)),MID(\" \"&$A6,SEARCH(AI$3,\" \"&$A6)-2,4)=COUNTIF($E$3:AI$3,AI$3)&\" \"&AI$3,ISNUMBER(SEARCH(AI$3,$A6))),$C6,\"\")","v":""},{"$f":"SUM(E6:INDEX(E6:AI6,31-Лист1!$I$6))","v":260},{"$f":"COUNT(E6:INDEX(E6:AI6,31-Лист1!$I$6))","v":13}]
["1 пн","оплата ЖКУ ",15,"1р/м",{"$f":"IF(IF(ISNUMBER(-MID(\" \"&$A7,SEARCH(E$3,\" \"&$A7)-2,1)),MID(\" \"&$A7,SEARCH(E$3,\" \"&$A7)-2,4)=COUNTIF($E$3:E$3,E$3)&\" \"&E$3,ISNUMBER(SEARCH(E$3,$A7))),$C7,\"\")","v":""},{"$f":"IF(IF(ISNUMBER(-MID(\" \"&$A7,SEARCH(F$3,\" \"&$A7)-2,1)),MID(\" \"&$A7,SEARCH(F$3,\" \"&$A7)-2,4)=COUNTIF($E$3:F$3,F$3)&\" \"&F$3,ISNUMBER(SEARCH(F$3,$A7))),$C7,\"\")","v":""},{"$f":"IF(IF(ISNUMBER(-MID(\" \"&$A7,SEARCH(G$3,\" \"&$A7)-2,1)),MID(\" \"&$A7,SEARCH(G$3,\" \"&$A7)-2,4)=COUNTIF($E$3:G$3,G$3)&\" \"&G$3,ISNUMBER(SEARCH(G$3,$A7))),$C7,\"\")","v":""},{"$f":"IF(IF(ISNUMBER(-MID(\" \"&$A7,SEARCH(H$3,\" \"&$A7)-2,1)),MID(\" \"&$A7,SEARCH(H$3,\" \"&$A7)-2,4)=COUNTIF($E$3:H$3,H$3)&\" \"&H$3,ISNUMBER(SEARCH(H$3,$A7))),$C7,\"\")","v":15},{"$f":"IF(IF(ISNUMBER(-MID(\" \"&$A7,SEARCH(I$3,\" \"&$A7)-2,1)),MID(\" \"&$A7,SEARCH(I$3,\" \"&$A7)-2,4)=COUNTIF($E$3:I$3,I$3)&\" \"&I$3,ISNUMBER(SEARCH(I$3,$A7))),$C7,\"\")","v":""},{"$f":"IF(IF(ISNUMBER(-MID(\" \"&$A7,SEARCH(J$3,\" \"&$A7)-2,1)),MID(\" \"&$A7,SEARCH(J$3,\" \"&$A7)-2,4)=COUNTIF($E$3:J$3,J$3)&\" \"&J$3,ISNUMBER(SEARCH(J$3,$A7))),$C7,\"\")","v":""},{"$f":"IF(IF(ISNUMBER(-MID(\" \"&$A7,SEARCH(K$3,\" \"&$A7)-2,1)),MID(\" \"&$A7,SEARCH(K$3,\" \"&$A7)-2,4)=COUNTIF($E$3:K$3,K$3)&\" \"&K$3,ISNUMBER(SEARCH(K$3,$A7))),$C7,\"\")","v":""},{"$f":"IF(IF(ISNUMBER(-MID(\" \"&$A7,SEARCH(L$3,\" \"&$A7)-2,1)),MID(\" \"&$A7,SEARCH(L$3,\" \"&$A7)-2,4)=COUNTIF($E$3:L$3,L$3)&\" \"&L$3,ISNUMBER(SEARCH(L$3,$A7))),$C7,\"\")","v":""},{"$f":"IF(IF(ISNUMBER(-MID(\" \"&$A7,SEARCH(M$3,\" \"&$A7)-2,1)),MID(\" \"&$A7,SEARCH(M$3,\" \"&$A7)-2,4)=COUNTIF($E$3:M$3,M$3)&\" \"&M$3,ISNUMBER(SEARCH(M$3,$A7))),$C7,\"\")","v":""},{"$f":"IF(IF(ISNUMBER(-MID(\" \"&$A7,SEARCH(N$3,\" \"&$A7)-2,1)),MID(\" \"&$A7,SEARCH(N$3,\" \"&$A7)-2,4)=COUNTIF($E$3:N$3,N$3)&\" \"&N$3,ISNUMBER(SEARCH(N$3,$A7))),$C7,\"\")","v":""},{"$f":"IF(IF(ISNUMBER(-MID(\" \"&$A7,SEARCH(O$3,\" \"&$A7)-2,1)),MID(\" \"&$A7,SEARCH(O$3,\" \"&$A7)-2,4)=COUNTIF($E$3:O$3,O$3)&\" \"&O$3,ISNUMBER(SEARCH(O$3,$A7))),$C7,\"\")","v":""},{"$f":"IF(IF(ISNUMBER(-MID(\" \"&$A7,SEARCH(P$3,\" \"&$A7)-2,1)),MID(\" \"&$A7,SEARCH(P$3,\" \"&$A7)-2,4)=COUNTIF($E$3:P$3,P$3)&\" \"&P$3,ISNUMBER(SEARCH(P$3,$A7))),$C7,\"\")","v":""},{"$f":"IF(IF(ISNUMBER(-MID(\" \"&$A7,SEARCH(Q$3,\" \"&$A7)-2,1)),MID(\" \"&$A7,SEARCH(Q$3,\" \"&$A7)-2,4)=COUNTIF($E$3:Q$3,Q$3)&\" \"&Q$3,ISNUMBER(SEARCH(Q$3,$A7))),$C7,\"\")","v":""},{"$f":"IF(IF(ISNUMBER(-MID(\" \"&$A7,SEARCH(R$3,\" \"&$A7)-2,1)),MID(\" \"&$A7,SEARCH(R$3,\" \"&$A7)-2,4)=COUNTIF($E$3:R$3,R$3)&\" \"&R$3,ISNUMBER(SEARCH(R$3,$A7))),$C7,\"\")","v":""},{"$f":"IF(IF(ISNUMBER(-MID(\" \"&$A7,SEARCH(S$3,\" \"&$A7)-2,1)),MID(\" \"&$A7,SEARCH(S$3,\" \"&$A7)-2,4)=COUNTIF($E$3:S$3,S$3)&\" \"&S$3,ISNUMBER(SEARCH(S$3,$A7))),$C7,\"\")","v":""},{"$f":"IF(IF(ISNUMBER(-MID(\" \"&$A7,SEARCH(T$3,\" \"&$A7)-2,1)),MID(\" \"&$A7,SEARCH(T$3,\" \"&$A7)-2,4)=COUNTIF($E$3:T$3,T$3)&\" \"&T$3,ISNUMBER(SEARCH(T$3,$A7))),$C7,\"\")","v":""},{"$f":"IF(IF(ISNUMBER(-MID(\" \"&$A7,SEARCH(U$3,\" \"&$A7)-2,1)),MID(\" \"&$A7,SEARCH(U$3,\" \"&$A7)-2,4)=COUNTIF($E$3:U$3,U$3)&\" \"&U$3,ISNUMBER(SEARCH(U$3,$A7))),$C7,\"\")","v":""},{"$f":"IF(IF(ISNUMBER(-MID(\" \"&$A7,SEARCH(V$3,\" \"&$A7)-2,1)),MID(\" \"&$A7,SEARCH(V$3,\" \"&$A7)-2,4)=COUNTIF($E$3:V$3,V$3)&\" \"&V$3,ISNUMBER(SEARCH(V$3,$A7))),$C7,\"\")","v":""},{"$f":"IF(IF(ISNUMBER(-MID(\" \"&$A7,SEARCH(W$3,\" \"&$A7)-2,1)),MID(\" \"&$A7,SEARCH(W$3,\" \"&$A7)-2,4)=COUNTIF($E$3:W$3,W$3)&\" \"&W$3,ISNUMBER(SEARCH(W$3,$A7))),$C7,\"\")","v":""},{"$f":"IF(IF(ISNUMBER(-MID(\" \"&$A7,SEARCH(X$3,\" \"&$A7)-2,1)),MID(\" \"&$A7,SEARCH(X$3,\" \"&$A7)-2,4)=COUNTIF($E$3:X$3,X$3)&\" \"&X$3,ISNUMBER(SEARCH(X$3,$A7))),$C7,\"\")","v":""},{"$f":"IF(IF(ISNUMBER(-MID(\" \"&$A7,SEARCH(Y$3,\" \"&$A7)-2,1)),MID(\" \"&$A7,SEARCH(Y$3,\" \"&$A7)-2,4)=COUNTIF($E$3:Y$3,Y$3)&\" \"&Y$3,ISNUMBER(SEARCH(Y$3,$A7))),$C7,\"\")","v":""},{"$f":"IF(IF(ISNUMBER(-MID(\" \"&$A7,SEARCH(Z$3,\" \"&$A7)-2,1)),MID(\" \"&$A7,SEARCH(Z$3,\" \"&$A7)-2,4)=COUNTIF($E$3:Z$3,Z$3)&\" \"&Z$3,ISNUMBER(SEARCH(Z$3,$A7))),$C7,\"\")","v":""},{"$f":"IF(IF(ISNUMBER(-MID(\" \"&$A7,SEARCH(AA$3,\" \"&$A7)-2,1)),MID(\" \"&$A7,SEARCH(AA$3,\" \"&$A7)-2,4)=COUNTIF($E$3:AA$3,AA$3)&\" \"&AA$3,ISNUMBER(SEARCH(AA$3,$A7))),$C7,\"\")","v":""},{"$f":"IF(IF(ISNUMBER(-MID(\" \"&$A7,SEARCH(AB$3,\" \"&$A7)-2,1)),MID(\" \"&$A7,SEARCH(AB$3,\" \"&$A7)-2,4)=COUNTIF($E$3:AB$3,AB$3)&\" \"&AB$3,ISNUMBER(SEARCH(AB$3,$A7))),$C7,\"\")","v":""},{"$f":"IF(IF(ISNUMBER(-MID(\" \"&$A7,SEARCH(AC$3,\" \"&$A7)-2,1)),MID(\" \"&$A7,SEARCH(AC$3,\" \"&$A7)-2,4)=COUNTIF($E$3:AC$3,AC$3)&\" \"&AC$3,ISNUMBER(SEARCH(AC$3,$A7))),$C7,\"\")","v":""},{"$f":"IF(IF(ISNUMBER(-MID(\" \"&$A7,SEARCH(AD$3,\" \"&$A7)-2,1)),MID(\" \"&$A7,SEARCH(AD$3,\" \"&$A7)-2,4)=COUNTIF($E$3:AD$3,AD$3)&\" \"&AD$3,ISNUMBER(SEARCH(AD$3,$A7))),$C7,\"\")","v":""},{"$f":"IF(IF(ISNUMBER(-MID(\" \"&$A7,SEARCH(AE$3,\" \"&$A7)-2,1)),MID(\" \"&$A7,SEARCH(AE$3,\" \"&$A7)-2,4)=COUNTIF($E$3:AE$3,AE$3)&\" \"&AE$3,ISNUMBER(SEARCH(AE$3,$A7))),$C7,\"\")","v":""},{"$f":"IF(IF(ISNUMBER(-MID(\" \"&$A7,SEARCH(AF$3,\" \"&$A7)-2,1)),MID(\" \"&$A7,SEARCH(AF$3,\" \"&$A7)-2,4)=COUNTIF($E$3:AF$3,AF$3)&\" \"&AF$3,ISNUMBER(SEARCH(AF$3,$A7))),$C7,\"\")","v":""},{"$f":"IF(IF(ISNUMBER(-MID(\" \"&$A7,SEARCH(AG$3,\" \"&$A7)-2,1)),MID(\" \"&$A7,SEARCH(AG$3,\" \"&$A7)-2,4)=COUNTIF($E$3:AG$3,AG$3)&\" \"&AG$3,ISNUMBER(SEARCH(AG$3,$A7))),$C7,\"\")","v":""},{"$f":"IF(IF(ISNUMBER(-MID(\" \"&$A7,SEARCH(AH$3,\" \"&$A7)-2,1)),MID(\" \"&$A7,SEARCH(AH$3,\" \"&$A7)-2,4)=COUNTIF($E$3:AH$3,AH$3)&\" \"&AH$3,ISNUMBER(SEARCH(AH$3,$A7))),$C7,\"\")","v":""},{"$f":"IF(IF(ISNUMBER(-MID(\" \"&$A7,SEARCH(AI$3,\" \"&$A7)-2,1)),MID(\" \"&$A7,SEARCH(AI$3,\" \"&$A7)-2,4)=COUNTIF($E$3:AI$3,AI$3)&\" \"&AI$3,ISNUMBER(SEARCH(AI$3,$A7))),$C7,\"\")","v":""},{"$f":"SUM(E7:INDEX(E7:AI7,31-Лист1!$I$6))","v":15},{"$f":"COUNT(E7:INDEX(E7:AI7,31-Лист1!$I$6))","v":1}]
["Петров","2 группа"]
{"$rows_left_out":12}