{"text_format":"1","workbook":"xlsx","n_sheets":3,"sheets":["Амортизация","Source_Amortization","Filters"],"not_rendered":{"charts":0,"images":0,"macros":1,"external_links":0,"defined_names":3,"comments":0,"pivot_tables":0},"unopened":[],"bounds":{"document_bytes":16777216,"sheet_cells":100000,"rows_first":2000,"rows_last":500,"rows_between":2000,"halvings":0,"cell_chars":16384,"cell_head_chars":4096},"cells_cut":0,"cells_raw":0,"read":"whole","date_system":"1900"}

{"sheet":"Амортизация","index":0,"n_rows":21,"n_cols":26,"rows_kept":21,"cut":false,"hidden":false,"merged":[[1,1,1,22]]}
[]
[null,"Амортизация"]
[]
[null,"Версия","План"]
[null,"ЦФО","Аппарат"]
[]
[]
[null,"Строка","Название ОС","Тип ОС","Спецификация ОС","Месяц ввода в эксплуатацию","Месяц ввода в эксплуатацию (массив)","Месяцев амортизации","Первоначальная стоимость","Год","1 квартал","Январь","Февраль","Март","2 квартал","Апрель","Май","Июнь","3 квартал","Июль","Август","Сентябрь","4 квартал","Октябрь","Ноябрь","Декабрь"]
[null,"Итого"]
[null,1,"Автомобиль","Автомобиль","Volvo",{"$f":"INDEX(Source_Amortization!$G$2:$G$145,_xlfn.AGGREGATE(15,6,(ROW($F$2:$F$145)-ROW($F$2)+1)/((Source_Amortization!$B$2:$B$145=$C$4)/(Source_Amortization!$C$2:$C$145=$C$5)/(Source_Amortization!$D$2:$D$145=$C10)/(Source_Amortization!$E$2:$E$145=$D10)/(Source_Amortization!$F$2:$F$145=$E10)),1))","v":"Январь"},{"$f":"INDEX(Source_Amortization!$G$2:$G$145,SMALL(IF((Source_Amortization!$B$2:$B$145=$C$4)*(Source_Amortization!$C$2:$C$145=$C$5)*(Source_Amortization!$D$2:$D$145=$C10)*(Source_Amortization!$E$2:$E$145=$D10)*(Source_Amortization!$F$2:$F$145=$E10),ROW($F$2:$F$145)-1,\"\"),1))","v":"Январь"}]
[null,2,"Ноутбук T540p","ПК","Ноутбук",{"$f":"INDEX(Source_Amortization!$G$2:$G$145,_xlfn.AGGREGATE(15,6,(ROW($F$2:$F$145)-ROW($F$2)+1)/((Source_Amortization!$B$2:$B$145=$C$4)/(Source_Amortization!$C$2:$C$145=$C$5)/(Source_Amortization!$D$2:$D$145=$C11)/(Source_Amortization!$E$2:$E$145=$D11)/(Source_Amortization!$F$2:$F$145=$E11)),1))","v":"Февраль"},{"$f":"INDEX(Source_Amortization!$G$2:$G$145,SMALL(IF((Source_Amortization!$B$2:$B$145=$C$4)*(Source_Amortization!$C$2:$C$145=$C$5)*(Source_Amortization!$D$2:$D$145=$C11)*(Source_Amortization!$E$2:$E$145=$D11)*(Source_Amortization!$F$2:$F$145=$E11),ROW($F$2:$F$145)-1,\"\"),1))","v":"Февраль"}]
[null,3,"Серверное оборудование 16 ядер","ПК","Сервер",{"$f":"INDEX(Source_Amortization!$G$2:$G$145,_xlfn.AGGREGATE(15,6,(ROW($F$2:$F$145)-ROW($F$2)+1)/((Source_Amortization!$B$2:$B$145=$C$4)/(Source_Amortization!$C$2:$C$145=$C$5)/(Source_Amortization!$D$2:$D$145=$C12)/(Source_Amortization!$E$2:$E$145=$D12)/(Source_Amortization!$F$2:$F$145=$E12)),1))","v":"Март"},{"$f":"INDEX(Source_Amortization!$G$2:$G$145,SMALL(IF((Source_Amortization!$B$2:$B$145=$C$4)*(Source_Amortization!$C$2:$C$145=$C$5)*(Source_Amortization!$D$2:$D$145=$C12)*(Source_Amortization!$E$2:$E$145=$D12)*(Source_Amortization!$F$2:$F$145=$E12),ROW($F$2:$F$145)-1,\"\"),1))","v":"Март"}]
[null,4,"ПО для бюджетирования","ПО","Cognos",{"$f":"INDEX(Source_Amortization!$G$2:$G$145,_xlfn.AGGREGATE(15,6,(ROW($F$2:$F$145)-ROW($F$2)+1)/((Source_Amortization!$B$2:$B$145=$C$4)/(Source_Amortization!$C$2:$C$145=$C$5)/(Source_Amortization!$D$2:$D$145=$C13)/(Source_Amortization!$E$2:$E$145=$D13)/(Source_Amortization!$F$2:$F$145=$E13)),1))","v":"Апрель"},{"$f":"INDEX(Source_Amortization!$G$2:$G$145,SMALL(IF((Source_Amortization!$B$2:$B$145=$C$4)*(Source_Amortization!$C$2:$C$145=$C$5)*(Source_Amortization!$D$2:$D$145=$C13)*(Source_Amortization!$E$2:$E$145=$D13)*(Source_Amortization!$F$2:$F$145=$E13),ROW($F$2:$F$145)-1,\"\"),1))","v":"Апрель"}]
[null,5,"ПО для бюджетирования","ПО","1C",{"$f":"INDEX(Source_Amortization!$G$2:$G$145,_xlfn.AGGREGATE(15,6,(ROW($F$2:$F$145)-ROW($F$2)+1)/((Source_Amortization!$B$2:$B$145=$C$4)/(Source_Amortization!$C$2:$C$145=$C$5)/(Source_Amortization!$D$2:$D$145=$C14)/(Source_Amortization!$E$2:$E$145=$D14)/(Source_Amortization!$F$2:$F$145=$E14)),1))","v":"Декабрь"},{"$f":"INDEX(Source_Amortization!$G$2:$G$145,SMALL(IF((Source_Amortization!$B$2:$B$145=$C$4)*(Source_Amortization!$C$2:$C$145=$C$5)*(Source_Amortization!$D$2:$D$145=$C14)*(Source_Amortization!$E$2:$E$145=$D14)*(Source_Amortization!$F$2:$F$145=$E14),ROW($F$2:$F$145)-1,\"\"),1))","v":"Декабрь"}]
[null,6,"ПО для бюджетирования","ПО","MS Office",{"$f":"INDEX(Source_Amortization!$G$2:$G$145,_xlfn.AGGREGATE(15,6,(ROW($F$2:$F$145)-ROW($F$2)+1)/((Source_Amortization!$B$2:$B$145=$C$4)/(Source_Amortization!$C$2:$C$145=$C$5)/(Source_Amortization!$D$2:$D$145=$C15)/(Source_Amortization!$E$2:$E$145=$D15)/(Source_Amortization!$F$2:$F$145=$E15)),1))","v":"Ноябрь"},{"$f":"INDEX(Source_Amortization!$G$2:$G$145,SMALL(IF((Source_Amortization!$B$2:$B$145=$C$4)*(Source_Amortization!$C$2:$C$145=$C$5)*(Source_Amortization!$D$2:$D$145=$C15)*(Source_Amortization!$E$2:$E$145=$D15)*(Source_Amortization!$F$2:$F$145=$E15),ROW($F$2:$F$145)-1,\"\"),1))","v":"Ноябрь"}]
[null,7,"Автомобиль","Автомобиль","BMW",{"$f":"INDEX(Source_Amortization!$G$2:$G$145,_xlfn.AGGREGATE(15,6,(ROW($F$2:$F$145)-ROW($F$2)+1)/((Source_Amortization!$B$2:$B$145=$C$4)/(Source_Amortization!$C$2:$C$145=$C$5)/(Source_Amortization!$D$2:$D$145=$C16)/(Source_Amortization!$E$2:$E$145=$D16)/(Source_Amortization!$F$2:$F$145=$E16)),1))","v":"Март"},{"$f":"INDEX(Source_Amortization!$G$2:$G$145,SMALL(IF((Source_Amortization!$B$2:$B$145=$C$4)*(Source_Amortization!$C$2:$C$145=$C$5)*(Source_Amortization!$D$2:$D$145=$C16)*(Source_Amortization!$E$2:$E$145=$D16)*(Source_Amortization!$F$2:$F$145=$E16),ROW($F$2:$F$145)-1,\"\"),1))","v":"Март"}]
[null,8,"Ноутбук samsung","ПК","Ноутбук",{"$f":"INDEX(Source_Amortization!$G$2:$G$145,_xlfn.AGGREGATE(15,6,(ROW($F$2:$F$145)-ROW($F$2)+1)/((Source_Amortization!$B$2:$B$145=$C$4)/(Source_Amortization!$C$2:$C$145=$C$5)/(Source_Amortization!$D$2:$D$145=$C17)/(Source_Amortization!$E$2:$E$145=$D17)/(Source_Amortization!$F$2:$F$145=$E17)),1))","v":"Апрель"},{"$f":"INDEX(Source_Amortization!$G$2:$G$145,SMALL(IF((Source_Amortization!$B$2:$B$145=$C$4)*(Source_Amortization!$C$2:$C$145=$C$5)*(Source_Amortization!$D$2:$D$145=$C17)*(Source_Amortization!$E$2:$E$145=$D17)*(Source_Amortization!$F$2:$F$145=$E17),ROW($F$2:$F$145)-1,\"\"),1))","v":"Апрель"}]
[null,9,"Серверное оборудование 4 ядра","ПК","Сервер",{"$f":"INDEX(Source_Amortization!$G$2:$G$145,_xlfn.AGGREGATE(15,6,(ROW($F$2:$F$145)-ROW($F$2)+1)/((Source_Amortization!$B$2:$B$145=$C$4)/(Source_Amortization!$C$2:$C$145=$C$5)/(Source_Amortization!$D$2:$D$145=$C18)/(Source_Amortization!$E$2:$E$145=$D18)/(Source_Amortization!$F$2:$F$145=$E18)),1))","v":"Май"},{"$f":"INDEX(Source_Amortization!$G$2:$G$145,SMALL(IF((Source_Amortization!$B$2:$B$145=$C$4)*(Source_Amortization!$C$2:$C$145=$C$5)*(Source_Amortization!$D$2:$D$145=$C18)*(Source_Amortization!$E$2:$E$145=$D18)*(Source_Amortization!$F$2:$F$145=$E18),ROW($F$2:$F$145)-1,\"\"),1))","v":"Май"}]
[null,10,"Автомобиль","Автомобиль","Honda",{"$f":"INDEX(Source_Amortization!$G$2:$G$145,_xlfn.AGGREGATE(15,6,(ROW($F$2:$F$145)-ROW($F$2)+1)/((Source_Amortization!$B$2:$B$145=$C$4)/(Source_Amortization!$C$2:$C$145=$C$5)/(Source_Amortization!$D$2:$D$145=$C19)/(Source_Amortization!$E$2:$E$145=$D19)/(Source_Amortization!$F$2:$F$145=$E19)),1))","v":"Июль"},{"$f":"INDEX(Source_Amortization!$G$2:$G$145,SMALL(IF((Source_Amortization!$B$2:$B$145=$C$4)*(Source_Amortization!$C$2:$C$145=$C$5)*(Source_Amortization!$D$2:$D$145=$C19)*(Source_Amortization!$E$2:$E$145=$D19)*(Source_Amortization!$F$2:$F$145=$E19),ROW($F$2:$F$145)-1,\"\"),1))","v":"Июль"}]
[null,11,"Ноутбук L450","ПК","Ноутбук",{"$f":"INDEX(Source_Amortization!$G$2:$G$145,_xlfn.AGGREGATE(15,6,(ROW($F$2:$F$145)-ROW($F$2)+1)/((Source_Amortization!$B$2:$B$145=$C$4)/(Source_Amortization!$C$2:$C$145=$C$5)/(Source_Amortization!$D$2:$D$145=$C20)/(Source_Amortization!$E$2:$E$145=$D20)/(Source_Amortization!$F$2:$F$145=$E20)),1))","v":"Август"},{"$f":"INDEX(Source_Amortization!$G$2:$G$145,SMALL(IF((Source_Amortization!$B$2:$B$145=$C$4)*(Source_Amortization!$C$2:$C$145=$C$5)*(Source_Amortization!$D$2:$D$145=$C20)*(Source_Amortization!$E$2:$E$145=$D20)*(Source_Amortization!$F$2:$F$145=$E20),ROW($F$2:$F$145)-1,\"\"),1))","v":"Август"}]
[null,12,"Серверное оборудование 2 ядра","ПК","Сервер",{"$f":"INDEX(Source_Amortization!$G$2:$G$145,_xlfn.AGGREGATE(15,6,(ROW($F$2:$F$145)-ROW($F$2)+1)/((Source_Amortization!$B$2:$B$145=$C$4)/(Source_Amortization!$C$2:$C$145=$C$5)/(Source_Amortization!$D$2:$D$145=$C21)/(Source_Amortization!$E$2:$E$145=$D21)/(Source_Amortization!$F$2:$F$145=$E21)),1))","v":"Октябрь"},{"$f":"INDEX(Source_Amortization!$G$2:$G$145,SMALL(IF((Source_Amortization!$B$2:$B$145=$C$4)*(Source_Amortization!$C$2:$C$145=$C$5)*(Source_Amortization!$D$2:$D$145=$C21)*(Source_Amortization!$E$2:$E$145=$D21)*(Source_Amortization!$F$2:$F$145=$E21),ROW($F$2:$F$145)-1,\"\"),1))","v":"Октябрь"}]

{"sheet":"Source_Amortization","index":1,"n_rows":145,"n_cols":8,"rows_kept":145,"cut":false,"hidden":false,"merged":[]}
["Строка","Версия","ЦФО","Название ОС","Тип ОС","Спецификация ОС","Месяц ввода в эксплуатацию","Первоначальная стоимость"]
[1,"План","Аппарат","Автомобиль","Автомобиль","Volvo","Январь",2000000]
[2,"План","Аппарат","Ноутбук T540p","ПК","Ноутбук","Февраль",70000]
[3,"План","Аппарат","Серверное оборудование 16 ядер","ПК","Сервер","Март",500000]
[4,"План","Аппарат","ПО для бюджетирования","ПО","Cognos","Апрель",300000]
[5,"План","Аппарат","ПО для бюджетирования","ПО","1C","Декабрь",100000]
[6,"План","Аппарат","ПО для бюджетирования","ПО","MS Office","Ноябрь",10000]
[7,"План","Аппарат","Автомобиль","Автомобиль","BMW","Март",5000000]
[8,"План","Аппарат","Ноутбук samsung","ПК","Ноутбук","Апрель",50000]
[9,"План","Аппарат","Серверное оборудование 4 ядра","ПК","Сервер","Май",200000]
[10,"План","Аппарат","Автомобиль","Автомобиль","Honda","Июль",900000]
[11,"План","Аппарат","Ноутбук L450","ПК","Ноутбук","Август",35000]
[12,"План","Аппарат","Серверное оборудование 2 ядра","ПК","Сервер","Октябрь",100000]
[1,"План","Блок АХЧ","Автомобиль","Автомобиль","Volvo","Март",5000000]
[2,"План","Блок АХЧ","Ноутбук T540p","ПК","Ноутбук","Апрель",50000]
[3,"План","Блок АХЧ","Серверное оборудование 16 ядер","ПК","Сервер","Май",200000]
[4,"План","Блок АХЧ","ПО для бюджетирования","ПО","Cognos","Июль",900000]
[5,"План","Блок АХЧ","ПО для бюджетирования","ПО","1C","Август",35000]
[6,"План","Блок АХЧ","ПО для бюджетирования","ПО","MS Office","Июнь",100000]
[7,"План","Блок АХЧ","Автомобиль","Автомобиль","BMW","Июль",300000]
[8,"План","Блок АХЧ","Ноутбук samsung","ПК","Ноутбук","Сентябрь",100000]
[9,"План","Блок АХЧ","Серверное оборудование 4 ядра","ПК","Сервер","Декабрь",10000]
[10,"План","Блок АХЧ","Автомобиль","Автомобиль","Honda","Январь",5000000]
[11,"План","Блок АХЧ","Ноутбук L450","ПК","Ноутбук","Февраль",50000]
[12,"План","Блок АХЧ","Серверное оборудование 2 ядра","ПК","Сервер",null,200000]
[1,"План","Блок внутреннего контроля","Автомобиль","Автомобиль","Volvo",null,5000000]
[2,"План","Блок внутреннего контроля","Ноутбук T540p","ПК","Ноутбук",null,50000]
[3,"План","Блок внутреннего контроля","Серверное оборудование 16 ядер","ПК","Сервер","Январь",200000]
[4,"План","Блок внутреннего контроля","ПО для бюджетирования","ПО","Cognos","Февраль",900000]
[5,"План","Блок внутреннего контроля","ПО для бюджетирования","ПО","1C","Апрель",35000]
[6,"План","Блок внутреннего контроля","ПО для бюджетирования","ПО","MS Office","Май",100000]
[7,"План","Блок внутреннего контроля","Автомобиль","Автомобиль","BMW","Июнь",300000]
[8,"План","Блок внутреннего контроля","Ноутбук samsung","ПК","Ноутбук","Июль",100000]
[9,"План","Блок внутреннего контроля","Серверное оборудование 4 ядра","ПК","Сервер","Сентябрь",10000]
[10,"План","Блок внутреннего контроля","Автомобиль","Автомобиль","Honda","Декабрь",5000000]
[11,"План","Блок внутреннего контроля","Ноутбук L450","ПК","Ноутбук","Январь",50000]
[12,"План","Блок внутреннего контроля","Серверное оборудование 2 ядра","ПК","Сервер","Февраль",200000]
[1,"План","Блок инвестиций и финансового контроля","Автомобиль","Автомобиль","Volvo","Июль",5000000]
[2,"План","Блок инвестиций и финансового контроля","Ноутбук T540p","ПК","Ноутбук","Сентябрь",50000]
[3,"План","Блок инвестиций и финансового контроля","Серверное оборудование 16 ядер","ПК","Сервер","Март",200000]
[4,"План","Блок инвестиций и финансового контроля","ПО для бюджетирования","ПО","Cognos","Апрель",900000]
[5,"План","Блок инвестиций и финансового контроля","ПО для бюджетирования","ПО","1C","Май",35000]
[6,"План","Блок инвестиций и финансового контроля","ПО для бюджетирования","ПО","MS Office","Июль",100000]
[7,"План","Блок инвестиций и финансового контроля","Автомобиль","Автомобиль","BMW","Январь",300000]
[8,"План","Блок инвестиций и финансового контроля","Ноутбук samsung","ПК","Ноутбук","Июль",100000]
[9,"План","Блок инвестиций и финансового контроля","Серверное оборудование 4 ядра","ПК","Сервер","Сентябрь",10000]
[10,"План","Блок инвестиций и финансового контроля","Автомобиль","Автомобиль","Honda","Апрель",5000000]
[11,"План","Блок инвестиций и финансового контроля","Ноутбук L450","ПК","Ноутбук","Май",50000]
[12,"План","Блок инвестиций и финансового контроля","Серверное оборудование 2 ядра","ПК","Сервер","Июнь",200000]
[1,"План","Геолога-разведывательный центр","Автомобиль","Автомобиль","Volvo","Июль",5000000]
[2,"План","Геолога-разведывательный центр","Ноутбук T540p","ПК","Ноутбук","Сентябрь",50000]
[3,"План","Геолога-разведывательный центр","Серверное оборудование 16 ядер","ПК","Сервер","Декабрь",200000]
[4,"План","Геолога-разведывательный центр","ПО для бюджетирования","ПО","Cognos","Апрель",900000]
[5,"План","Геолога-разведывательный центр","ПО для бюджетирования","ПО","1C","Май",35000]
[6,"План","Геолога-разведывательный центр","ПО для бюджетирования","ПО","MS Office","Июль",100000]
[7,"План","Геолога-разведывательный центр","Автомобиль","Автомобиль","BMW","Август",5000000]
[8,"План","Геолога-разведывательный центр","Ноутбук samsung","ПК","Ноутбук","Июнь",50000]
[9,"План","Геолога-разведывательный центр","Серверное оборудование 4 ядра","ПК","Сервер","Январь",200000]
[10,"План","Геолога-разведывательный центр","Автомобиль","Автомобиль","Honda","Февраль",5000000]
[11,"План","Геолога-разведывательный центр","Ноутбук L450","ПК","Ноутбук","Декабрь",50000]
[12,"План","Геолога-разведывательный центр","Серверное оборудование 2 ядра","ПК","Сервер","Март",200000]
[1,"План","Комбинат","Автомобиль","Автомобиль","Volvo","Апрель",900000]
[2,"План","Комбинат","Ноутбук T540p","ПК","Ноутбук","Май",35000]
[3,"План","Комбинат","Серверное оборудование 16 ядер","ПК","Сервер","Июль",100000]
[4,"План","Комбинат","ПО для бюджетирования","ПО","Cognos","Январь",5000000]
[5,"План","Комбинат","ПО для бюджетирования","ПО","1C","Февраль",50000]
[6,"План","Комбинат","ПО для бюджетирования","ПО","MS Office","Июнь",200000]
[7,"План","Комбинат","Автомобиль","Автомобиль","BMW","Июль",900000]
[8,"План","Комбинат","Ноутбук samsung","ПК","Ноутбук","Сентябрь",35000]
[9,"План","Комбинат","Серверное оборудование 4 ядра","ПК","Сервер","Декабрь",100000]
[10,"План","Комбинат","Автомобиль","Автомобиль","Honda","Январь",35000]
[11,"План","Комбинат","Ноутбук L450","ПК","Ноутбук","Июль",100000]
[12,"План","Комбинат","Серверное оборудование 2 ядра","ПК","Сервер","Сентябрь",200000]
[1,"Факт","Аппарат","Автомобиль","Автомобиль","Volvo","Февраль",2000000]
[2,"Факт","Аппарат","Ноутбук T540p","ПК","Ноутбук","Март",70000]
[3,"Факт","Аппарат","Серверное оборудование 16 ядер","ПК","Сервер","Март",500000]
[4,"Факт","Аппарат","ПО для бюджетирования","ПО","Cognos","Апрель",300000]
[5,"Факт","Аппарат","ПО для бюджетирования","ПО","1C","Декабрь",100000]
[6,"Факт","Аппарат","ПО для бюджетирования","ПО","MS Office","Ноябрь",10000]
[7,"Факт","Аппарат","Автомобиль","Автомобиль","BMW","Март",5000000]
{"$rows_left_out":66}
{"sheet":"Filters","index":2,"n_rows":122,"n_cols":4,"rows_kept":122,"cut":false,"hidden":false,"merged":[[42,0,42,1],[57,0,57,3],[58,1,58,3],[59,1,59,3],[60,1,60,3],[61,1,61,3],[62,1,62,3],[63,1,63,3],[64,1,64,3],[65,1,65,3],[66,1,66,3],[67,1,67,3],[68,1,68,3],[69,1,69,3],[70,1,70,3],[71,1,71,3],[72,1,72,3],[73,1,73,3],[74,1,74,3],[75,1,75,3],[76,1,76,3],[77,1,77,3],[78,1,78,3],[79,1,79,3],[80,1,80,3],[81,1,81,3],[82,1,82,3],[83,1,83,3],[84,1,84,3],[85,1,85,3],[86,1,86,3],[87,1,87,3],[88,1,88,3],[89,1,89,3],[90,1,90,3],[91,1,91,3],[92,1,92,3],[93,1,93,3],[94,1,94,3],[95,1,95,3],[96,1,96,3],[97,1,97,3],[98,1,98,3],[99,1,99,3],[100,1,100,3],[101,1,101,3],[102,1,102,3],[103,1,103,3],[104,1,104,3],[105,1,105,3],[106,1,106,3],[107,1,107,3],[108,1,108,3],[109,1,109,3],[110,1,110,3],[111,1,111,3],[112,1,112,3],[113,1,113,3],[114,1,114,3],[115,1,115,3],[116,1,116,3],[117,1,117,3],[118,1,118,3],[119,1,119,3],[120,1,120,3],[121,1,121,3]]}
[]
["Версия","Валюта","ЦФО"]
["План","Основная валюта","Блок АХЧ"]
["Факт","Рубли","Аппарат"]
[null,"Баксы","Блок внутреннего контроля"]
[null,"Еврики","Комбинат"]
[null,null,"Геолога-разведывательный центр"]
[null,null,"Блок инвестиций и финансового контроля"]
[]
[]
["Номенклатура","Мера МТР",null,"Меры Амортизация"]
["Балка моста / подвеска оси","Количество",null,"Наименование"]
["Водяной насос","Цена",null,"Название ОС"]
["Водяной радиатор","Стоимость",null,"Тип ОС"]
["Кондиционер",null,null,"Спецификация ОС"]
["Подвеска двигателя",null,null,"Месяц ввода в эксплуатацию"]
["Тормозные шланги",null,null,"Месяцев амортизации"]
["Фильтр топливный ",null,null,"Первоначальная стоимость"]
["Шарниры",null,null,"Год"]
["БЕНЗИН АИ-92",null,null,"1 квартал"]
["БЕНЗИН АИ-95",null,null,"Январь"]
["Гравий фракция 20*40",null,null,"Февраль"]
["Канцтовары",null,null,"Март"]
["Моющие",null,null,"2 квартал"]
["Напитки",null,null,"Апрель"]
["Рекламные буклеты",null,null,"Май"]
[null,null,null,"Июнь"]
[null,null,null,"3 квартал"]
["Должности","Мера ФОТ",null,"Июль"]
["Итого должности","На одного человека",null,"Август"]
["Бетонщик","Количество",null,"Сентябрь"]
["Ведущий специалист",null,null,"4 квартал"]
["Водитель погрузчика",null,null,"Октябрь"]
["Кладовщик",null,null,"Ноябрь"]
["Медицинская сестра",null,null,"Декабрь"]
["Начальник автоколонны"]
["Начальник базы"]
["Начальник исследовательского центра"]
["Повар"]
["Слесарь-сантехник"]
[]
[]
["Таблица атрибутов месяцев"]
["Январь",1]
["Февраль",2]
["Март",3]
["Апрель",4]
["Май",5]
["Июнь",6]
["Июль",7]
["Август",8]
["Сентябрь",9]
["Октябрь",10]
["Ноябрь",11]
["Декабрь",12]
[]
[]
["Таблица атрибутов статей сметы"]
[0,"Итого по всем статьям затрат"]
[60000,"60000 Амортизация ОС и НМА, погашение стоимости ГРР, ГКР, ГПР, НИОКТР и прочих РБП"]
[60003,"60003 Амортизация нематериальных активов стоимостью 20 тыс. руб. и больше"]
[60009,"60009 Амортизация нематериальных активов стоимостью до 20 тыс. руб."]
[60002,"60002 Амортизация основных средств"]
[80000,"80000 Услуги сторонних организаций (текущая деятельность)"]
[80031,"80031 Аренда недвижимости"]
[80033,"80033 Аренда прочего имущества"]
[80004,"80004 Информационные и консультационные услуги - ИТ, оказанные сторонними организациями"]
[80027,"80027 Информационные и консультационные услуги - подбор персонала"]
[80024,"80024 Информационные и консультационные услуги - подготовка кадров"]
[80005,"80005 Информационные и консультационные услуги - прочие услуги, оказанные сторонними организациями"]
[80019,"80019 Расходы на рекламу"]
[80016,"80016 Страхование - имущество"]
[80034,"80034 Страхование - медицинское добровольное на срок не менее 1 года"]
[80035,"80035 Страхование - на случай утраты трудоспособности"]
[80036,"80036 Страхование - ответственность"]
[80059,"80059 Услуги сторонних организаций - организация горячего питания (в соотв. с кол., труд. договором)"]
[20000,"20000 Теплоэнергоснабжение - услуги сторонних организаций"]
[20003,"20003 Вода, приобретаемая у сторонней организации"]
[20002,"20002 Теплоэнергия, приобретаемая у сторонней организации"]
[20001,"20001 Электроэнергия, принимаемаемая у сторонней организации"]
{"$rows_left_out":42}