{"text_format":"1","workbook":"xlsx","n_sheets":4,"sheets":["Общая","Лист1","Отчет","Сетка тротуары"],"not_rendered":{"charts":0,"images":0,"macros":1,"external_links":0,"defined_names":11,"comments":0,"pivot_tables":2},"unopened":[],"bounds":{"document_bytes":16777216,"sheet_cells":100000,"rows_first":2000,"rows_last":500,"rows_between":2000,"halvings":0,"cell_chars":16384,"cell_head_chars":4096},"cells_cut":0,"cells_raw":0,"read":"whole","date_system":"1900"}

{"sheet":"Общая","index":0,"n_rows":63,"n_cols":8,"rows_kept":63,"cut":false,"hidden":false,"merged":[]}
["Название","Значение","Дата",null,"с ","2015-01-08","по","2017-02-04"]
["Кабель",6768.1,"2018-09-09"]
["Вал",8958.5,"2018-09-09"]
["Папер",7257.5,"2018-09-09"]
["Остап 2",264.3,"2018-09-09"]
["Товар",1857.2,"2018-09-09"]
["Кожух",5242.5,"2018-09-09"]
["Кузьма",6083.1,"2018-09-09"]
["Луг",4916.8,"2018-09-08"]
["Остап 2",264.3,"2018-09-08"]
["Товар",1857.2,"2018-09-08"]
["Кожух",5242.5,"2018-09-08"]
["Кузьма",6083.1,"2018-09-08"]
["Грайвор",7629,"2018-09-07"]
["Луг",4916.8,"2018-09-07"]
["Остап 2",264.3,"2018-09-07"]
["Товар",1857.2,"2018-09-07"]
["Кожух",5242.5,"2018-09-07"]
["Кузьма",6083.1,"2018-09-07"]
["Верх",5466.1,"2018-09-06"]
["Грайвор",7629,"2018-09-06"]
["Вал",8958.5,"2018-09-06"]
["Застава",885.6,"2018-09-06"]
["Остап 2",264.3,"2018-09-06"]
["Товар",1857.2,"2018-09-06"]
["Кожух",5242.5,"2018-09-06"]
["Кузьма",6083.1,"2018-09-06"]
["Верх",5466.1,"2018-09-05"]
["остап",9826,"2018-09-05"]
["Перерва",8476.9,"2018-09-05"]
["Остап 2",264.3,"2018-09-05"]
["Товар",1857.2,"2018-09-05"]
["Кожух",5242.5,"2018-09-05"]
["Кузьма",6083.1,"2018-09-05"]
["Верх",5466.1,"2018-09-04"]
["Грайвор",7629,"2018-09-04"]
["Парк",6488.5,"2018-09-04"]
["Волгоград",1587,"2018-09-04"]
["Остап 2",264.3,"2018-09-04"]
["Товар",1857.2,"2018-09-04"]
["Кожух",5242.5,"2018-09-04"]
["Кузьма",6083.1,"2018-09-04"]
["Трофи",7064,"2018-09-04"]
["Верх",5466.1,"2018-09-03"]
["Папер",7257.5,"2018-09-03"]
["Остап 2",264.3,"2018-09-03"]
["Товар",1857.2,"2018-09-03"]
["Кожух",5242.5,"2018-09-03"]
["Кузьма",6083.1,"2018-09-03"]
["Трофи",7064,"2018-09-03"]
["Вешняк",2500,"2017-01-08"]
["Кабель",1023.91,"2017-01-08"]
["Андрон",1274,"2017-01-08"]
["Волочок",7608.9,"2017-01-08"]
["Вал",8958.5,"2017-01-08"]
["чет",9025.5,"2017-01-08"]
["Застава",885.6,"2017-01-08"]
[1481,1265.7,"2017-01-08"]
["Самокат",3061,"2017-01-08"]
["Солдат",795,"2017-01-08"]
["Танк",3053.1,"2017-01-08"]
["Трофи",7064,"2017-01-08"]
["Шепель",744,"2017-01-08"]

{"sheet":"Лист1","index":1,"n_rows":16,"n_cols":4,"rows_kept":16,"cut":false,"hidden":false,"merged":[]}
[]
[]
[]
[null,"Названия строк","Сумма по столбцу Значение","2018-09-04"]
[null,"Верх",10932.2,"2018-09-05"]
[null,"Волгоград",1587]
[null,"Грайвор",7629]
[null,"Кожух",10485]
[null,"Кузьма",12166.2]
[null,"остап",9826]
[null,"Остап 2",528.6]
[null,"Парк",6488.5]
[null,"Перерва",8476.9]
[null,"Товар",3714.4]
[null,"Трофи",7064]
[null,"Общий итог",78897.8]

{"sheet":"Отчет","index":2,"n_rows":25,"n_cols":4,"rows_kept":25,"cut":false,"hidden":false,"merged":[]}
[]
[]
[]
[null,null,"С","2018-09-04"]
[null,null,"До","2018-09-05"]
[]
[]
[]
[]
[]
[]
[]
[]
["Название","Сумма по полю Значение"]
["Верх",10932.2]
["Волгоград",1587]
["Грайвор",7629]
["Кожух",10485]
["Кузьма",12166.2]
["остап",9826]
["Остап 2",528.6]
["Парк",6488.5]
["Перерва",8476.9]
["Товар",3714.4]
["Трофи",7064]

{"sheet":"Сетка тротуары","index":3,"n_rows":145,"n_cols":6,"rows_kept":145,"cut":false,"hidden":true,"merged":[]}
["ОДХ","Посещен полностью","Посещен частично","Посещен менее 50%","Не посещен","2018-05-01"]
["Проектируемый проезд №770 а",{"$f":"COUNTIF($F2:$ZD2,B$1)","v":0},0,0,0,{"$f":"IF(COUNTIFS(Общая!$C:$C,F$1,Общая!#REF!,\"*\")=0,\"—\",IFERROR(INDEX(Общая!#REF!,MATCH($A2&F$1,Общая!#REF!,0),1),\"Посещен полностью\"))","v":{"$error":"#REF!"}}]
["ТПУ \"Товарная-Курская\"",0,0,0,0,{"$f":"IF(COUNTIFS(Общая!$C:$C,F$1,Общая!#REF!,\"*\")=0,\"—\",IFERROR(INDEX(Общая!#REF!,MATCH($A3&F$1,Общая!#REF!,0),1),\"Посещен полностью\"))","v":{"$error":"#REF!"}}]
["Проезд №1506",0,0,0,0,{"$f":"IF(COUNTIFS(Общая!$C:$C,F$1,Общая!#REF!,\"*\")=0,\"—\",IFERROR(INDEX(Общая!#REF!,MATCH($A4&F$1,Общая!#REF!,0),1),\"Посещен полностью\"))","v":{"$error":"#REF!"}}]
["Улица Люблинская",0,0,0,0,{"$f":"IF(COUNTIFS(Общая!$C:$C,F$1,Общая!#REF!,\"*\")=0,\"—\",IFERROR(INDEX(Общая!#REF!,MATCH($A5&F$1,Общая!#REF!,0),1),\"Посещен полностью\"))","v":{"$error":"#REF!"}}]
["Авиамоторная улица",0,0,0,0,{"$f":"IF(COUNTIFS(Общая!$C:$C,F$1,Общая!#REF!,\"*\")=0,\"—\",IFERROR(INDEX(Общая!#REF!,MATCH($A6&F$1,Общая!#REF!,0),1),\"Посещен полностью\"))","v":{"$error":"#REF!"}}]
["Краснодонская улица",0,0,0,0,{"$f":"IF(COUNTIFS(Общая!$C:$C,F$1,Общая!#REF!,\"*\")=0,\"—\",IFERROR(INDEX(Общая!#REF!,MATCH($A7&F$1,Общая!#REF!,0),1),\"Посещен полностью\"))","v":{"$error":"#REF!"}}]
["Красноказарменная улица",0,0,0,0,{"$f":"IF(COUNTIFS(Общая!$C:$C,F$1,Общая!#REF!,\"*\")=0,\"—\",IFERROR(INDEX(Общая!#REF!,MATCH($A8&F$1,Общая!#REF!,0),1),\"Посещен полностью\"))","v":{"$error":"#REF!"}}]
["Академика Скрябина улица",0,0,0,0,{"$f":"IF(COUNTIFS(Общая!$C:$C,F$1,Общая!#REF!,\"*\")=0,\"—\",IFERROR(INDEX(Общая!#REF!,MATCH($A9&F$1,Общая!#REF!,0),1),\"Посещен полностью\"))","v":{"$error":"#REF!"}}]
["Ташкентская улица",0,0,0,0,{"$f":"IF(COUNTIFS(Общая!$C:$C,F$1,Общая!#REF!,\"*\")=0,\"—\",IFERROR(INDEX(Общая!#REF!,MATCH($A10&F$1,Общая!#REF!,0),1),\"Посещен полностью\"))","v":{"$error":"#REF!"}}]
["Верхние Поля ул. (от Люблинской ул. до Марьинский Парк ул.)",0,0,0,0,{"$f":"IF(COUNTIFS(Общая!$C:$C,F$1,Общая!#REF!,\"*\")=0,\"—\",IFERROR(INDEX(Общая!#REF!,MATCH($A11&F$1,Общая!#REF!,0),1),\"Посещен полностью\"))","v":{"$error":"#REF!"}}]
["Поречная улица",0,0,0,0,{"$f":"IF(COUNTIFS(Общая!$C:$C,F$1,Общая!#REF!,\"*\")=0,\"—\",IFERROR(INDEX(Общая!#REF!,MATCH($A12&F$1,Общая!#REF!,0),1),\"Посещен полностью\"))","v":{"$error":"#REF!"}}]
["Окская улица",0,0,0,0,{"$f":"IF(COUNTIFS(Общая!$C:$C,F$1,Общая!#REF!,\"*\")=0,\"—\",IFERROR(INDEX(Общая!#REF!,MATCH($A13&F$1,Общая!#REF!,0),1),\"Посещен полностью\"))","v":{"$error":"#REF!"}}]
["Люблинская улица (дублер)",0,0,0,0,{"$f":"IF(COUNTIFS(Общая!$C:$C,F$1,Общая!#REF!,\"*\")=0,\"—\",IFERROR(INDEX(Общая!#REF!,MATCH($A14&F$1,Общая!#REF!,0),1),\"Посещен полностью\"))","v":{"$error":"#REF!"}}]
["Белореченская улица (от Цимлянской улицы до улицы Верхние Поля)",0,0,0,0,{"$f":"IF(COUNTIFS(Общая!$C:$C,F$1,Общая!#REF!,\"*\")=0,\"—\",IFERROR(INDEX(Общая!#REF!,MATCH($A15&F$1,Общая!#REF!,0),1),\"Посещен полностью\"))","v":{"$error":"#REF!"}}]
["Местный проезд Волгоградского проспекта (нечетная сторона)",0,0,0,0,{"$f":"IF(COUNTIFS(Общая!$C:$C,F$1,Общая!#REF!,\"*\")=0,\"—\",IFERROR(INDEX(Общая!#REF!,MATCH($A16&F$1,Общая!#REF!,0),1),\"Посещен полностью\"))","v":{"$error":"#REF!"}}]
["Энергетическая улица",0,0,0,0,{"$f":"IF(COUNTIFS(Общая!$C:$C,F$1,Общая!#REF!,\"*\")=0,\"—\",IFERROR(INDEX(Общая!#REF!,MATCH($A17&F$1,Общая!#REF!,0),1),\"Посещен полностью\"))","v":{"$error":"#REF!"}}]
["Новоостаповская улица",0,0,0,0,{"$f":"IF(COUNTIFS(Общая!$C:$C,F$1,Общая!#REF!,\"*\")=0,\"—\",IFERROR(INDEX(Общая!#REF!,MATCH($A18&F$1,Общая!#REF!,0),1),\"Посещен полностью\"))","v":{"$error":"#REF!"}}]
["Лефортовский Вал улица",0,0,0,0,{"$f":"IF(COUNTIFS(Общая!$C:$C,F$1,Общая!#REF!,\"*\")=0,\"—\",IFERROR(INDEX(Общая!#REF!,MATCH($A19&F$1,Общая!#REF!,0),1),\"Посещен полностью\"))","v":{"$error":"#REF!"}}]
["1-й Краснокурсантский проезд",0,0,0,0,{"$f":"IF(COUNTIFS(Общая!$C:$C,F$1,Общая!#REF!,\"*\")=0,\"—\",IFERROR(INDEX(Общая!#REF!,MATCH($A20&F$1,Общая!#REF!,0),1),\"Посещен полностью\"))","v":{"$error":"#REF!"}}]
["Трофимова улица",0,0,0,0,{"$f":"IF(COUNTIFS(Общая!$C:$C,F$1,Общая!#REF!,\"*\")=0,\"—\",IFERROR(INDEX(Общая!#REF!,MATCH($A21&F$1,Общая!#REF!,0),1),\"Посещен полностью\"))","v":{"$error":"#REF!"}}]
["Марьинский Парк улица (от Поречной улицы до Белореченской улицы)",{"$f":"COUNTIF($F22:$ZD22,B$1)","v":0},0,0,0,{"$f":"IF(COUNTIFS(Общая!$C:$C,F$1,Общая!#REF!,\"*\")=0,\"—\",IFERROR(INDEX(Общая!#REF!,MATCH($A22&F$1,Общая!#REF!,0),1),\"Посещен полностью\"))","v":{"$error":"#REF!"}}]
["Луговой проезд",0,0,0,0,{"$f":"IF(COUNTIFS(Общая!$C:$C,F$1,Общая!#REF!,\"*\")=0,\"—\",IFERROR(INDEX(Общая!#REF!,MATCH($A23&F$1,Общая!#REF!,0),1),\"Посещен полностью\"))","v":{"$error":"#REF!"}}]
["Ухтомская улица",0,0,0,0,{"$f":"IF(COUNTIFS(Общая!$C:$C,F$1,Общая!#REF!,\"*\")=0,\"—\",IFERROR(INDEX(Общая!#REF!,MATCH($A24&F$1,Общая!#REF!,0),1),\"Посещен полностью\"))","v":{"$error":"#REF!"}}]
["Золоторожская набережная",0,0,0,0,{"$f":"IF(COUNTIFS(Общая!$C:$C,F$1,Общая!#REF!,\"*\")=0,\"—\",IFERROR(INDEX(Общая!#REF!,MATCH($A25&F$1,Общая!#REF!,0),1),\"Посещен полностью\"))","v":{"$error":"#REF!"}}]
["Боровая улица",0,0,0,0,{"$f":"IF(COUNTIFS(Общая!$C:$C,F$1,Общая!#REF!,\"*\")=0,\"—\",IFERROR(INDEX(Общая!#REF!,MATCH($A26&F$1,Общая!#REF!,0),1),\"Посещен полностью\"))","v":{"$error":"#REF!"}}]
["Юрьевский переулок",0,0,0,0,{"$f":"IF(COUNTIFS(Общая!$C:$C,F$1,Общая!#REF!,\"*\")=0,\"—\",IFERROR(INDEX(Общая!#REF!,MATCH($A27&F$1,Общая!#REF!,0),1),\"Посещен полностью\"))","v":{"$error":"#REF!"}}]
["Жигулевская улица",0,0,0,0,{"$f":"IF(COUNTIFS(Общая!$C:$C,F$1,Общая!#REF!,\"*\")=0,\"—\",IFERROR(INDEX(Общая!#REF!,MATCH($A28&F$1,Общая!#REF!,0),1),\"Посещен полностью\"))","v":{"$error":"#REF!"}}]
["Васильцовский Стан",0,0,0,0,{"$f":"IF(COUNTIFS(Общая!$C:$C,F$1,Общая!#REF!,\"*\")=0,\"—\",IFERROR(INDEX(Общая!#REF!,MATCH($A29&F$1,Общая!#REF!,0),1),\"Посещен полностью\"))","v":{"$error":"#REF!"}}]
["Старообрядческая улица (бывшая улица Войтовича)",0,0,0,0,{"$f":"IF(COUNTIFS(Общая!$C:$C,F$1,Общая!#REF!,\"*\")=0,\"—\",IFERROR(INDEX(Общая!#REF!,MATCH($A30&F$1,Общая!#REF!,0),1),\"Посещен полностью\"))","v":{"$error":"#REF!"}}]
["1-й Кабельный проезд",0,0,0,0,{"$f":"IF(COUNTIFS(Общая!$C:$C,F$1,Общая!#REF!,\"*\")=0,\"—\",IFERROR(INDEX(Общая!#REF!,MATCH($A31&F$1,Общая!#REF!,0),1),\"Посещен полностью\"))","v":{"$error":"#REF!"}}]
["ТПУ \"Перерва\"",0,0,0,0,{"$f":"IF(COUNTIFS(Общая!$C:$C,F$1,Общая!#REF!,\"*\")=0,\"—\",IFERROR(INDEX(Общая!#REF!,MATCH($A32&F$1,Общая!#REF!,0),1),\"Посещен полностью\"))","v":{"$error":"#REF!"}}]
["Луховицкая улица",0,0,0,0,{"$f":"IF(COUNTIFS(Общая!$C:$C,F$1,Общая!#REF!,\"*\")=0,\"—\",IFERROR(INDEX(Общая!#REF!,MATCH($A33&F$1,Общая!#REF!,0),1),\"Посещен полностью\"))","v":{"$error":"#REF!"}}]
["2-й Вязовский проезд",0,0,0,0,{"$f":"IF(COUNTIFS(Общая!$C:$C,F$1,Общая!#REF!,\"*\")=0,\"—\",IFERROR(INDEX(Общая!#REF!,MATCH($A34&F$1,Общая!#REF!,0),1),\"Посещен полностью\"))","v":{"$error":"#REF!"}}]
["Красноказарменная набережная",0,0,0,0,{"$f":"IF(COUNTIFS(Общая!$C:$C,F$1,Общая!#REF!,\"*\")=0,\"—\",IFERROR(INDEX(Общая!#REF!,MATCH($A35&F$1,Общая!#REF!,0),1),\"Посещен полностью\"))","v":{"$error":"#REF!"}}]
["Андроновское шоссе",0,0,0,0,{"$f":"IF(COUNTIFS(Общая!$C:$C,F$1,Общая!#REF!,\"*\")=0,\"—\",IFERROR(INDEX(Общая!#REF!,MATCH($A36&F$1,Общая!#REF!,0),1),\"Посещен полностью\"))","v":{"$error":"#REF!"}}]
["3-й Крутицкий переулок",0,0,0,0,{"$f":"IF(COUNTIFS(Общая!$C:$C,F$1,Общая!#REF!,\"*\")=0,\"—\",IFERROR(INDEX(Общая!#REF!,MATCH($A37&F$1,Общая!#REF!,0),1),\"Посещен полностью\"))","v":{"$error":"#REF!"}}]
["2-я Кабельная улица",0,0,0,0,{"$f":"IF(COUNTIFS(Общая!$C:$C,F$1,Общая!#REF!,\"*\")=0,\"—\",IFERROR(INDEX(Общая!#REF!,MATCH($A38&F$1,Общая!#REF!,0),1),\"Посещен полностью\"))","v":{"$error":"#REF!"}}]
["Площадь Проломной Заставы",0,0,0,0,{"$f":"IF(COUNTIFS(Общая!$C:$C,F$1,Общая!#REF!,\"*\")=0,\"—\",IFERROR(INDEX(Общая!#REF!,MATCH($A39&F$1,Общая!#REF!,0),1),\"Посещен полностью\"))","v":{"$error":"#REF!"}}]
["Шепелюгинский переулок",0,0,0,0,{"$f":"IF(COUNTIFS(Общая!$C:$C,F$1,Общая!#REF!,\"*\")=0,\"—\",IFERROR(INDEX(Общая!#REF!,MATCH($A40&F$1,Общая!#REF!,0),1),\"Посещен полностью\"))","v":{"$error":"#REF!"}}]
["Проезд от Рязанского проспекта до Окской ул.",0,0,0,0,{"$f":"IF(COUNTIFS(Общая!$C:$C,F$1,Общая!#REF!,\"*\")=0,\"—\",IFERROR(INDEX(Общая!#REF!,MATCH($A41&F$1,Общая!#REF!,0),1),\"Посещен полностью\"))","v":{"$error":"#REF!"}}]
["Новомарьинская улица",{"$f":"COUNTIF($F42:$ZD42,B$1)","v":0},0,0,0,{"$f":"IF(COUNTIFS(Общая!$C:$C,F$1,Общая!#REF!,\"*\")=0,\"—\",IFERROR(INDEX(Общая!#REF!,MATCH($A42&F$1,Общая!#REF!,0),1),\"Посещен полностью\"))","v":{"$error":"#REF!"}}]
["1-я Дубровская улица",0,0,0,0,{"$f":"IF(COUNTIFS(Общая!$C:$C,F$1,Общая!#REF!,\"*\")=0,\"—\",IFERROR(INDEX(Общая!#REF!,MATCH($A43&F$1,Общая!#REF!,0),1),\"Посещен полностью\"))","v":{"$error":"#REF!"}}]
["Федора Полетаева",0,0,0,0,{"$f":"IF(COUNTIFS(Общая!$C:$C,F$1,Общая!#REF!,\"*\")=0,\"—\",IFERROR(INDEX(Общая!#REF!,MATCH($A44&F$1,Общая!#REF!,0),1),\"Посещен полностью\"))","v":{"$error":"#REF!"}}]
["Грайвороновская улица",0,0,0,0,{"$f":"IF(COUNTIFS(Общая!$C:$C,F$1,Общая!#REF!,\"*\")=0,\"—\",IFERROR(INDEX(Общая!#REF!,MATCH($A45&F$1,Общая!#REF!,0),1),\"Посещен полностью\"))","v":{"$error":"#REF!"}}]
["Паперника ул.",0,0,0,0,{"$f":"IF(COUNTIFS(Общая!$C:$C,F$1,Общая!#REF!,\"*\")=0,\"—\",IFERROR(INDEX(Общая!#REF!,MATCH($A46&F$1,Общая!#REF!,0),1),\"Посещен полностью\"))","v":{"$error":"#REF!"}}]
["Есенинский бульвар",0,0,0,0,{"$f":"IF(COUNTIFS(Общая!$C:$C,F$1,Общая!#REF!,\"*\")=0,\"—\",IFERROR(INDEX(Общая!#REF!,MATCH($A47&F$1,Общая!#REF!,0),1),\"Посещен полностью\"))","v":{"$error":"#REF!"}}]
["2-й Грайвороновский проезд",0,0,0,0,{"$f":"IF(COUNTIFS(Общая!$C:$C,F$1,Общая!#REF!,\"*\")=0,\"—\",IFERROR(INDEX(Общая!#REF!,MATCH($A48&F$1,Общая!#REF!,0),1),\"Посещен полностью\"))","v":{"$error":"#REF!"}}]
["Проектируемый проезд № 109",0,0,0,0,{"$f":"IF(COUNTIFS(Общая!$C:$C,F$1,Общая!#REF!,\"*\")=0,\"—\",IFERROR(INDEX(Общая!#REF!,MATCH($A49&F$1,Общая!#REF!,0),1),\"Посещен полностью\"))","v":{"$error":"#REF!"}}]
["Энергетический проезд",0,0,0,0,{"$f":"IF(COUNTIFS(Общая!$C:$C,F$1,Общая!#REF!,\"*\")=0,\"—\",IFERROR(INDEX(Общая!#REF!,MATCH($A50&F$1,Общая!#REF!,0),1),\"Посещен полностью\"))","v":{"$error":"#REF!"}}]
["Проектируемый проезд №770 А (часть 2)",0,0,0,0,{"$f":"IF(COUNTIFS(Общая!$C:$C,F$1,Общая!#REF!,\"*\")=0,\"—\",IFERROR(INDEX(Общая!#REF!,MATCH($A51&F$1,Общая!#REF!,0),1),\"Посещен полностью\"))","v":{"$error":"#REF!"}}]
["2-й Кабельный проезд",0,0,0,0,{"$f":"IF(COUNTIFS(Общая!$C:$C,F$1,Общая!#REF!,\"*\")=0,\"—\",IFERROR(INDEX(Общая!#REF!,MATCH($A52&F$1,Общая!#REF!,0),1),\"Посещен полностью\"))","v":{"$error":"#REF!"}}]
["Лапина улица",0,0,0,0,{"$f":"IF(COUNTIFS(Общая!$C:$C,F$1,Общая!#REF!,\"*\")=0,\"—\",IFERROR(INDEX(Общая!#REF!,MATCH($A53&F$1,Общая!#REF!,0),1),\"Посещен полностью\"))","v":{"$error":"#REF!"}}]
["Душинская улица",0,0,0,0,{"$f":"IF(COUNTIFS(Общая!$C:$C,F$1,Общая!#REF!,\"*\")=0,\"—\",IFERROR(INDEX(Общая!#REF!,MATCH($A54&F$1,Общая!#REF!,0),1),\"Посещен полностью\"))","v":{"$error":"#REF!"}}]
["улица Марьинский Парк от улицы Белореченская до ул. Верхние Поля",0,0,0,0,{"$f":"IF(COUNTIFS(Общая!$C:$C,F$1,Общая!#REF!,\"*\")=0,\"—\",IFERROR(INDEX(Общая!#REF!,MATCH($A55&F$1,Общая!#REF!,0),1),\"Посещен полностью\"))","v":{"$error":"#REF!"}}]
["Пруд-Ключики улица",0,0,0,0,{"$f":"IF(COUNTIFS(Общая!$C:$C,F$1,Общая!#REF!,\"*\")=0,\"—\",IFERROR(INDEX(Общая!#REF!,MATCH($A56&F$1,Общая!#REF!,0),1),\"Посещен полностью\"))","v":{"$error":"#REF!"}}]
["ТПУ \"Пролетарская\"",0,0,0,0,{"$f":"IF(COUNTIFS(Общая!$C:$C,F$1,Общая!#REF!,\"*\")=0,\"—\",IFERROR(INDEX(Общая!#REF!,MATCH($A57&F$1,Общая!#REF!,0),1),\"Посещен полностью\"))","v":{"$error":"#REF!"}}]
["Проезд под Дангауровским мостом",0,0,0,0,{"$f":"IF(COUNTIFS(Общая!$C:$C,F$1,Общая!#REF!,\"*\")=0,\"—\",IFERROR(INDEX(Общая!#REF!,MATCH($A58&F$1,Общая!#REF!,0),1),\"Посещен полностью\"))","v":{"$error":"#REF!"}}]
["Проектируемый проезд №5466",0,0,0,0,{"$f":"IF(COUNTIFS(Общая!$C:$C,F$1,Общая!#REF!,\"*\")=0,\"—\",IFERROR(INDEX(Общая!#REF!,MATCH($A59&F$1,Общая!#REF!,0),1),\"Посещен полностью\"))","v":{"$error":"#REF!"}}]
["Окский проезд",0,0,0,0,{"$f":"IF(COUNTIFS(Общая!$C:$C,F$1,Общая!#REF!,\"*\")=0,\"—\",IFERROR(INDEX(Общая!#REF!,MATCH($A60&F$1,Общая!#REF!,0),1),\"Посещен полностью\"))","v":{"$error":"#REF!"}}]
["1-й Вязовский проезд",0,0,0,0,{"$f":"IF(COUNTIFS(Общая!$C:$C,F$1,Общая!#REF!,\"*\")=0,\"—\",IFERROR(INDEX(Общая!#REF!,MATCH($A61&F$1,Общая!#REF!,0),1),\"Посещен полностью\"))","v":{"$error":"#REF!"}}]
["Проектируемый проезд №5175",{"$f":"COUNTIF($F62:$ZD62,B$1)","v":0},0,0,0,{"$f":"IF(COUNTIFS(Общая!$C:$C,F$1,Общая!#REF!,\"*\")=0,\"—\",IFERROR(INDEX(Общая!#REF!,MATCH($A62&F$1,Общая!#REF!,0),1),\"Посещен полностью\"))","v":{"$error":"#REF!"}}]
["Южнопортовая улица",0,0,0,0,{"$f":"IF(COUNTIFS(Общая!$C:$C,F$1,Общая!#REF!,\"*\")=0,\"—\",IFERROR(INDEX(Общая!#REF!,MATCH($A63&F$1,Общая!#REF!,0),1),\"Посещен полностью\"))","v":{"$error":"#REF!"}}]
["Зеленодольская улица",0,0,0,0,{"$f":"IF(COUNTIFS(Общая!$C:$C,F$1,Общая!#REF!,\"*\")=0,\"—\",IFERROR(INDEX(Общая!#REF!,MATCH($A64&F$1,Общая!#REF!,0),1),\"Посещен полностью\"))","v":{"$error":"#REF!"}}]
["Перерва улица (от Подольской улицы до Люблинской улицы)",0,0,0,0,{"$f":"IF(COUNTIFS(Общая!$C:$C,F$1,Общая!#REF!,\"*\")=0,\"—\",IFERROR(INDEX(Общая!#REF!,MATCH($A65&F$1,Общая!#REF!,0),1),\"Посещен полностью\"))","v":{"$error":"#REF!"}}]
["Батайский проезд",0,0,0,0,{"$f":"IF(COUNTIFS(Общая!$C:$C,F$1,Общая!#REF!,\"*\")=0,\"—\",IFERROR(INDEX(Общая!#REF!,MATCH($A66&F$1,Общая!#REF!,0),1),\"Посещен полностью\"))","v":{"$error":"#REF!"}}]
["Шоссейная улица (от монастыря до проезда 4294)",0,0,0,0,{"$f":"IF(COUNTIFS(Общая!$C:$C,F$1,Общая!#REF!,\"*\")=0,\"—\",IFERROR(INDEX(Общая!#REF!,MATCH($A67&F$1,Общая!#REF!,0),1),\"Посещен полностью\"))","v":{"$error":"#REF!"}}]
["Полбина ул.",0,0,0,0,{"$f":"IF(COUNTIFS(Общая!$C:$C,F$1,Общая!#REF!,\"*\")=0,\"—\",IFERROR(INDEX(Общая!#REF!,MATCH($A68&F$1,Общая!#REF!,0),1),\"Посещен полностью\"))","v":{"$error":"#REF!"}}]
["улица Михайлова",0,0,0,0,{"$f":"IF(COUNTIFS(Общая!$C:$C,F$1,Общая!#REF!,\"*\")=0,\"—\",IFERROR(INDEX(Общая!#REF!,MATCH($A69&F$1,Общая!#REF!,0),1),\"Посещен полностью\"))","v":{"$error":"#REF!"}}]
["улица Маршала Голованова",0,0,0,0,{"$f":"IF(COUNTIFS(Общая!$C:$C,F$1,Общая!#REF!,\"*\")=0,\"—\",IFERROR(INDEX(Общая!#REF!,MATCH($A70&F$1,Общая!#REF!,0),1),\"Посещен полностью\"))","v":{"$error":"#REF!"}}]
["Перервинский бульвар",0,0,0,0,{"$f":"IF(COUNTIFS(Общая!$C:$C,F$1,Общая!#REF!,\"*\")=0,\"—\",IFERROR(INDEX(Общая!#REF!,MATCH($A71&F$1,Общая!#REF!,0),1),\"Посещен полностью\"))","v":{"$error":"#REF!"}}]
["Местный проезд Волгоградского проспекта (четная сторона)",0,0,0,0,{"$f":"IF(COUNTIFS(Общая!$C:$C,F$1,Общая!#REF!,\"*\")=0,\"—\",IFERROR(INDEX(Общая!#REF!,MATCH($A72&F$1,Общая!#REF!,0),1),\"Посещен полностью\"))","v":{"$error":"#REF!"}}]
["проезд Завода Серп и Молот",0,0,0,0,{"$f":"IF(COUNTIFS(Общая!$C:$C,F$1,Общая!#REF!,\"*\")=0,\"—\",IFERROR(INDEX(Общая!#REF!,MATCH($A73&F$1,Общая!#REF!,0),1),\"Посещен полностью\"))","v":{"$error":"#REF!"}}]
["Волочаевская улица",0,0,0,0,{"$f":"IF(COUNTIFS(Общая!$C:$C,F$1,Общая!#REF!,\"*\")=0,\"—\",IFERROR(INDEX(Общая!#REF!,MATCH($A74&F$1,Общая!#REF!,0),1),\"Посещен полностью\"))","v":{"$error":"#REF!"}}]
["Марьинский бульвар",0,0,0,0,{"$f":"IF(COUNTIFS(Общая!$C:$C,F$1,Общая!#REF!,\"*\")=0,\"—\",IFERROR(INDEX(Общая!#REF!,MATCH($A75&F$1,Общая!#REF!,0),1),\"Посещен полностью\"))","v":{"$error":"#REF!"}}]
["Шарикоподшипниковская улица",0,0,0,0,{"$f":"IF(COUNTIFS(Общая!$C:$C,F$1,Общая!#REF!,\"*\")=0,\"—\",IFERROR(INDEX(Общая!#REF!,MATCH($A76&F$1,Общая!#REF!,0),1),\"Посещен полностью\"))","v":{"$error":"#REF!"}}]
["улица Маршала Чуйкова",0,0,0,0,{"$f":"IF(COUNTIFS(Общая!$C:$C,F$1,Общая!#REF!,\"*\")=0,\"—\",IFERROR(INDEX(Общая!#REF!,MATCH($A77&F$1,Общая!#REF!,0),1),\"Посещен полностью\"))","v":{"$error":"#REF!"}}]
["Госпитальный Вал улица",0,0,0,0,{"$f":"IF(COUNTIFS(Общая!$C:$C,F$1,Общая!#REF!,\"*\")=0,\"—\",IFERROR(INDEX(Общая!#REF!,MATCH($A78&F$1,Общая!#REF!,0),1),\"Посещен полностью\"))","v":{"$error":"#REF!"}}]
["Головинская набережная",0,0,0,0,{"$f":"IF(COUNTIFS(Общая!$C:$C,F$1,Общая!#REF!,\"*\")=0,\"—\",IFERROR(INDEX(Общая!#REF!,MATCH($A79&F$1,Общая!#REF!,0),1),\"Посещен полностью\"))","v":{"$error":"#REF!"}}]
["Местный проезд Рязанского проспекта (Четная сторона)",0,0,0,0,{"$f":"IF(COUNTIFS(Общая!$C:$C,F$1,Общая!#REF!,\"*\")=0,\"—\",IFERROR(INDEX(Общая!#REF!,MATCH($A80&F$1,Общая!#REF!,0),1),\"Посещен полностью\"))","v":{"$error":"#REF!"}}]
{"$rows_left_out":65}