{"text_format":"1","workbook":"xlsx","n_sheets":3,"sheets":["Перечень ТМЦ уч. св.№5","Отсутствие работников","Сальдо"],"not_rendered":{"charts":0,"images":0,"macros":1,"external_links":0,"defined_names":1,"comments":0,"pivot_tables":0},"unopened":[],"bounds":{"document_bytes":16777216,"sheet_cells":100000,"rows_first":2000,"rows_last":500,"rows_between":2000,"halvings":0,"cell_chars":16384,"cell_head_chars":4096},"cells_cut":0,"cells_raw":0,"read":"whole","date_system":"1900"}

{"sheet":"Перечень ТМЦ уч. св.№5","index":0,"n_rows":43,"n_cols":12,"rows_kept":43,"cut":false,"hidden":false,"merged":[[29,1,48,5],[25,4,25,6],[0,10,0,11],[11,10,22,10],[11,11,22,11],[2,0,2,3],[2,4,2,5],[5,0,5,11],[6,10,8,10],[10,4,22,4],[6,4,8,4],[23,4,23,6],[24,4,24,6]]}
[null,null,null,null,null,null,null,null,null,null,"Приложение 1"]
[]
[null,null,null,null,"декабрь 2021 год"]
[]
["Номенкла-турный №","Наименование ТМЦ","Партия","Счет Главной книги","МВП","№ заказа","№ документа","Ед. изм","Запас на конец периода","Стоимость запаса на конец периода","Причина списания ","требуемые документы "]
["Участок связи № 5 (скл. К006)"]
[{"$f":"VLOOKUP(B7,CHOOSE({1,2},Сальдо!$B$3:$B$39,Сальдо!$A$3:$A$39),2,0)","v":"LOC100928716"},"Машина шлиф.Bosch GWS11-125 угл.",{"$f":"VLOOKUP(B7,Сальдо!$B$3:$K$39,2,$A$1)","v":"PN01303180"},{"$f":"VLOOKUP(B7,Сальдо!$B$3:$K$39,3,$A$1)","v":"1090700000"},64940213,null,null,{"$f":"VLOOKUP(B7,Сальдо!$B$3:$K$39,4,$A$1)","v":"ШТ"},{"$f":"VLOOKUP(B7,Сальдо!$B$3:$K$39,9,$A$1)","v":0},{"$f":"VLOOKUP(B7,Сальдо!$B$3:$K$39,10,$A$1)","v":0},null,"Ведомость выдачи 7.3.27"]
[{"$f":"VLOOKUP(B8,CHOOSE({1,2},Сальдо!$B$3:$B$39,Сальдо!$A$3:$A$39),2,0)","v":"LOC100798427"},"Бумага туал.Zewa Плюс 2сл.N4 белая",{"$f":"VLOOKUP(B8,Сальдо!$B$3:$K$39,2,$A$1)","v":"PN01239667"},{"$f":"VLOOKUP(B8,Сальдо!$B$3:$K$39,3,$A$1)","v":"1010100000"},null,null,null,{"$f":"VLOOKUP(B8,Сальдо!$B$3:$K$39,4,$A$1)","v":"ШТ"},{"$f":"VLOOKUP(B8,Сальдо!$B$3:$K$39,9,$A$1)","v":10},{"$f":"VLOOKUP(B8,Сальдо!$B$3:$K$39,10,$A$1)","v":849.9}]
[{"$f":"VLOOKUP(B9,CHOOSE({1,2},Сальдо!$B$3:$B$39,Сальдо!$A$3:$A$39),2,0)","v":"LOC100692619"},"Салфетка хоз.Vclean 30х30см универсал",{"$f":"VLOOKUP(B9,Сальдо!$B$3:$K$39,2,$A$1)","v":"PN00997126"},{"$f":"VLOOKUP(B9,Сальдо!$B$3:$K$39,3,$A$1)","v":"1010100000"},null,null,null,{"$f":"VLOOKUP(B9,Сальдо!$B$3:$K$39,4,$A$1)","v":"ШТ"},{"$f":"VLOOKUP(B9,Сальдо!$B$3:$K$39,9,$A$1)","v":0},{"$f":"VLOOKUP(B9,Сальдо!$B$3:$K$39,10,$A$1)","v":0},null,"Ведомость выдачи 7.3.27"]
[{"$f":"VLOOKUP(B10,CHOOSE({1,2},Сальдо!$B$3:$B$39,Сальдо!$A$3:$A$39),2,0)","v":{"$error":"#N/A"}},"Маска мед.Sense Professional однораз.N53",{"$f":"VLOOKUP(B10,Сальдо!$B$3:$K$39,2,$A$1)","v":{"$error":"#N/A"}},{"$f":"VLOOKUP(B10,Сальдо!$B$3:$K$39,3,$A$1)","v":{"$error":"#N/A"}},64940231,null,null,{"$f":"VLOOKUP(B10,Сальдо!$B$3:$K$39,4,$A$1)","v":{"$error":"#N/A"}},{"$f":"VLOOKUP(B10,Сальдо!$B$3:$K$39,9,$A$1)","v":{"$error":"#N/A"}},{"$f":"VLOOKUP(B10,Сальдо!$B$3:$K$39,10,$A$1)","v":{"$error":"#N/A"}}]
[{"$f":"VLOOKUP(B11,CHOOSE({1,2},Сальдо!$B$3:$B$39,Сальдо!$A$3:$A$39),2,0)","v":{"$error":"#N/A"}},"Маска мед.Sense Professional однораз.N54",{"$f":"VLOOKUP(B11,Сальдо!$B$3:$K$39,2,$A$1)","v":{"$error":"#N/A"}},{"$f":"VLOOKUP(B11,Сальдо!$B$3:$K$39,3,$A$1)","v":{"$error":"#N/A"}},64940213,null,null,{"$f":"VLOOKUP(B11,Сальдо!$B$3:$K$39,4,$A$1)","v":{"$error":"#N/A"}},{"$f":"VLOOKUP(B11,Сальдо!$B$3:$K$39,9,$A$1)","v":{"$error":"#N/A"}},{"$f":"VLOOKUP(B11,Сальдо!$B$3:$K$39,10,$A$1)","v":{"$error":"#N/A"}}]
[{"$f":"VLOOKUP(B12,CHOOSE({1,2},Сальдо!$B$3:$B$39,Сальдо!$A$3:$A$39),2,0)","v":{"$error":"#N/A"}},"Маска мед.Sense Professional однораз.N55",{"$f":"VLOOKUP(B12,Сальдо!$B$3:$K$39,2,$A$1)","v":{"$error":"#N/A"}},{"$f":"VLOOKUP(B12,Сальдо!$B$3:$K$39,3,$A$1)","v":{"$error":"#N/A"}},null,null,null,{"$f":"VLOOKUP(B12,Сальдо!$B$3:$K$39,4,$A$1)","v":{"$error":"#N/A"}},{"$f":"VLOOKUP(B12,Сальдо!$B$3:$K$39,9,$A$1)","v":{"$error":"#N/A"}},{"$f":"VLOOKUP(B12,Сальдо!$B$3:$K$39,10,$A$1)","v":{"$error":"#N/A"}},"Повреждение изоляции кабеля;                               Система кабельного телевидения №2                                   (инв№ 350010001173)","Ведомость дефектов"]
[{"$f":"VLOOKUP(B13,CHOOSE({1,2},Сальдо!$B$3:$B$39,Сальдо!$A$3:$A$39),2,0)","v":{"$error":"#N/A"}},"Маска мед.Sense Professional однораз.N56",{"$f":"VLOOKUP(B13,Сальдо!$B$3:$K$39,2,$A$1)","v":{"$error":"#N/A"}},{"$f":"VLOOKUP(B13,Сальдо!$B$3:$K$39,3,$A$1)","v":{"$error":"#N/A"}},null,null,null,{"$f":"VLOOKUP(B13,Сальдо!$B$3:$K$39,4,$A$1)","v":{"$error":"#N/A"}},{"$f":"VLOOKUP(B13,Сальдо!$B$3:$K$39,9,$A$1)","v":{"$error":"#N/A"}},{"$f":"VLOOKUP(B13,Сальдо!$B$3:$K$39,10,$A$1)","v":{"$error":"#N/A"}}]
[{"$f":"VLOOKUP(B14,CHOOSE({1,2},Сальдо!$B$3:$B$39,Сальдо!$A$3:$A$39),2,0)","v":{"$error":"#N/A"}},"Маска мед.Sense Professional однораз.N57",{"$f":"VLOOKUP(B14,Сальдо!$B$3:$K$39,2,$A$1)","v":{"$error":"#N/A"}},{"$f":"VLOOKUP(B14,Сальдо!$B$3:$K$39,3,$A$1)","v":{"$error":"#N/A"}},null,null,null,{"$f":"VLOOKUP(B14,Сальдо!$B$3:$K$39,4,$A$1)","v":{"$error":"#N/A"}},{"$f":"VLOOKUP(B14,Сальдо!$B$3:$K$39,9,$A$1)","v":{"$error":"#N/A"}},{"$f":"VLOOKUP(B14,Сальдо!$B$3:$K$39,10,$A$1)","v":{"$error":"#N/A"}}]
[{"$f":"VLOOKUP(B15,CHOOSE({1,2},Сальдо!$B$3:$B$39,Сальдо!$A$3:$A$39),2,0)","v":{"$error":"#N/A"}},"Маска мед.Sense Professional однораз.N58",{"$f":"VLOOKUP(B15,Сальдо!$B$3:$K$39,2,$A$1)","v":{"$error":"#N/A"}},{"$f":"VLOOKUP(B15,Сальдо!$B$3:$K$39,3,$A$1)","v":{"$error":"#N/A"}},null,null,null,{"$f":"VLOOKUP(B15,Сальдо!$B$3:$K$39,4,$A$1)","v":{"$error":"#N/A"}},{"$f":"VLOOKUP(B15,Сальдо!$B$3:$K$39,9,$A$1)","v":{"$error":"#N/A"}},{"$f":"VLOOKUP(B15,Сальдо!$B$3:$K$39,10,$A$1)","v":{"$error":"#N/A"}}]
[{"$f":"VLOOKUP(B16,CHOOSE({1,2},Сальдо!$B$3:$B$39,Сальдо!$A$3:$A$39),2,0)","v":{"$error":"#N/A"}},"Маска мед.Sense Professional однораз.N59",{"$f":"VLOOKUP(B16,Сальдо!$B$3:$K$39,2,$A$1)","v":{"$error":"#N/A"}},{"$f":"VLOOKUP(B16,Сальдо!$B$3:$K$39,3,$A$1)","v":{"$error":"#N/A"}},null,null,null,{"$f":"VLOOKUP(B16,Сальдо!$B$3:$K$39,4,$A$1)","v":{"$error":"#N/A"}},{"$f":"VLOOKUP(B16,Сальдо!$B$3:$K$39,9,$A$1)","v":{"$error":"#N/A"}},{"$f":"VLOOKUP(B16,Сальдо!$B$3:$K$39,10,$A$1)","v":{"$error":"#N/A"}}]
[{"$f":"VLOOKUP(B17,CHOOSE({1,2},Сальдо!$B$3:$B$39,Сальдо!$A$3:$A$39),2,0)","v":{"$error":"#N/A"}},"Маска мед.Sense Professional однораз.N60",{"$f":"VLOOKUP(B17,Сальдо!$B$3:$K$39,2,$A$1)","v":{"$error":"#N/A"}},{"$f":"VLOOKUP(B17,Сальдо!$B$3:$K$39,3,$A$1)","v":{"$error":"#N/A"}},null,null,null,{"$f":"VLOOKUP(B17,Сальдо!$B$3:$K$39,4,$A$1)","v":{"$error":"#N/A"}},{"$f":"VLOOKUP(B17,Сальдо!$B$3:$K$39,9,$A$1)","v":{"$error":"#N/A"}},{"$f":"VLOOKUP(B17,Сальдо!$B$3:$K$39,10,$A$1)","v":{"$error":"#N/A"}}]
[{"$f":"VLOOKUP(B18,CHOOSE({1,2},Сальдо!$B$3:$B$39,Сальдо!$A$3:$A$39),2,0)","v":{"$error":"#N/A"}},"Маска мед.Sense Professional однораз.N61",{"$f":"VLOOKUP(B18,Сальдо!$B$3:$K$39,2,$A$1)","v":{"$error":"#N/A"}},{"$f":"VLOOKUP(B18,Сальдо!$B$3:$K$39,3,$A$1)","v":{"$error":"#N/A"}},null,null,null,{"$f":"VLOOKUP(B18,Сальдо!$B$3:$K$39,4,$A$1)","v":{"$error":"#N/A"}},{"$f":"VLOOKUP(B18,Сальдо!$B$3:$K$39,9,$A$1)","v":{"$error":"#N/A"}},{"$f":"VLOOKUP(B18,Сальдо!$B$3:$K$39,10,$A$1)","v":{"$error":"#N/A"}}]
[{"$f":"VLOOKUP(B19,CHOOSE({1,2},Сальдо!$B$3:$B$39,Сальдо!$A$3:$A$39),2,0)","v":{"$error":"#N/A"}},"Маска мед.Sense Professional однораз.N62",{"$f":"VLOOKUP(B19,Сальдо!$B$3:$K$39,2,$A$1)","v":{"$error":"#N/A"}},{"$f":"VLOOKUP(B19,Сальдо!$B$3:$K$39,3,$A$1)","v":{"$error":"#N/A"}},null,null,null,{"$f":"VLOOKUP(B19,Сальдо!$B$3:$K$39,4,$A$1)","v":{"$error":"#N/A"}},{"$f":"VLOOKUP(B19,Сальдо!$B$3:$K$39,9,$A$1)","v":{"$error":"#N/A"}},{"$f":"VLOOKUP(B19,Сальдо!$B$3:$K$39,10,$A$1)","v":{"$error":"#N/A"}}]
[{"$f":"VLOOKUP(B20,CHOOSE({1,2},Сальдо!$B$3:$B$39,Сальдо!$A$3:$A$39),2,0)","v":{"$error":"#N/A"}},"Маска мед.Sense Professional однораз.N63",{"$f":"VLOOKUP(B20,Сальдо!$B$3:$K$39,2,$A$1)","v":{"$error":"#N/A"}},{"$f":"VLOOKUP(B20,Сальдо!$B$3:$K$39,3,$A$1)","v":{"$error":"#N/A"}},null,null,null,{"$f":"VLOOKUP(B20,Сальдо!$B$3:$K$39,4,$A$1)","v":{"$error":"#N/A"}},{"$f":"VLOOKUP(B20,Сальдо!$B$3:$K$39,9,$A$1)","v":{"$error":"#N/A"}},{"$f":"VLOOKUP(B20,Сальдо!$B$3:$K$39,10,$A$1)","v":{"$error":"#N/A"}}]
[{"$f":"VLOOKUP(B21,CHOOSE({1,2},Сальдо!$B$3:$B$39,Сальдо!$A$3:$A$39),2,0)","v":{"$error":"#N/A"}},"Маска мед.Sense Professional однораз.N64",{"$f":"VLOOKUP(B21,Сальдо!$B$3:$K$39,2,$A$1)","v":{"$error":"#N/A"}},{"$f":"VLOOKUP(B21,Сальдо!$B$3:$K$39,3,$A$1)","v":{"$error":"#N/A"}},null,null,null,{"$f":"VLOOKUP(B21,Сальдо!$B$3:$K$39,4,$A$1)","v":{"$error":"#N/A"}},{"$f":"VLOOKUP(B21,Сальдо!$B$3:$K$39,9,$A$1)","v":{"$error":"#N/A"}},{"$f":"VLOOKUP(B21,Сальдо!$B$3:$K$39,10,$A$1)","v":{"$error":"#N/A"}}]
[{"$f":"VLOOKUP(B22,CHOOSE({1,2},Сальдо!$B$3:$B$39,Сальдо!$A$3:$A$39),2,0)","v":{"$error":"#N/A"}},"Маска мед.Sense Professional однораз.N65",{"$f":"VLOOKUP(B22,Сальдо!$B$3:$K$39,2,$A$1)","v":{"$error":"#N/A"}},{"$f":"VLOOKUP(B22,Сальдо!$B$3:$K$39,3,$A$1)","v":{"$error":"#N/A"}},null,null,null,{"$f":"VLOOKUP(B22,Сальдо!$B$3:$K$39,4,$A$1)","v":{"$error":"#N/A"}},{"$f":"VLOOKUP(B22,Сальдо!$B$3:$K$39,9,$A$1)","v":{"$error":"#N/A"}},{"$f":"VLOOKUP(B22,Сальдо!$B$3:$K$39,10,$A$1)","v":{"$error":"#N/A"}}]
[{"$f":"VLOOKUP(B23,CHOOSE({1,2},Сальдо!$B$3:$B$39,Сальдо!$A$3:$A$39),2,0)","v":{"$error":"#N/A"}},"Маска мед.Sense Professional однораз.N66",{"$f":"VLOOKUP(B23,Сальдо!$B$3:$K$39,2,$A$1)","v":{"$error":"#N/A"}},{"$f":"VLOOKUP(B23,Сальдо!$B$3:$K$39,3,$A$1)","v":{"$error":"#N/A"}},null,null,null,{"$f":"VLOOKUP(B23,Сальдо!$B$3:$K$39,4,$A$1)","v":{"$error":"#N/A"}},{"$f":"VLOOKUP(B23,Сальдо!$B$3:$K$39,9,$A$1)","v":{"$error":"#N/A"}},{"$f":"VLOOKUP(B23,Сальдо!$B$3:$K$39,10,$A$1)","v":{"$error":"#N/A"}}]
[{"$f":"VLOOKUP(B24,CHOOSE({1,2},Сальдо!$B$40:$B$260,Сальдо!$A$40:$A$260),2,0)","v":"LOC100422815"},"Календарь настен.арт.7569",{"$f":"VLOOKUP(B24,Сальдо!$B$40:$K$260,2,$A$1)","v":"EX01235924"},{"$f":"VLOOKUP(B24,Сальдо!$B$40:$K$260,3,$A$1)","v":"Z030200000"},"Забаланс",null,null,{"$f":"VLOOKUP(B24,Сальдо!$B$40:$K$260,4,$A$1)","v":"ШТ"},{"$f":"VLOOKUP(B24,Сальдо!$B$40:$K$260,9,$A$1)","v":2},{"$f":"VLOOKUP(B24,Сальдо!$B$40:$K$260,10,$A$1)","v":472},"Истек срок эксплуатации","Акт на списание ИХП МБ-8"]
[{"$f":"VLOOKUP(B25,CHOOSE({1,2},Сальдо!$B$40:$B$260,Сальдо!$A$40:$A$260),2,0)","v":{"$error":"#N/A"}},"Календарь настен.арт.7570",{"$f":"VLOOKUP(B25,Сальдо!$B$40:$K$260,2,$A$1)","v":{"$error":"#N/A"}},{"$f":"VLOOKUP(B25,Сальдо!$B$40:$K$260,3,$A$1)","v":{"$error":"#N/A"}},"Забаланс",null,null,{"$f":"VLOOKUP(B25,Сальдо!$B$40:$K$260,4,$A$1)","v":{"$error":"#N/A"}},{"$f":"VLOOKUP(B25,Сальдо!$B$40:$K$260,9,$A$1)","v":{"$error":"#N/A"}},{"$f":"VLOOKUP(B25,Сальдо!$B$40:$K$260,10,$A$1)","v":{"$error":"#N/A"}},"Истек срок эксплуатации","Акт на списание ИХП МБ-8"]
[{"$f":"VLOOKUP(B26,CHOOSE({1,2},Сальдо!$B$40:$B$260,Сальдо!$A$40:$A$260),2,0)","v":"LOC100423561"},"Кисть КФК10 филеночная",{"$f":"VLOOKUP(B26,Сальдо!$B$40:$K$260,2,$A$1)","v":"EXR0528008"},{"$f":"VLOOKUP(B26,Сальдо!$B$40:$K$260,3,$A$1)","v":"Z030200000"},"Забаланс",null,null,{"$f":"VLOOKUP(B26,Сальдо!$B$40:$K$260,4,$A$1)","v":"ШТ"},{"$f":"VLOOKUP(B26,Сальдо!$B$40:$K$260,9,$A$1)","v":0},{"$f":"VLOOKUP(B26,Сальдо!$B$40:$K$260,10,$A$1)","v":0},"Истек срок эксплуатации","Акт на списание ИХП МБ-8"]
[null,null,null,null,null,null,null,null,"Итого",{"$f":"SUM(J7:J26)","v":{"$error":"#N/A"}}]
[]
[]
[null,"Здравствуйте! Если не трудно, гляньте где моя ошибка! При воспроизведении макроса, нужно, чтобы сохранился просто первый лист под названием Пречень ТМЦ без макросов, формул и выпадающего списка и остался в той же папке ( не создавая новую), где и оригинал. Но у оригинала при сохранении пропадает выпадающий список? Благодарю заранее"]
[]
[44562]
[44594]
[44623]
[44652]
[44683]
[44715]
[44743]
[44775]
[44807]
[44835]
[44867]
["декабрь 2021 г."]

{"sheet":"Отсутствие работников","index":1,"n_rows":1,"n_cols":3,"rows_kept":1,"cut":false,"hidden":false,"merged":[[0,2,0,3]]}
["ФИО","Должность ","декабрь"]

{"sheet":"Сальдо","index":2,"n_rows":241,"n_cols":11,"rows_kept":241,"cut":false,"hidden":false,"merged":[[38,0,38,10]]}
["Материал","Наименование","Партия","Счет","Един. изм.","Кол-во","Стоимость","Цена 1 изд.","Дата ввода в экспл.","Кол-во списания","Стоимость"]
[1,2,3,4,5,6,7,8,null,9,10]
["LOC100798427","Бумага туал.Zewa Плюс 2сл.N4 белая","PN01239667","1010100000","ШТ",72,6119.28,84.99,"2021-04-26",10,{"$f":"J3*H3","v":849.9}]
["LOC100423023","Канистра МТ-031 алюм.20л","PN00834948","1040000000","ШТ",1,1668.47,1668.47,"2019-07-31",0,0]
["LOC100428258","Лента из.ПВХ 15х0,20 синяя в/с","PN01363179","1010100000","КГ",2.4420000000000002,732.6,300,"2021-10-19",0,0]
["LOC100428259","Лента из.ПВХ 15х0,20 черная в/с","PN01151584","1010100000","КГ",0.01,3,299.93,"2020-11-13",0,0]
["LOC100428259","Лента из.ПВХ 15х0,20 черная в/с","PN01363183","1010100000","КГ",4.99,1496.65,299.93,"2021-10-19",0,0]
["LOC100874474","Маска мед.Sense Professional однораз.N50","PN01305684","1010100000","ШТ",220,598.76,2.72,"2021-08-10",0,0]
["LOC100928716","Машина шлиф.Bosch GWS11-125 угл.","PN01303180","1090700000","ШТ",1,6876.36,6876.36,"2021-08-06",0,0]
["LOC100916446","Перчатки мед.Benovy MNFT003В30 р.M","PN01305682","1010100000","ПАР",40,1064.8800000000001,26.62,"2021-08-10",0,0]
["LOC100864095","Разъем PROconnect 05-4003-6 штекер RG-6","PN01382048","1050000000","ШТ",150,460.5,3.07,"2021-11-09",0,0]
["LOC100692619","Салфетка хоз.Vclean 30х30см универсал","PN00997126","1010100000","ШТ",6,170.69,28.45,"2020-03-16",0,0]
["LOC100859912","Средство дез.Армасепт гель 1000мл","PN01178341","1010100000","ШТ",3,2203.6,734.53,"2020-12-30",0,0]
["LOC100859913","Средство о/комар.Рефтамид максимум 200мл","SZ00012444","1010100000","ШТ",5,954.62,190.92,"2021-05-11",0,0]
["LOC100442467","Топливо дизельное ТУ0251-088-00151638-12","TL00003804","1030100000","Т",0.02,877.04,43852.2,null,0,0]
["LOC100876878","Трубка термоус.ТНТнг-LS 6/3 желто-зелен.","PN01086555","1010100000","М",1.5,34.200000000000003,22.8,"2020-07-23",0,0]
["LOC100876879","Трубка термоус.ТНТнг-LS 6/3 красная","PN01086741","1010100000","М",1.5,22.98,15.32,"2020-07-23",0,0]
["LOC100876907","Трубка термоус.ТУТнг-LS 10/5 желто-зел.","PN01086730","1010100000","М",1.5,37.4,24.93,"2020-07-23",0,0]
["LOC100876908","Трубка термоус.ТУТнг-LS 10/5 красная","PN01086737","1010100000","М",1.5,23.59,15.73,"2020-07-23",0,0]
["LOC100876909","Трубка термоус.ТУТнг-LS 10/5 черная","PN01086745","1010100000","М",1.5,21.03,14.02,"2020-07-23",0,0]
["LOC100876910","Трубка термоус.ТУТнг-LS 12/6 белая","PN01086736","1010100000","М",1.5,28.42,18.95,"2020-07-23",0,0]
["LOC100876880","Трубка термоус.ТУТнг-LS 20/10 желто-зел.","PN01086718","1010100000","М",1.5,92.42,61.61,"2020-07-23",0,0]
["LOC100876881","Трубка термоус.ТУТнг-LS 4/2 белая","PN01086717","1010100000","М",2,12.3,8.1999999999999993,"2020-07-23",0,0]
["LOC100876883","Трубка термоус.ТУТнг-LS 8/4 красная","PN01086721","1010100000","М",1.5,20.85,13.9,"2020-07-23",0,0]
[]
[]
[]
[]
[]
[]
[]
[]
[]
[]
[]
[]
[]
[]
["Забаланс"]
["LOC100414682","Анализатор W&W Manufactur* Analyzer Ia","EXR0527987","Z030200000","ШТ",1,37005.910000000003,37005.910000000003,"2017-12-31",null,{"$f":"J40*H40","v":0}]
["LOC100414915","Аппарат телеф.Siemens Euroset 5010","EXR0527988","Z030200000","ШТ",5,1775.25,355.05,"2017-12-31",null,0]
["LOC100414916","Аппарат телеф.Siemens Euroset 5015","EXR0527989","Z030200000","ШТ",5,3477.44,695.49,"2017-12-31",null,0]
["LOC100414937","Аппарат телеф.Telta-M214 (Телта-М214)","EXR0527990","Z030200000","ШТ",5,8675.5300000000007,1735.11,"2017-12-31",null,0]
["LOC100414937","Аппарат телеф.Telta-M214 (Телта-М214)","EXR0528666","Z030200000","ШТ",10,17351.05,1735.11,"2017-12-31",null,0]
["LOC100415519","Блок пит.Sirus PS-1215U","EXR0527991","Z030200000","ШТ",1,8323.58,8323.58,"2017-12-31",null,0]
["LOC100415755","Бокорезы КВТ 180мм д/раб.под напр.1000В","EXR0527992","Z030200000","ШТ",2,1047.22,523.61,"2017-12-31",null,0]
["LOC100415755","Бокорезы КВТ 180мм д/раб.под напр.1000В","EXR0527993","Z030200000","ШТ",2,376.77,188.39,"2017-12-31",null,0]
["LOC100827944","Боты диэлектрические арт.4101-ФТ р.44","EX01122308","Z030200000","ПАР",1,674.14,674.14,"2020-05-29",null,0]
["LOC100416429","Бур SDS+5 6х50х115 Bosch","EXR0527994","Z030200000","ШТ",1,80,80,"2017-12-31",null,0]
["LOC100416525","Бур-сверло SDS+ 8х50х115 Bosch","EXR0527995","Z030200000","ШТ",1,104,104,"2017-12-31",null,0]
["LOC100417311","Веревка Vento Static 10 vnt 50010 100м","EX00862770","Z030200000","ШТ",1,12701.83,12701.83,"2018-12-03",null,0]
["LOC100417311","Веревка Vento Static 10 vnt 50010 100м","EX00866608","Z030200000","ШТ",1,12701.83,12701.83,"2018-12-03",null,0]
["LOC100646231","Вкладыши п/шум.3М 1110 беруши (пара)","EX01082380","Z030200000","ШТ",20,673,33.65,"2019-12-31",null,0]
["LOC100646231","Вкладыши п/шум.3М 1110 беруши (пара)","EX01223409","Z030200000","ШТ",18,710.05,39.450000000000003,"2020-12-31",null,0]
["LOC100417996","Вольтметр В7-53/1","EXR0527997","Z030200000","ШТ",1,206.42,206.42,"2017-12-31",null,0]
["LOC100418316","Газоанализатор Сигнал-4Э СО+СН4","EXR0527998","Z030200000","ШТ",1,12047.37,12047.37,"2017-12-31",null,0]
["LOC100720102","Газонокосилка Denzel GT-330 (триммер)","EX00857288","Z030200000","ШТ",1,5151,5151,"2018-12-14",null,0]
["LOC100720104","Грабли Palisad Luxe 61739 13 зуб.с черен","EX00857289","Z030200000","ШТ",1,335,335,"2018-12-14",null,0]
["LOC100733042","Дрель Интерскол Д-16/1050Р2 безударная","EX00857207","Z030200000","ШТ",1,4524,4524,"2018-12-29",null,0]
["LOC100420273","Жгут мед.кровоостан.резин.типа Эсмарха","EX01223410","Z030200000","ШТ",1,61.36,61.36,"2020-12-31",null,0]
["LOC100420356","Жилет сигнальный 44-46/2","ZSZ0004741","Z030200000","ШТ",1,400.18,400.18,"2017-12-31",null,0]
["LOC100420358","Жилет сигнальный 48-50/2","ZSZ0004742","Z030200000","ШТ",1,414.65,414.65,"2017-12-31",null,0]
["LOC100420359","Жилет сигнальный 48-50/3","ZSZ0004743","Z030200000","ШТ",1,220.51,220.51,"2017-12-31",null,0]
["LOC100420372","Жилет сигнальный 52-54/2","ZSZ0004744","Z030200000","ШТ",1,414.64,414.64,"2017-12-31",null,0]
["LOC100631825","Жилет сигнальный С-2.002 желтый 52-54/2","EX01122306","Z030200000","ШТ",1,244.16,244.16,"2020-05-29",null,0]
["LOC100773944","Знак без.P02/Запр.польз.отк.огн/пленка/V","EX01004876","Z030200000","ШТ",3,925,308.33,"2019-08-30",null,0]
["LOC100731046","Знак без.категория Гн 200х200мм","EX00854377","Z030200000","ШТ",3,165.26,55.09,"2018-12-04",null,0]
["LOC100422159","Индикатор ИНО-500 напряжения-отвертк","EXR0528001","Z030200000","ШТ",5,146.22,29.24,"2017-12-31",null,0]
["LOC100422159","Индикатор ИНО-500 напряжения-отвертк","EXR0528002","Z030200000","ШТ",1,15.07,15.07,"2017-12-31",null,0]
["LOC100422159","Индикатор ИНО-500 напряжения-отвертк","EXR0528003","Z030200000","ШТ",3,1568.07,522.69000000000005,"2017-12-31",null,0]
["LOC100422167","Индикатор напряж.ПИН90-2М","EXR0528004","Z030200000","ШТ",1,87.59,87.59,"2017-12-31",null,0]
["LOC100422167","Индикатор напряж.ПИН90-2М","EXR0528005","Z030200000","ШТ",1,87.58,87.58,"2017-12-31",null,{"$f":"J72*H72","v":0}]
["LOC100422815","Календарь настен.арт.7569","EX01235924","Z030200000","ШТ",2,472,236,"2021-01-29",2,472]
["LOC100422816","Календарь настольный 21,0х30 фото","EX01235925","Z030200000","ШТ",3,504,168,"2021-01-29",3,504]
["LOC100423207","Каска СОМЗ-55 Favorit 75514 оранжевая","ZSZ0004745","Z030200000","ШТ",1,136.32,136.32,"2017-12-31",1,136.32]
["LOC100646285","Каска СОМЗ-55 FavoriT Rapid 75717 белая","EX01161505","Z030200000","ШТ",2,561.36,280.68,"2020-08-31",null,0]
["LOC100646285","Каска СОМЗ-55 FavoriT Rapid 75717 белая","EX01258995","Z030200000","ШТ",1,280.68,280.68,"2021-04-30",null,0]
["LOC100646285","Каска СОМЗ-55 FavoriT Rapid 75717 белая","EX01302443","Z030200000","ШТ",2,571.52,285.76,"2021-09-30",null,0]
["LOC100423210","Каска СОМЗ-55 Favorit Визион 78217 белая","ZSZ0004746","Z030200000","ШТ",3,471.5,157.16999999999999,"2017-12-31",null,0]
["LOC100423482","Кисть Fit 01310 N18 (60мм) круглая","EX01004849","Z030200000","ШТ",2,227.86,113.93,"2019-08-30",null,0]
["LOC100423557","Кисть КФ50 флейцевая","EXR0528007","Z030200000","ШТ",5,230,46,"2017-12-31",null,0]
["LOC100423561","Кисть КФК10 филеночная","EXR0528008","Z030200000","ШТ",1,8.3000000000000007,8.3000000000000007,"2017-12-31",null,0]
["LOC100423818","Клещи Hanlong HT-500 д/обжима RJ-12","EXR0528009","Z030200000","ШТ",1,971.62,971.62,"2017-12-31",null,0]
["LOC100424097","Ковер диэлектрический 1-700х700","EXR0528010","Z030200000","ШТ",2,413.48,206.74,"2017-12-31",null,0]
["LOC100834024","Коммутатор Cisco WS-2950G-12-EI","EXR1062304","Z030200000","ШТ",1,8899,8899,null,null,0]
["LOC100834027","Коммутатор Cisco WS-C2950G-24-EI","EXR1062305","Z030200000","ШТ",1,8490,8490,null,null,0]
["LOC100424450","Коммутатор Cisco WS-C2960-24TT-L","EXR0528011","Z030200000","ШТ",1,28412.53,28412.53,"2017-12-31",null,0]
["LOC100646307","Коммутатор Eltex MES1124M AC","EX01018027","Z030200000","ШТ",1,14473.52,14473.52,"2019-09-30",null,0]
["LOC100424455","Коммутатор Eltex MES2308","EXR0528012","Z030200000","ШТ",1,14930.08,14930.08,"2017-12-31",null,0]
["LOC100424960","Компьютер Depo Neos 480SF i3_4350","ZIT0006153","Z030200000","ШТ",1,39374.51,39374.51,"2017-12-31",null,0]
["LOC100424961","Компьютер Depo Neos 480SF i3_6300","ZIT0006111","Z030200000","ШТ",1,21787.119999999999,21787.119999999999,"2017-12-31",null,0]
["LOC100424967","Компьютер HP ProDesk 600 G2 SFF T4J87EA","ZIT0006154","Z030200000","ШТ",1,39794.93,39794.93,"2017-12-31",null,0]
["LOC100834046","Компьютер Intel Pentium IV HT 3.00EGHz","EXR1062312","Z030200000","ШТ",1,150,150,null,null,0]
["LOC100834059","Кондиционер БК-2300","EXR1062306","Z030200000","ШТ",4,1000,250,null,null,0]
["LOC100834061","Контейнер д/аппаратуры КМЮА Меридиан","EXR1062314","Z030200000","КМП",1,5000,5000,null,null,0]
["LOC100427046","Кресло Chairman CH727 10-128 офисное","EX00790511","Z030200000","ШТ",1,7472.78,7472.78,"2018-10-11",null,0]
["LOC100427048","Кресло Chairman CH727 20-23 офисное","EX00850136","Z030200000","ШТ",1,3699.45,3699.45,"2018-11-20",null,0]
["LOC100815675","Кресло OLSS Гармония В-14 ткань черн.","EX01106229","Z030200000","ШТ",2,8423.56,4211.78,"2020-02-28",null,0]
["LOC100815676","Кресло OLSS Гелиос люкс кожзам.черн.","EX01106230","Z030200000","ШТ",1,6398.81,6398.81,"2020-02-28",null,0]
["LOC100427161","Кресло КТ2/118/3-С11 ткань","EXR0528013","Z030200000","ШТ",3,14.91,4.97,"2017-12-31",null,0]
["LOC100427167","Кресло КТ2/125-С8 конференц 3-мест.ткань","EXR0528609","Z030200000","ШТ",1,23.89,23.89,"2017-12-31",null,0]
["LOC100427210","Кресло КТ8/М-9/Т2 ткань","EXR0528014","Z030200000","ШТ",2,47.14,23.57,"2017-12-31",null,0]
["LOC100427548","Круглогубцы Зубр Эксперт 2201-8-16 160мм","EXR0528015","Z030200000","ШТ",2,290,145,"2017-12-31",null,0]
["LOC100834072","Лестница-стремян.Elkop ALW 403 3х56,5","EXR1062309","Z030200000","ШТ",1,126,126,null,null,{"$f":"J104*H104","v":0}]
["LOC100834073","Лестница-стремян.Elkop ALW 506 6х121","EXR1062310","Z030200000","ШТ",1,183,183,null,null,0]
["LOC100428678","Лом медный (кабель)","TA00028766","4150200000","Т",0.01,80.47,8047,"2021-09-30",null,0]
["LOC100428678","Лом медный (кабель)","TA00032369","4150200000","Т",3.0000000000000001E-3,18.5,6166.67,"2021-10-29",null,0]
["LOC100428704","Лопата ЛКО арт.1с491 с черенком","EX00898495","Z030200000","ШТ",1,186.69,186.69,"2019-03-20",null,0]
["LOC100720233","Лопата Сибртех 61458 410х315мм с/ч штык.","EX00857291","Z030200000","ШТ",1,181,181,"2018-12-14",null,0]
["LOC100720235","Лопата Сибртех 61596 430х370 с/ч снегоуб","EX00857292","Z030200000","ШТ",1,450,450,"2018-12-14",null,0]
["LOC100428792","Лоток канц.Стамм ЛТ203 Эксперт гориз.","EX01004878","Z030200000","ШТ",10,1321,132.1,"2019-08-30",null,0]
["LOC100429400","Маршрутизатор Eltex RG-34-Wac","EXR0528018","Z030200000","ШТ",1,3501.99,3501.99,"2017-12-31",null,0]
["LOC100828914","Мачта МАРТ-9 телескопич.алюм.","EXR1062307","Z030200000","ШТ",1,2640,2640,null,null,0]
["LOC100429875","Медиаконвертер NSGate NFG-W02L/A","EX00855995","Z030200000","ШТ",1,2065.25,2065.25,"2018-12-27",null,0]
["LOC100429876","Медиаконвертер NSGate NFG-W02L/B","EX00855996","Z030200000","ШТ",1,2765.25,2765.25,"2018-12-27",null,0]
["LOC100429877","Медиаконвертер NSGate NF-S0M","EXR0527543","Z030200000","ШТ",2,5910,2955,"2017-12-31",null,0]
["LOC100429973","Метла п/этилен.Гардена с черенком","EX01106231","Z030200000","ШТ",2,160.72,80.36,"2020-02-28",null,0]
["LOC100430064","Метчик 2621-3053 М5х0,5 пр с удл.хвост.","EXR0528020","Z030200000","ШТ",1,135.16,135.16,"2017-12-31",null,0]
["LOC100430065","Метчик 2621-3057 М6х1,0 пр с удл.хвост.","EXR0528021","Z030200000","ШТ",1,76.83,76.83,"2017-12-31",null,0]
["LOC100646430","Модем NSGate qBRIDGE-106R","EXR1061873","Z030200000","ШТ",2,8000,4000,null,null,0]
{"$rows_left_out":121}