{"text_format":"1","workbook":"xlsx","n_sheets":2,"sheets":["Заполнение","Выгрузка"],"not_rendered":{"charts":0,"images":0,"macros":1,"external_links":0,"defined_names":2,"comments":0,"pivot_tables":0},"unopened":[],"bounds":{"document_bytes":16777216,"sheet_cells":100000,"rows_first":2000,"rows_last":500,"rows_between":2000,"halvings":0,"cell_chars":16384,"cell_head_chars":4096},"cells_cut":0,"cells_raw":0,"read":"whole","date_system":"1900"}

{"sheet":"Заполнение","index":0,"n_rows":52,"n_cols":9,"rows_kept":52,"cut":false,"hidden":false,"merged":[[51,0,51,1],[0,0,0,3],[1,0,1,3],[3,4,3,5]]}
["Статистика по выписанным/обслуженным льготным рецептам, подписанным УКЭП за периуд"]
[" с 01.01.2022 по 24.01.2022."]
[]
[null,null,null,null,"РЕЗУЛЬТАТ ДОЛЖЕН БЫТЬ ТАКОЙ"]
[1,"ТОГБУЗ \"Бондарская ЦРБ\"",{"$f":"IFERROR(INDEX(Выгрузка!$N$4:$N$97,MATCH(B5&\", \",Выгрузка!$A$4:$A$97,0)),0)","v":52},{"$f":"IFERROR(INDEX(Выгрузка!$O$4:$O$97,MATCH(B5&\", \",Выгрузка!$A$4:$A$97,0)),0)","v":49},52,49,null,{"$f":"SUMIF(Выгрузка!$A$4:$A$100,\"*\"&$B5&\"*\",Выгрузка!N$4:N$100)","v":52},{"$f":"SUMIF(Выгрузка!$A$4:$A$100,\"*\"&$B5&\"*\",Выгрузка!O$4:O$100)","v":49}]
[2,"ТОГБУЗ \"Жердевская ЦРБ\"",{"$f":"IFERROR(INDEX(Выгрузка!$N$4:$N$97,MATCH(B6&\", \",Выгрузка!$A$4:$A$97,0)),0)","v":150},{"$f":"IFERROR(INDEX(Выгрузка!$O$4:$O$97,MATCH(B6&\", \",Выгрузка!$A$4:$A$97,0)),0)","v":82},150,82,null,{"$f":"SUMIF(Выгрузка!$A$4:$A$100,\"*\"&$B6&\"*\",Выгрузка!N$4:N$100)","v":150},{"$f":"SUMIF(Выгрузка!$A$4:$A$100,\"*\"&$B6&\"*\",Выгрузка!O$4:O$100)","v":82}]
[3,"ТОГБУЗ \"Знаменская ЦРБ\"",{"$f":"IFERROR(INDEX(Выгрузка!$N$4:$N$97,MATCH(B7&\", \",Выгрузка!$A$4:$A$97,0)),0)","v":80},{"$f":"IFERROR(INDEX(Выгрузка!$O$4:$O$97,MATCH(B7&\", \",Выгрузка!$A$4:$A$97,0)),0)","v":60},80,60,null,{"$f":"SUMIF(Выгрузка!$A$4:$A$100,\"*\"&$B7&\"*\",Выгрузка!N$4:N$100)","v":80},{"$f":"SUMIF(Выгрузка!$A$4:$A$100,\"*\"&$B7&\"*\",Выгрузка!O$4:O$100)","v":60}]
[4,"ТОГБУЗ \"Инжавинская ЦРБ\"",{"$f":"IFERROR(INDEX(Выгрузка!$N$4:$N$97,MATCH(B8&\", \",Выгрузка!$A$4:$A$97,0)),0)","v":211},{"$f":"IFERROR(INDEX(Выгрузка!$O$4:$O$97,MATCH(B8&\", \",Выгрузка!$A$4:$A$97,0)),0)","v":140},211,140,null,{"$f":"SUMIF(Выгрузка!$A$4:$A$100,\"*\"&$B8&\"*\",Выгрузка!N$4:N$100)","v":211},{"$f":"SUMIF(Выгрузка!$A$4:$A$100,\"*\"&$B8&\"*\",Выгрузка!O$4:O$100)","v":140}]
[5,"ТОГБУЗ \"Кирсановская ЦРБ\" (г.Кирсанов)",{"$f":"СумЦвет(Выгрузка!$N$4:$N$100,B9)","v":0},{"$f":"СумЦвет(Выгрузка!$O$4:$O$100,B9)","v":0},771,687,null,{"$f":"SUMIF(Выгрузка!$A$4:$A$100,\"*\"&$B9&\"*\",Выгрузка!N$4:N$100)","v":771},{"$f":"SUMIF(Выгрузка!$A$4:$A$100,\"*\"&$B9&\"*\",Выгрузка!O$4:O$100)","v":687}]
[6,"ТОГБУЗ \"Кирсановская ЦРБ\" (с.Гавриловка 2-я)",{"$f":"СумЦвет(Выгрузка!$N$4:$N$100,B10)","v":0},{"$f":"СумЦвет(Выгрузка!$O$4:$O$100,B10)","v":0},109,83,null,{"$f":"SUMIF(Выгрузка!$A$4:$A$100,\"*\"&$B10&\"*\",Выгрузка!N$4:N$100)","v":109},{"$f":"SUMIF(Выгрузка!$A$4:$A$100,\"*\"&$B10&\"*\",Выгрузка!O$4:O$100)","v":83}]
[7,"ТОГБУЗ \"ГБ им. С.С.Брюхоненко г. Мичуринска\"",{"$f":"IFERROR(INDEX(Выгрузка!$N$4:$N$97,MATCH(B11&\", \",Выгрузка!$A$4:$A$97,0)),0)","v":1228},{"$f":"IFERROR(INDEX(Выгрузка!$O$4:$O$97,MATCH(B11&\", \",Выгрузка!$A$4:$A$97,0)),0)","v":514},1228,514,null,{"$f":"SUMIF(Выгрузка!$A$4:$A$100,\"*\"&$B11&\"*\",Выгрузка!N$4:N$100)","v":1228},{"$f":"SUMIF(Выгрузка!$A$4:$A$100,\"*\"&$B11&\"*\",Выгрузка!O$4:O$100)","v":514}]
[8,"ТОГБУЗ \"Мичуринская ЦРБ\"",{"$f":"IFERROR(INDEX(Выгрузка!$N$4:$N$97,MATCH(B12&\", \",Выгрузка!$A$4:$A$97,0)),0)","v":521},{"$f":"IFERROR(INDEX(Выгрузка!$O$4:$O$97,MATCH(B12&\", \",Выгрузка!$A$4:$A$97,0)),0)","v":85},521,85,null,{"$f":"SUMIF(Выгрузка!$A$4:$A$100,\"*\"&$B12&\"*\",Выгрузка!N$4:N$100)","v":521},{"$f":"SUMIF(Выгрузка!$A$4:$A$100,\"*\"&$B12&\"*\",Выгрузка!O$4:O$100)","v":85}]
[9,"ТОГБУЗ \"Мордовская ЦРБ\"",{"$f":"IFERROR(INDEX(Выгрузка!$N$4:$N$97,MATCH(B13&\", \",Выгрузка!$A$4:$A$97,0)),0)","v":0},{"$f":"IFERROR(INDEX(Выгрузка!$O$4:$O$97,MATCH(B13&\", \",Выгрузка!$A$4:$A$97,0)),0)","v":0},0,0,null,{"$f":"SUMIF(Выгрузка!$A$4:$A$100,\"*\"&$B13&\"*\",Выгрузка!N$4:N$100)","v":0},{"$f":"SUMIF(Выгрузка!$A$4:$A$100,\"*\"&$B13&\"*\",Выгрузка!O$4:O$100)","v":0}]
[10,"ТОГБУЗ \"Моршанская ЦРБ\"",{"$f":"IFERROR(INDEX(Выгрузка!$N$4:$N$97,MATCH(B14&\", \",Выгрузка!$A$4:$A$97,0)),0)","v":435},{"$f":"IFERROR(INDEX(Выгрузка!$O$4:$O$97,MATCH(B14&\", \",Выгрузка!$A$4:$A$97,0)),0)","v":258},435,258,null,{"$f":"SUMIF(Выгрузка!$A$4:$A$100,\"*\"&$B14&\"*\",Выгрузка!N$4:N$100)","v":435},{"$f":"SUMIF(Выгрузка!$A$4:$A$100,\"*\"&$B14&\"*\",Выгрузка!O$4:O$100)","v":258}]
[11,"ТОГБУЗ \"Мучкапская ЦРБ им. ак. Кузина\"",{"$f":"IFERROR(INDEX(Выгрузка!$N$4:$N$97,MATCH(B15&\", \",Выгрузка!$A$4:$A$97,0)),0)","v":580},{"$f":"IFERROR(INDEX(Выгрузка!$O$4:$O$97,MATCH(B15&\", \",Выгрузка!$A$4:$A$97,0)),0)","v":482},580,482,null,{"$f":"SUMIF(Выгрузка!$A$4:$A$100,\"*\"&$B15&\"*\",Выгрузка!N$4:N$100)","v":580},{"$f":"SUMIF(Выгрузка!$A$4:$A$100,\"*\"&$B15&\"*\",Выгрузка!O$4:O$100)","v":482}]
[12,"ТОГБУЗ \"Никифоровская ЦРБ\"",{"$f":"IFERROR(INDEX(Выгрузка!$N$4:$N$97,MATCH(B16&\", \",Выгрузка!$A$4:$A$97,0)),0)","v":54},{"$f":"IFERROR(INDEX(Выгрузка!$O$4:$O$97,MATCH(B16&\", \",Выгрузка!$A$4:$A$97,0)),0)","v":37},54,37,null,{"$f":"SUMIF(Выгрузка!$A$4:$A$100,\"*\"&$B16&\"*\",Выгрузка!N$4:N$100)","v":54},{"$f":"SUMIF(Выгрузка!$A$4:$A$100,\"*\"&$B16&\"*\",Выгрузка!O$4:O$100)","v":37}]
[13,"ТОГБУЗ \"Первомайская ЦРБ\"",{"$f":"IFERROR(INDEX(Выгрузка!$N$4:$N$97,MATCH(B17&\", \",Выгрузка!$A$4:$A$97,0)),0)","v":165},{"$f":"IFERROR(INDEX(Выгрузка!$O$4:$O$97,MATCH(B17&\", \",Выгрузка!$A$4:$A$97,0)),0)","v":118},165,118,null,{"$f":"SUMIF(Выгрузка!$A$4:$A$100,\"*\"&$B17&\"*\",Выгрузка!N$4:N$100)","v":165},{"$f":"SUMIF(Выгрузка!$A$4:$A$100,\"*\"&$B17&\"*\",Выгрузка!O$4:O$100)","v":118}]
[14,"ТОГБУЗ \"Петровская ЦРБ\"",{"$f":"IFERROR(INDEX(Выгрузка!$N$4:$N$97,MATCH(B18&\", \",Выгрузка!$A$4:$A$97,0)),0)","v":720},{"$f":"IFERROR(INDEX(Выгрузка!$O$4:$O$97,MATCH(B18&\", \",Выгрузка!$A$4:$A$97,0)),0)","v":469},720,469,null,{"$f":"SUMIF(Выгрузка!$A$4:$A$100,\"*\"&$B18&\"*\",Выгрузка!N$4:N$100)","v":720},{"$f":"SUMIF(Выгрузка!$A$4:$A$100,\"*\"&$B18&\"*\",Выгрузка!O$4:O$100)","v":469}]
[15,"ТОГБУЗ \"Пичаевская ЦРБ\"",{"$f":"IFERROR(INDEX(Выгрузка!$N$4:$N$97,MATCH(B19&\", \",Выгрузка!$A$4:$A$97,0)),0)","v":492},{"$f":"IFERROR(INDEX(Выгрузка!$O$4:$O$97,MATCH(B19&\", \",Выгрузка!$A$4:$A$97,0)),0)","v":246},492,246,null,{"$f":"SUMIF(Выгрузка!$A$4:$A$100,\"*\"&$B19&\"*\",Выгрузка!N$4:N$100)","v":492},{"$f":"SUMIF(Выгрузка!$A$4:$A$100,\"*\"&$B19&\"*\",Выгрузка!O$4:O$100)","v":246}]
[16,"ТОГБУЗ \"Рассказовская ЦРБ\"",{"$f":"СумЦвет(Выгрузка!$N$4:$N$100,B20)","v":0},{"$f":"СумЦвет(Выгрузка!$O$4:$O$100,B20)","v":0},1259,920,null,{"$f":"SUMIF(Выгрузка!$A$4:$A$100,\"*\"&$B20&\"*\",Выгрузка!N$4:N$100)","v":1259},{"$f":"SUMIF(Выгрузка!$A$4:$A$100,\"*\"&$B20&\"*\",Выгрузка!O$4:O$100)","v":920}]
[17,"ТОГБУЗ \"Ржаксинская ЦРБ\"",{"$f":"IFERROR(INDEX(Выгрузка!$N$4:$N$97,MATCH(B21&\", \",Выгрузка!$A$4:$A$97,0)),0)","v":0},{"$f":"IFERROR(INDEX(Выгрузка!$O$4:$O$97,MATCH(B21&\", \",Выгрузка!$A$4:$A$97,0)),0)","v":0},0,0,null,{"$f":"SUMIF(Выгрузка!$A$4:$A$100,\"*\"&$B21&\"*\",Выгрузка!N$4:N$100)","v":0},{"$f":"SUMIF(Выгрузка!$A$4:$A$100,\"*\"&$B21&\"*\",Выгрузка!O$4:O$100)","v":0}]
[18,"ТОГБУЗ \"Сампурская ЦРБ\"",{"$f":"IFERROR(INDEX(Выгрузка!$N$4:$N$97,MATCH(B22&\", \",Выгрузка!$A$4:$A$97,0)),0)","v":34},{"$f":"IFERROR(INDEX(Выгрузка!$O$4:$O$97,MATCH(B22&\", \",Выгрузка!$A$4:$A$97,0)),0)","v":27},34,27,null,{"$f":"SUMIF(Выгрузка!$A$4:$A$100,\"*\"&$B22&\"*\",Выгрузка!N$4:N$100)","v":34},{"$f":"SUMIF(Выгрузка!$A$4:$A$100,\"*\"&$B22&\"*\",Выгрузка!O$4:O$100)","v":27}]
[19,"ТОГБУЗ \"Сосновская ЦРБ\"",{"$f":"IFERROR(INDEX(Выгрузка!$N$4:$N$97,MATCH(B23&\", \",Выгрузка!$A$4:$A$97,0)),0)","v":341},{"$f":"IFERROR(INDEX(Выгрузка!$O$4:$O$97,MATCH(B23&\", \",Выгрузка!$A$4:$A$97,0)),0)","v":249},341,249,null,{"$f":"SUMIF(Выгрузка!$A$4:$A$100,\"*\"&$B23&\"*\",Выгрузка!N$4:N$100)","v":341},{"$f":"SUMIF(Выгрузка!$A$4:$A$100,\"*\"&$B23&\"*\",Выгрузка!O$4:O$100)","v":249}]
[20,"ТОГБУЗ \"Староюрьевская ЦРБ\"",{"$f":"IFERROR(INDEX(Выгрузка!$N$4:$N$97,MATCH(B24&\", \",Выгрузка!$A$4:$A$97,0)),0)","v":16},{"$f":"IFERROR(INDEX(Выгрузка!$O$4:$O$97,MATCH(B24&\", \",Выгрузка!$A$4:$A$97,0)),0)","v":14},16,14,null,{"$f":"SUMIF(Выгрузка!$A$4:$A$100,\"*\"&$B24&\"*\",Выгрузка!N$4:N$100)","v":16},{"$f":"SUMIF(Выгрузка!$A$4:$A$100,\"*\"&$B24&\"*\",Выгрузка!O$4:O$100)","v":14}]
[21,"ТОГБУЗ \"Тамбовская ЦРБ\"",{"$f":"IFERROR(INDEX(Выгрузка!$N$4:$N$97,MATCH(B25&\", \",Выгрузка!$A$4:$A$97,0)),0)","v":88},{"$f":"IFERROR(INDEX(Выгрузка!$O$4:$O$97,MATCH(B25&\", \",Выгрузка!$A$4:$A$97,0)),0)","v":70},88,70,null,{"$f":"SUMIF(Выгрузка!$A$4:$A$100,\"*\"&$B25&\"*\",Выгрузка!N$4:N$100)","v":88},{"$f":"SUMIF(Выгрузка!$A$4:$A$100,\"*\"&$B25&\"*\",Выгрузка!O$4:O$100)","v":70}]
[22,"ТОГБУЗ \"Токаревская ЦРБ\"",{"$f":"IFERROR(INDEX(Выгрузка!$N$4:$N$97,MATCH(B26&\", \",Выгрузка!$A$4:$A$97,0)),0)","v":43},{"$f":"IFERROR(INDEX(Выгрузка!$O$4:$O$97,MATCH(B26&\", \",Выгрузка!$A$4:$A$97,0)),0)","v":0},43,0,null,{"$f":"SUMIF(Выгрузка!$A$4:$A$100,\"*\"&$B26&\"*\",Выгрузка!N$4:N$100)","v":43},{"$f":"SUMIF(Выгрузка!$A$4:$A$100,\"*\"&$B26&\"*\",Выгрузка!O$4:O$100)","v":0}]
[23,"ТОГБУЗ \"Уваровская ЦРБ\"",{"$f":"СумЦвет(Выгрузка!$N$4:$N$100,B27)","v":0},{"$f":"СумЦвет(Выгрузка!$O$4:$O$100,B27)","v":0},594,138,null,{"$f":"SUMIF(Выгрузка!$A$4:$A$100,\"*\"&$B27&\"*\",Выгрузка!N$4:N$100)","v":594},{"$f":"SUMIF(Выгрузка!$A$4:$A$100,\"*\"&$B27&\"*\",Выгрузка!O$4:O$100)","v":138}]
[24,"ТОГБУЗ \"Уметская ЦРБ\"",{"$f":"IFERROR(INDEX(Выгрузка!$N$4:$N$97,MATCH(B28&\", \",Выгрузка!$A$4:$A$97,0)),0)","v":128},{"$f":"IFERROR(INDEX(Выгрузка!$O$4:$O$97,MATCH(B28&\", \",Выгрузка!$A$4:$A$97,0)),0)","v":108},128,108,null,{"$f":"SUMIF(Выгрузка!$A$4:$A$100,\"*\"&$B28&\"*\",Выгрузка!N$4:N$100)","v":128},{"$f":"SUMIF(Выгрузка!$A$4:$A$100,\"*\"&$B28&\"*\",Выгрузка!O$4:O$100)","v":108}]
[25,"ТОГБУЗ \"ГКБ им.Арх. Луки г. Тамбова\"",{"$f":"IFERROR(INDEX(Выгрузка!$N$4:$N$97,MATCH(B29&\", \",Выгрузка!$A$4:$A$97,0)),0)","v":36},{"$f":"IFERROR(INDEX(Выгрузка!$O$4:$O$97,MATCH(B29&\", \",Выгрузка!$A$4:$A$97,0)),0)","v":24},36,24,null,{"$f":"SUMIF(Выгрузка!$A$4:$A$100,\"*\"&$B29&\"*\",Выгрузка!N$4:N$100)","v":36},{"$f":"SUMIF(Выгрузка!$A$4:$A$100,\"*\"&$B29&\"*\",Выгрузка!O$4:O$100)","v":24}]
[26,"ТОГБУЗ \"ГКБ им.Арх. Луки г. Тамбова\" Поликлиника №1",{"$f":"IFERROR(INDEX(Выгрузка!$N$4:$N$97,MATCH(B30&\", \",Выгрузка!$A$4:$A$97,0)),0)","v":0},{"$f":"IFERROR(INDEX(Выгрузка!$O$4:$O$97,MATCH(B30&\", \",Выгрузка!$A$4:$A$97,0)),0)","v":0},0,0,null,{"$f":"SUMIF(Выгрузка!$A$4:$A$100,\"*\"&$B30&\"*\",Выгрузка!N$4:N$100)","v":0},{"$f":"SUMIF(Выгрузка!$A$4:$A$100,\"*\"&$B30&\"*\",Выгрузка!O$4:O$100)","v":0}]
[27,"ТОГБУЗ \"ГКБ им.Арх. Луки г. Тамбова\" детская поликлиника №1",{"$f":"IFERROR(INDEX(Выгрузка!$N$4:$N$97,MATCH(B31&\", \",Выгрузка!$A$4:$A$97,0)),0)","v":0},{"$f":"IFERROR(INDEX(Выгрузка!$O$4:$O$97,MATCH(B31&\", \",Выгрузка!$A$4:$A$97,0)),0)","v":0},0,0,null,{"$f":"SUMIF(Выгрузка!$A$4:$A$100,\"*\"&$B31&\"*\",Выгрузка!N$4:N$100)","v":0},{"$f":"SUMIF(Выгрузка!$A$4:$A$100,\"*\"&$B31&\"*\",Выгрузка!O$4:O$100)","v":0}]
[28,"ТОГБУЗ \"ГКБ №3 им. И.С. Долгушина г. Тамбова\" (Никифоровская, 38)",{"$f":"IFERROR(INDEX(Выгрузка!$N$4:$N$97,MATCH(B32&\", \",Выгрузка!$A$4:$A$97,0)),0)","v":746},{"$f":"IFERROR(INDEX(Выгрузка!$O$4:$O$97,MATCH(B32&\", \",Выгрузка!$A$4:$A$97,0)),0)","v":548},746,548,null,{"$f":"SUMIF(Выгрузка!$A$4:$A$100,\"*\"&$B32&\"*\",Выгрузка!N$4:N$100)","v":746},{"$f":"SUMIF(Выгрузка!$A$4:$A$100,\"*\"&$B32&\"*\",Выгрузка!O$4:O$100)","v":548}]
[29,"ТОГБУЗ \"ГКБ №3 им. И.С. Долгушина г. Тамбова\" (Советская, 194)",{"$f":"IFERROR(INDEX(Выгрузка!$N$4:$N$97,MATCH(B33&\", \",Выгрузка!$A$4:$A$97,0)),0)","v":493},{"$f":"IFERROR(INDEX(Выгрузка!$O$4:$O$97,MATCH(B33&\", \",Выгрузка!$A$4:$A$97,0)),0)","v":218},493,218,null,{"$f":"SUMIF(Выгрузка!$A$4:$A$100,\"*\"&$B33&\"*\",Выгрузка!N$4:N$100)","v":493},{"$f":"SUMIF(Выгрузка!$A$4:$A$100,\"*\"&$B33&\"*\",Выгрузка!O$4:O$100)","v":218}]
[30,"ТОГБУЗ \"ГКБ №4 г. Тамбова\"",{"$f":"IFERROR(INDEX(Выгрузка!$N$4:$N$97,MATCH(B34&\", \",Выгрузка!$A$4:$A$97,0)),0)","v":1273},{"$f":"IFERROR(INDEX(Выгрузка!$O$4:$O$97,MATCH(B34&\", \",Выгрузка!$A$4:$A$97,0)),0)","v":633},1273,633,null,{"$f":"SUMIF(Выгрузка!$A$4:$A$100,\"*\"&$B34&\"*\",Выгрузка!N$4:N$100)","v":1273},{"$f":"SUMIF(Выгрузка!$A$4:$A$100,\"*\"&$B34&\"*\",Выгрузка!O$4:O$100)","v":633}]
[31,"ТОГБУЗ \"Городская поликлиника №5 г. Тамбова\"",{"$f":"СумЦвет(Выгрузка!$N$4:$N$100,B35)","v":0},{"$f":"СумЦвет(Выгрузка!$O$4:$O$100,B35)","v":0},1316,874,null,{"$f":"SUMIF(Выгрузка!$A$4:$A$100,\"*\"&$B35&\"*\",Выгрузка!N$4:N$100)","v":1316},{"$f":"SUMIF(Выгрузка!$A$4:$A$100,\"*\"&$B35&\"*\",Выгрузка!O$4:O$100)","v":874}]
[32,"ЧУЗ \"РЖД-Медицина\" Поликлиника №3 г.Тамбов\"",{"$f":"IFERROR(INDEX(Выгрузка!$N$4:$N$97,MATCH(B36&\", \",Выгрузка!$A$4:$A$97,0)),0)","v":44},{"$f":"IFERROR(INDEX(Выгрузка!$O$4:$O$97,MATCH(B36&\", \",Выгрузка!$A$4:$A$97,0)),0)","v":3},44,3,null,{"$f":"SUMIF(Выгрузка!$A$4:$A$100,\"*\"&$B36&\"*\",Выгрузка!N$4:N$100)","v":44},{"$f":"SUMIF(Выгрузка!$A$4:$A$100,\"*\"&$B36&\"*\",Выгрузка!O$4:O$100)","v":3}]
[33,"ОГБУЗ \"Тамбовская офтальмологическая больница\"",{"$f":"IFERROR(INDEX(Выгрузка!$N$4:$N$97,MATCH(B37&\", \",Выгрузка!$A$4:$A$97,0)),0)","v":1},{"$f":"IFERROR(INDEX(Выгрузка!$O$4:$O$97,MATCH(B37&\", \",Выгрузка!$A$4:$A$97,0)),0)","v":1},1,1,null,{"$f":"SUMIF(Выгрузка!$A$4:$A$100,\"*\"&$B37&\"*\",Выгрузка!N$4:N$100)","v":1},{"$f":"SUMIF(Выгрузка!$A$4:$A$100,\"*\"&$B37&\"*\",Выгрузка!O$4:O$100)","v":1}]
[34,"ТОГБУЗ \"Городская клиническая больница г.Котовска\"",{"$f":"IFERROR(INDEX(Выгрузка!$N$4:$N$97,MATCH(B38&\", \",Выгрузка!$A$4:$A$97,0)),0)","v":1262},{"$f":"IFERROR(INDEX(Выгрузка!$O$4:$O$97,MATCH(B38&\", \",Выгрузка!$A$4:$A$97,0)),0)","v":971},1262,971,null,{"$f":"SUMIF(Выгрузка!$A$4:$A$100,\"*\"&$B38&\"*\",Выгрузка!N$4:N$100)","v":1262},{"$f":"SUMIF(Выгрузка!$A$4:$A$100,\"*\"&$B38&\"*\",Выгрузка!O$4:O$100)","v":971}]
[35,"ТОГБУЗ \"ГБ №2 г. Мичуринска\"",{"$f":"IFERROR(INDEX(Выгрузка!$N$4:$N$97,MATCH(B39&\", \",Выгрузка!$A$4:$A$97,0)),0)","v":121},{"$f":"IFERROR(INDEX(Выгрузка!$O$4:$O$97,MATCH(B39&\", \",Выгрузка!$A$4:$A$97,0)),0)","v":4},121,4,null,{"$f":"SUMIF(Выгрузка!$A$4:$A$100,\"*\"&$B39&\"*\",Выгрузка!N$4:N$100)","v":121},{"$f":"SUMIF(Выгрузка!$A$4:$A$100,\"*\"&$B39&\"*\",Выгрузка!O$4:O$100)","v":4}]
[36,"ЧУЗ \"РЖД-Медицина\" г.Мичуринск\"",{"$f":"IFERROR(INDEX(Выгрузка!$N$4:$N$97,MATCH(B40&\", \",Выгрузка!$A$4:$A$97,0)),0)","v":131},{"$f":"IFERROR(INDEX(Выгрузка!$O$4:$O$97,MATCH(B40&\", \",Выгрузка!$A$4:$A$97,0)),0)","v":8},131,8,null,{"$f":"SUMIF(Выгрузка!$A$4:$A$100,\"*\"&$B40&\"*\",Выгрузка!N$4:N$100)","v":131},{"$f":"SUMIF(Выгрузка!$A$4:$A$100,\"*\"&$B40&\"*\",Выгрузка!O$4:O$100)","v":8}]
[37,"ТОГБУЗ \"ГДП им. В.Коваля г. Тамбова\"",{"$f":"IFERROR(INDEX(Выгрузка!$N$4:$N$97,MATCH(B41&\", \",Выгрузка!$A$4:$A$97,0)),0)","v":70},{"$f":"IFERROR(INDEX(Выгрузка!$O$4:$O$97,MATCH(B41&\", \",Выгрузка!$A$4:$A$97,0)),0)","v":64},70,64,null,{"$f":"SUMIF(Выгрузка!$A$4:$A$100,\"*\"&$B41&\"*\",Выгрузка!N$4:N$100)","v":70},{"$f":"SUMIF(Выгрузка!$A$4:$A$100,\"*\"&$B41&\"*\",Выгрузка!O$4:O$100)","v":64}]
[38,"ГБУЗ \"ТОГВВ\"",{"$f":"IFERROR(INDEX(Выгрузка!$N$4:$N$97,MATCH(B42&\", \",Выгрузка!$A$4:$A$97,0)),0)","v":29},{"$f":"IFERROR(INDEX(Выгрузка!$O$4:$O$97,MATCH(B42&\", \",Выгрузка!$A$4:$A$97,0)),0)","v":25},29,25,null,{"$f":"SUMIF(Выгрузка!$A$4:$A$100,\"*\"&$B42&\"*\",Выгрузка!N$4:N$100)","v":29},{"$f":"SUMIF(Выгрузка!$A$4:$A$100,\"*\"&$B42&\"*\",Выгрузка!O$4:O$100)","v":25}]
[39,"ГБУЗ \"ТОКБ им. В.Д. Бабенко\"",{"$f":"IFERROR(INDEX(Выгрузка!$N$4:$N$97,MATCH(B43&\", \",Выгрузка!$A$4:$A$97,0)),0)","v":113},{"$f":"IFERROR(INDEX(Выгрузка!$O$4:$O$97,MATCH(B43&\", \",Выгрузка!$A$4:$A$97,0)),0)","v":26},113,26,null,{"$f":"SUMIF(Выгрузка!$A$4:$A$100,\"*\"&$B43&\"*\",Выгрузка!N$4:N$100)","v":113},{"$f":"SUMIF(Выгрузка!$A$4:$A$100,\"*\"&$B43&\"*\",Выгрузка!O$4:O$100)","v":26}]
[40,"ГБУЗ \"ТОДКБ\"",{"$f":"IFERROR(INDEX(Выгрузка!$N$4:$N$97,MATCH(B44&\", \",Выгрузка!$A$4:$A$97,0)),0)","v":126},{"$f":"IFERROR(INDEX(Выгрузка!$O$4:$O$97,MATCH(B44&\", \",Выгрузка!$A$4:$A$97,0)),0)","v":99},126,99,null,{"$f":"SUMIF(Выгрузка!$A$4:$A$100,\"*\"&$B44&\"*\",Выгрузка!N$4:N$100)","v":126},{"$f":"SUMIF(Выгрузка!$A$4:$A$100,\"*\"&$B44&\"*\",Выгрузка!O$4:O$100)","v":99}]
[41,"ГБУЗ \"ТООКД\"",{"$f":"IFERROR(INDEX(Выгрузка!$N$4:$N$97,MATCH(B45&\", \",Выгрузка!$A$4:$A$97,0)),0)","v":60},{"$f":"IFERROR(INDEX(Выгрузка!$O$4:$O$97,MATCH(B45&\", \",Выгрузка!$A$4:$A$97,0)),0)","v":45},60,45,null,{"$f":"SUMIF(Выгрузка!$A$4:$A$100,\"*\"&$B45&\"*\",Выгрузка!N$4:N$100)","v":60},{"$f":"SUMIF(Выгрузка!$A$4:$A$100,\"*\"&$B45&\"*\",Выгрузка!O$4:O$100)","v":45}]
[42,"ОГБУЗ \"Тамбовская инфекционная клиническая больница\"",{"$f":"СумЦвет(Выгрузка!$N$4:$N$100,B46)","v":0},{"$f":"СумЦвет(Выгрузка!$O$4:$O$100,B46)","v":0},16,14,null,{"$f":"SUMIF(Выгрузка!$A$4:$A$100,\"*\"&$B46&\"*\",Выгрузка!N$4:N$100)","v":16},{"$f":"SUMIF(Выгрузка!$A$4:$A$100,\"*\"&$B46&\"*\",Выгрузка!O$4:O$100)","v":14}]
[43,"ГУЗ \"ТОКВКД\"",{"$f":"IFERROR(INDEX(Выгрузка!$N$4:$N$97,MATCH(B47&\", \",Выгрузка!$A$4:$A$97,0)),0)","v":4},{"$f":"IFERROR(INDEX(Выгрузка!$O$4:$O$97,MATCH(B47&\", \",Выгрузка!$A$4:$A$97,0)),0)","v":4},4,4,null,{"$f":"SUMIF(Выгрузка!$A$4:$A$100,\"*\"&$B47&\"*\",Выгрузка!N$4:N$100)","v":4},{"$f":"SUMIF(Выгрузка!$A$4:$A$100,\"*\"&$B47&\"*\",Выгрузка!O$4:O$100)","v":4}]
[44,"ГБУЗ \"ТОКПД\"",{"$f":"СумЦвет(Выгрузка!$N$4:$N$100,B48)","v":0},{"$f":"СумЦвет(Выгрузка!$O$4:$O$100,B48)","v":0},27,25,null,{"$f":"SUMIF(Выгрузка!$A$4:$A$100,\"*\"&$B48&\"*\",Выгрузка!N$4:N$100)","v":27},{"$f":"SUMIF(Выгрузка!$A$4:$A$100,\"*\"&$B48&\"*\",Выгрузка!O$4:O$100)","v":25}]
[45,"ОГБУЗ \"Тамбовская психиатрическая клиническая больница\"",{"$f":"IFERROR(INDEX(Выгрузка!$N$4:$N$97,MATCH(B49&\", \",Выгрузка!$A$4:$A$97,0)),0)","v":109},{"$f":"IFERROR(INDEX(Выгрузка!$O$4:$O$97,MATCH(B49&\", \",Выгрузка!$A$4:$A$97,0)),0)","v":88},109,88,null,{"$f":"SUMIF(Выгрузка!$A$4:$A$100,\"*\"&$B49&\"*\",Выгрузка!N$4:N$100)","v":109},{"$f":"SUMIF(Выгрузка!$A$4:$A$100,\"*\"&$B49&\"*\",Выгрузка!O$4:O$100)","v":88}]
[46,"ТОГБУЗ \"Мичуринская психиатрическая больница\"",{"$f":"IFERROR(INDEX(Выгрузка!$N$4:$N$97,MATCH(B50&\", \",Выгрузка!$A$4:$A$97,0)),0)","v":87},{"$f":"IFERROR(INDEX(Выгрузка!$O$4:$O$97,MATCH(B50&\", \",Выгрузка!$A$4:$A$97,0)),0)","v":31},87,31,null,{"$f":"SUMIF(Выгрузка!$A$4:$A$100,\"*\"&$B50&\"*\",Выгрузка!N$4:N$100)","v":87},{"$f":"SUMIF(Выгрузка!$A$4:$A$100,\"*\"&$B50&\"*\",Выгрузка!O$4:O$100)","v":31}]
[47,"ФГУЗ \"МСЧ УВД Тамбовской области\"",{"$f":"IFERROR(INDEX(Выгрузка!$N$4:$N$97,MATCH(B51&\", \",Выгрузка!$A$4:$A$97,0)),0)","v":16},{"$f":"IFERROR(INDEX(Выгрузка!$O$4:$O$97,MATCH(B51&\", \",Выгрузка!$A$4:$A$97,0)),0)","v":12},16,12,null,{"$f":"SUMIF(Выгрузка!$A$4:$A$100,\"*\"&$B51&\"*\",Выгрузка!N$4:N$100)","v":16},{"$f":"SUMIF(Выгрузка!$A$4:$A$100,\"*\"&$B51&\"*\",Выгрузка!O$4:O$100)","v":12}]
["Итого:",null,{"$f":"SUM(C5:C51)","v":10059},{"$f":"SUM(D5:D51)","v":5812},{"$f":"SUM(E5:E51)","v":14151},{"$f":"SUM(F5:F51)","v":8553},null,{"$f":"SUM(H5:H51)","v":14151},{"$f":"SUM(I5:I51)","v":8553}]

{"sheet":"Выгрузка","index":1,"n_rows":100,"n_cols":15,"rows_kept":100,"cut":false,"hidden":false,"merged":[[1,10,1,12],[1,1,1,3],[1,4,1,6],[1,7,1,9]]}
[]
[]
[null,null,null,null,null,null,null,null,null,null,null,null,null,{"$f":"SUM(N4:N100)","v":14151},{"$f":"SUM(O4:O100)","v":8553}]
["[1026801118563] ТОГБУЗ \"Рассказовская ЦРБ\", ",null,null,null,null,null,null,108,71,2,134,85,1,{"$f":"B4+E4+H4+K4","v":242},{"$f":"C4+F4+I4+L4","v":156}]
["[1026801225417] ОГБУЗ \"Тамбовская инфекционная клиническая больница\", ",null,null,null,null,null,null,4,4,null,12,10,null,{"$f":"B5+E5+H5+K5","v":16},14]
["[1026801226407] ТОГБУЗ \"Городская поликлиника №5 г. Тамбова\", ",null,null,null,null,null,null,659,472,null,657,402,null,1316,874]
["ГБУЗ \"ТОГВВ\", ",null,null,null,null,null,null,2,2,null,27,23,null,29,25]
["ГБУЗ \"ТОДКБ\", ",33,23,null,null,null,null,44,40,null,49,36,null,126,99]
["ГБУЗ \"ТОКБ им. В.Д. Бабенко\", ",107,25,null,null,null,null,5,1,null,1,null,null,113,26]
["ГБУЗ \"ТОКПД\", ",null,null,null,null,null,null,20,20,null,null,null,null,20,20]
["ГБУЗ \"ТООКД\", ",10,8,null,null,null,null,28,23,null,22,14,null,60,45]
["ГУЗ \"ТОКВКД\", ",null,null,null,null,null,null,null,null,null,4,4,null,4,4]
["МИЧУРИНСКИЙ ФИЛИАЛ ГБУЗ \"ТОКПД\", МИЧУРИНСКИЙ ФИЛИАЛ ГБУЗ \"ТОКПД\"",null,null,null,null,null,null,7,5,null,null,null,null,7,5]
["ОГБУЗ \"Тамбовская офтальмологическая больница\", ",1,1,null,null,null,null,null,null,null,null,null,null,1,1]
["ОГБУЗ \"Тамбовская психиатрическая клиническая больница\", ",null,null,null,null,null,null,40,28,null,69,60,null,109,88]
["ТОГБУЗ \"Бондарская ЦРБ\", ",null,null,null,null,null,null,18,15,null,34,34,null,52,49]
["ТОГБУЗ \"ГБ №2 г. Мичуринска\", ",null,null,null,94,null,null,8,1,null,19,3,null,121,4]
["ТОГБУЗ \"ГБ им. С.С.Брюхоненко г. Мичуринска\", ",6,null,null,null,null,null,665,201,null,557,313,null,1228,514]
["ТОГБУЗ \"ГДП им. В.Коваля г. Тамбова\", ",null,null,null,null,null,null,34,33,null,36,31,null,70,64]
["ТОГБУЗ \"ГКБ №3 им. И.С. Долгушина г. Тамбова\" (Никифоровская, 38), ",null,null,null,null,null,null,291,236,null,455,312,null,746,548]
["ТОГБУЗ \"ГКБ №3 им. И.С. Долгушина г. Тамбова\" (Советская, 194), ",null,null,null,null,null,null,333,170,null,160,48,null,493,218]
["ТОГБУЗ \"ГКБ №4 г. Тамбова\", ",null,null,null,null,null,null,538,276,null,735,357,null,1273,633]
["ТОГБУЗ \"ГКБ им.Арх. Луки г. Тамбова\", ",null,null,null,null,null,null,8,6,null,28,18,null,36,24]
["ТОГБУЗ \"Городская клиническая больница г.Котовска\", ",2,null,null,133,99,null,606,479,null,521,393,null,1262,971]
["ТОГБУЗ \"Жердевская ЦРБ\", ",null,null,null,6,4,null,77,36,null,67,42,null,150,82]
["ТОГБУЗ \"Знаменская ЦРБ\", ",null,null,null,null,null,null,59,43,null,21,17,null,80,60]
["ТОГБУЗ \"Инжавинская ЦРБ\", ",1,null,null,36,16,null,120,89,null,54,35,null,211,140]
["ТОГБУЗ \"Кирсановская ЦРБ\" (г.Кирсанов), ",null,null,null,176,132,null,454,426,null,141,129,null,771,687]
["ТОГБУЗ \"Кирсановская ЦРБ\" (с.Гавриловка 2-я), ",null,null,null,9,8,null,25,19,null,75,56,null,109,83]
["ТОГБУЗ \"Мичуринская психиатрическая больница\", ",null,null,null,null,null,null,36,11,null,51,20,null,87,31]
["ТОГБУЗ \"Мичуринская ЦРБ\", ",null,null,null,null,null,null,297,57,null,224,28,null,521,85]
["ТОГБУЗ \"Моршанская ЦРБ\", ",null,null,null,168,118,null,105,58,null,162,82,null,435,258]
["ТОГБУЗ \"Мучкапская ЦРБ им. ак. Кузина\", ",null,null,null,93,87,null,262,228,null,225,167,null,580,482]
["ТОГБУЗ \"Никифоровская ЦРБ\", ",null,null,null,null,null,null,28,19,null,26,18,null,54,37]
["ТОГБУЗ \"Первомайская ЦРБ\", ",null,null,null,null,null,null,110,85,null,55,33,null,165,118]
["ТОГБУЗ \"Петровская ЦРБ\", ",null,null,null,206,177,null,275,147,null,239,145,null,{"$f":"B36+E36+H36+K36","v":720},{"$f":"C36+F36+I36+L36","v":469}]
["ТОГБУЗ \"Пичаевская ЦРБ\", ",1,1,null,null,null,null,245,127,null,246,118,null,492,246]
["ТОГБУЗ \"Рассказовская ЦРБ\", ",2,null,null,null,null,null,605,515,null,410,249,null,1017,764]
["ТОГБУЗ \"Сампурская ЦРБ\", ",null,null,null,null,null,null,18,13,null,16,14,null,34,27]
["ТОГБУЗ \"Сосновская ЦРБ\", ",null,null,null,null,null,null,185,148,null,156,101,null,341,249]
["ТОГБУЗ \"Староюрьевская ЦРБ\", ",null,null,null,null,null,null,8,6,null,8,8,null,16,14]
["ТОГБУЗ \"Тамбовская ЦРБ\", ",null,null,null,8,7,null,59,55,null,21,8,null,88,70]
["ТОГБУЗ \"Токаревская ЦРБ\", ",null,null,null,null,null,null,9,null,null,34,null,null,43,0]
["ТОГБУЗ \"Уваровская ЦРБ\", ",null,null,null,35,3,null,159,45,null,400,90,null,594,138]
["ТОГБУЗ \"Уметская ЦРБ\", ",null,null,null,null,null,null,91,76,null,37,32,null,128,108]
["ФГУЗ \"МСЧ УВД Тамбовской области\", ",null,null,null,null,null,null,8,4,null,8,8,null,16,12]
["ЧУЗ \"РЖД-Медицина\" г.Мичуринск\", ",null,null,null,null,null,null,66,8,null,65,null,null,131,8]
["ЧУЗ \"РЖД-Медицина\" Поликлиника №3 г.Тамбов\", ",null,null,null,null,null,null,10,2,null,34,1,null,44,3]
[null,null,null,null,null,null,null,null,null,null,null,null,null,0,0]
[null,null,null,null,null,null,null,null,null,null,null,null,null,0,0]
[null,null,null,null,null,null,null,null,null,null,null,null,null,0,0]
[null,null,null,null,null,null,null,null,null,null,null,null,null,0,0]
[null,null,null,null,null,null,null,null,null,null,null,null,null,0,0]
[null,null,null,null,null,null,null,null,null,null,null,null,null,0,0]
[null,null,null,null,null,null,null,null,null,null,null,null,null,0,0]
[null,null,null,null,null,null,null,null,null,null,null,null,null,0,0]
[null,null,null,null,null,null,null,null,null,null,null,null,null,0,0]
[null,null,null,null,null,null,null,null,null,null,null,null,null,0,0]
[null,null,null,null,null,null,null,null,null,null,null,null,null,0,0]
[null,null,null,null,null,null,null,null,null,null,null,null,null,0,0]
{"$rows_left_out":40}