{"text_format":"1","workbook":"xlsx","n_sheets":4,"sheets":["p1","p2","p3","p4"],"not_rendered":{"charts":23,"images":0,"macros":0,"external_links":0,"defined_names":2,"comments":0,"pivot_tables":0},"unopened":[],"bounds":{"document_bytes":16777216,"sheet_cells":100000,"rows_first":2000,"rows_last":500,"rows_between":2000,"halvings":0,"cell_chars":16384,"cell_head_chars":4096},"cells_cut":0,"cells_raw":0,"read":"whole","date_system":"1900"}

{"sheet":"p1","index":0,"n_rows":6,"n_cols":3,"rows_kept":6,"cut":false,"hidden":false,"merged":[]}
[]
["Set","Set 48"]
[]
[]
[]
[null,null,0.89]

{"sheet":"p2","index":1,"n_rows":91,"n_cols":7,"rows_kept":91,"cut":false,"hidden":false,"merged":[]}
[]
[]
[null,"M1","M2","M3","M4","M5","M6"]
[null,23399.200000000001,23250,26274,7465.3,5511.8]
[null,5,5,6,2,2]
[null,0.96699999999999997,0.96099999999999997,0.90500000000000003,0.77100000000000002,0.56899999999999995]
[]
[null,{"$f":"'p1'!B2","v":"Set 48"}]
[null,{"$f":"SUMIF('p3'!A2:A68,'p1'!B2,'p3'!B2:B68)","v":6360}]
[null,0.96]
[]
[]
[null,{"$f":"B5","v":5},{"$f":"C5","v":5},6,{"$f":"E5","v":2},2]
[null,{"$f":"B4/B13/$B9/$B10","v":0.76648322851153039},{"$f":"C4/C13/$B9/$B10","v":0.76159591194968557},0.71721042976939209,{"$f":"E4/E13/$B9/$B10","v":0.6113485980083857},0.45137251048218036]
["formula",{"$f":"\"=\"&SUBSTITUTE(_xlfn.XLOOKUP('p1'!$B$2,'p3'!$A$2:$A$68,'p3'!$C$2:$C$68),\"VALUE\",B14)","v":"=IF(0.76648322851153>=0.85,-4.00000000000008*0.76648322851153 + 7.79999999999999,IF(0.76648322851153>=0.5,12.571428571428*0.76648322851153^2 - 26.114285714285*0.76648322851153 + 17.5142857142855,-31*0.76648322851153 + 23.1))"},{"$f":"\"=\"&SUBSTITUTE(_xlfn.XLOOKUP('p1'!$B$2,'p3'!$A$2:$A$68,'p3'!$C$2:$C$68),\"VALUE\",C14)","v":"=IF(0.761595911949686>=0.85,-4.00000000000008*0.761595911949686 + 7.79999999999999,IF(0.761595911949686>=0.5,12.571428571428*0.761595911949686^2 - 26.114285714285*0.761595911949686 + 17.5142857142855,-31*0.761595911949686 + 23.1))"},{"$f":"\"=\"&SUBSTITUTE(_xlfn.XLOOKUP('p1'!$B$2,'p3'!$A$2:$A$68,'p3'!$C$2:$C$68),\"VALUE\",D14)","v":"=IF(0.717210429769392>=0.85,-4.00000000000008*0.717210429769392 + 7.79999999999999,IF(0.717210429769392>=0.5,12.571428571428*0.717210429769392^2 - 26.114285714285*0.717210429769392 + 17.5142857142855,-31*0.717210429769392 + 23.1))"},{"$f":"\"=\"&SUBSTITUTE(_xlfn.XLOOKUP('p1'!$B$2,'p3'!$A$2:$A$68,'p3'!$C$2:$C$68),\"VALUE\",E14)","v":"=IF(0.611348598008386>=0.85,-4.00000000000008*0.611348598008386 + 7.79999999999999,IF(0.611348598008386>=0.5,12.571428571428*0.611348598008386^2 - 26.114285714285*0.611348598008386 + 17.5142857142855,-31*0.611348598008386 + 23.1))"},{"$f":"\"=\"&SUBSTITUTE(_xlfn.XLOOKUP('p1'!$B$2,'p3'!$A$2:$A$68,'p3'!$C$2:$C$68),\"VALUE\",F14)","v":"=IF(0.45137251048218>=0.85,-4.00000000000008*0.45137251048218 + 7.79999999999999,IF(0.45137251048218>=0.5,12.571428571428*0.45137251048218^2 - 26.114285714285*0.45137251048218 + 17.5142857142855,-31*0.45137251048218 + 23.1))"}]
[null,{"$f":"TextToFormula","v":4.8837944731378045},{"$f":"TextToFormula","v":4.9175372297518685},{"$f":"TextToFormula","v":5.2514748411878323},{"$f":"TextToFormula","v":6.2478888304724531},{"$f":"TextToFormula","v":9.1074521750524209}]
[null,{"$f":"B14","v":0.76648322851153039},{"$f":"C14","v":0.76159591194968557},0.71721042976939209,{"$f":"E14","v":0.6113485980083857},0.45137251048218036]
["formula",{"$f":"\"=\"&SUBSTITUTE(_xlfn.XLOOKUP('p1'!$B$2,'p3'!$A$2:$A$68,'p3'!$D$2:$D$68),\"VALUE\",B17)","v":"=IF(0.76648322851153>=0.85,-160.000000000262*0.76648322851153 + 7257.00000000004,IF(0.76648322851153>=0.5,-51.4285714295692*0.76648322851153^2 - 967.714285712921*0.76648322851153 + 7980.71428571386,-9677.99999999999*0.76648322851153 + 12323))"},{"$f":"\"=\"&SUBSTITUTE(_xlfn.XLOOKUP('p1'!$B$2,'p3'!$A$2:$A$68,'p3'!$D$2:$D$68),\"VALUE\",C17)","v":"=IF(0.761595911949686>=0.85,-160.000000000262*0.761595911949686 + 7257.00000000004,IF(0.761595911949686>=0.5,-51.4285714295692*0.761595911949686^2 - 967.714285712921*0.761595911949686 + 7980.71428571386,-9677.99999999999*0.761595911949686 + 12323))"},{"$f":"\"=\"&SUBSTITUTE(_xlfn.XLOOKUP('p1'!$B$2,'p3'!$A$2:$A$68,'p3'!$D$2:$D$68),\"VALUE\",D17)","v":"=IF(0.717210429769392>=0.85,-160.000000000262*0.717210429769392 + 7257.00000000004,IF(0.717210429769392>=0.5,-51.4285714295692*0.717210429769392^2 - 967.714285712921*0.717210429769392 + 7980.71428571386,-9677.99999999999*0.717210429769392 + 12323))"},{"$f":"\"=\"&SUBSTITUTE(_xlfn.XLOOKUP('p1'!$B$2,'p3'!$A$2:$A$68,'p3'!$D$2:$D$68),\"VALUE\",E17)","v":"=IF(0.611348598008386>=0.85,-160.000000000262*0.611348598008386 + 7257.00000000004,IF(0.611348598008386>=0.5,-51.4285714295692*0.611348598008386^2 - 967.714285712921*0.611348598008386 + 7980.71428571386,-9677.99999999999*0.611348598008386 + 12323))"},{"$f":"\"=\"&SUBSTITUTE(_xlfn.XLOOKUP('p1'!$B$2,'p3'!$A$2:$A$68,'p3'!$D$2:$D$68),\"VALUE\",F17)","v":"=IF(0.45137251048218>=0.85,-160.000000000262*0.45137251048218 + 7257.00000000004,IF(0.45137251048218>=0.5,-51.4285714295692*0.45137251048218^2 - 967.714285712921*0.45137251048218 + 7980.71428571386,-9677.99999999999*0.45137251048218 + 12323))"}]
[null,{"$f":"TextToFormula","v":7208.7634079729896},{"$f":"TextToFormula","v":7213.8770132196596},{"$f":"TextToFormula","v":7260.2051229338886},{"$f":"TextToFormula","v":7369.8822340154547},{"$f":"TextToFormula","v":7954.6168435534655}]
[]
[null,14]
[null,6.1999999999999998E-3,0.1401,8.2600000000000007E-2,6.8999999999999999E-3,0.76419999999999999]
[null,{"$f":"$B21*B22","v":8.6800000000000002E-2},{"$f":"$B21*C22","v":1.9614},1.1564000000000001,9.6599999999999991E-2,10.6988]
[]
[null,{"$f":"$B9*B14*B16/1000/'p1'!$C$6/1000*24*B23*B13","v":0.27863015448290568},{"$f":"$B9*C14*C16/1000/'p1'!$C$6/1000*24*C23*C13","v":6.2992201515904798},{"$f":"$B9*D14*D16/1000/'p1'!$C$6/1000*24*D23*D13","v":4.4819351649952148},{"$f":"$B9*E14*E16/1000/'p1'!$C$6/1000*24*E23*E13","v":0.12656326992583625},{"$f":"$B9*F14*F16/1000/'p1'!$C$6/1000*24*F23*F13","v":15.086045765943233}]
[null,{"$f":"$B9*B14*B19*24*B23*B13/49700/1000/0.45","v":16.366379339001842},{"$f":"$B9*C14*C19*24*C23*C13/49700/1000/0.45","v":367.72992084641197},{"$f":"$B9*D14*D19*24*D23*D13/49700/1000/0.45","v":246.57797165003308},{"$f":"$B9*E14*E19*24*E23*E13/49700/1000/0.45","v":5.9409520298436531},{"$f":"$B9*F14*F19*24*F23*F13/49700/1000/0.45","v":524.34712503604578}]
[]
[null,1]
[null,0.90580000000000005,9.4200000000000006E-2,0,0,0]
[null,{"$f":"$B28*B29","v":0.90580000000000005},{"$f":"$B28*C29","v":9.4200000000000006E-2},{"$f":"$B28*D29","v":0},{"$f":"$B28*E29","v":0},{"$f":"$B28*F29","v":0}]
[]
[null,{"$f":"$B9*B14*B16/1000/'p1'!$C$6/1000*24*B30*B13","v":2.9076404830716123},{"$f":"$B9*C14*C16/1000/'p1'!$C$6/1000*24*C30*C13","v":0.30253213943092849},{"$f":"$B9*D14*D16/1000/'p1'!$C$6/1000*24*D30*D13","v":0},{"$f":"$B9*E14*E16/1000/'p1'!$C$6/1000*24*E30*E13","v":0},{"$f":"$B9*F14*F16/1000/'p1'!$C$6/1000*24*F30*F13","v":0}]
[null,{"$f":"$B16*B21*B26*24*B30*B20/49700/1000/0.45","v":0},{"$f":"$B16*C21*C26*24*C30*C20/49700/1000/0.45","v":0},{"$f":"$B16*D21*D26*24*D30*D20/49700/1000/0.45","v":0},{"$f":"$B16*E21*E26*24*E30*E20/49700/1000/0.45","v":0},{"$f":"$B16*F21*F26*24*F30*F20/49700/1000/0.45","v":0}]
[]
[]
[null,{"$f":"MAX(SUM(B25:F25),SUM(B32:F32))","v":26.272394506937669},{"$f":"SUM(B26:F26)","v":1160.9623489013363}]
[null,0.98]
[null,null,0.98]
[null,1.1000000000000001,1.05]
[null,{"$f":"B36/B37*B39","v":29.489422405746367},{"$f":"C36/C38*C39","v":1243.8882309657176}]
[null,{"$f":"B40*1.1","v":32.438364646321006},{"$f":"C40*1.1","v":1368.2770540622896}]
[null,{"$f":"IF(B41<100,ROUNDUP(B41,0),ROUNDUP(B41,-1))","v":33},{"$f":"ROUNDUP(C41,-1)","v":1370}]
[null,{"$f":"B42","v":33},{"$f":"C42","v":1370}]
[null,null,{"$f":"C43/2","v":685}]
[]
[null,1000]
[null,22]
[]
[null,{"$f":"B46-B47-B43","v":945},{"$f":"IF(B49<0,\"Alert!\",\"OK\")","v":"OK"}]
[]
[]
[null,{"$f":"MAX(B13:J13*B14:J14)","v":4.3032625786163523}]
[null,{"$f":"ROUNDUP(B52,0)","v":5},null,{"$f":"B52/B53","v":0.86065251572327051}]
[null,null,"formula",{"$f":"\"=\"&SUBSTITUTE(_xlfn.XLOOKUP('p1'!$B$2,'p3'!$A$2:$A$68,'p3'!$C$2:$C$68),\"VALUE\",D53)","v":"=IF(0.860652515723271>=0.85,-4.00000000000008*0.860652515723271 + 7.79999999999999,IF(0.860652515723271>=0.5,12.571428571428*0.860652515723271^2 - 26.114285714285*0.860652515723271 + 17.5142857142855,-31*0.860652515723271 + 23.1))"}]
[null,null,null,{"$f":"TextToFormula","v":4.3573899371068379}]
[]
[null,8]
[]
[null,{"$f":"$B9*D53*D55/1000/'p1'!$C$6/1000*B57*B53","v":1.0719668839657777}]
[]
[null,0.99]
[null,1.1000000000000001]
[]
[null,{"$f":"B59/B61*B62","v":1.1910743155175307}]
[null,{"$f":"B64*1.1","v":1.3101817470692838}]
[null,{"$f":"ROUNDUP(B65,0)","v":2}]
[null,{"$f":"B66","v":2}]
[]
[null,50]
[null,2]
[]
[null,{"$f":"2*B69-B70*B67","v":96},{"$f":"IF(B72<0,\"Alert!\",\"OK\")","v":"OK"}]
[]
[]
[]
[null,24]
[]
[null,{"$f":"B59/B57*B76","v":3.215900651897333}]
[]
[null,0.99]
[null,1.1000000000000001]
[null,1]
[null,{"$f":"B78/B80*B81/B82","v":3.5732229465525926}]
[null,{"$f":"B83*1.1","v":3.9305452412078523}]
[null,{"$f":"ROUNDUP(B84,0)","v":4}]
[null,{"$f":"B85","v":4}]
[]
[null,120]
[null,1]
[]
[null,{"$f":"B88-B89*B86","v":116},{"$f":"IF(B91<0,\"Alert!\",\"OK\")","v":"OK"}]

{"sheet":"p3","index":2,"n_rows":67,"n_cols":5,"rows_kept":67,"cut":false,"hidden":false,"merged":[]}
[null,"P","D1","D2","D3"]
[]
["Set 01",957.9]
["Set 02",1603]
["Set 03",1825]
["Set 04",1889]
["Set 05",2500]
["Set 06",1930]
["Set 07",1930]
["Set 08",3800]
["Set 09",5420]
["Set 10",6000]
["Set 11",7680]
["Set 12",3600,"IF(VALUE>=0.85,19.9999999999974*VALUE + 155.000000000001,-6414.6964213252*VALUE^5 + 15696.4702125489*VALUE^4 - 14659.909549588*VALUE^3 + 6604.79645950556*VALUE^2 - 1505.96747775728*VALUE^1 + 335.703192599174)",null,{"$f":"13*0.000755858*1000","v":9.8261540000000007}]
["Set 13",4060,"IF(VALUE>=0.85,10.0000000000012*VALUE + 166.500000000005,220.268620280083*VALUE^4 - 1125.25030527152*VALUE^3 + 1479.70573871962*VALUE^2 - 737.107753362321*VALUE^1 + 308.516941393028)",null,{"$f":"13*0.000755858*1000","v":9.8261540000000007}]
["Set 14",4800,"IF(VALUE>=0.85,19.9999999999974*VALUE + 155.000000000001,-6414.6964213252*VALUE^5 + 15696.4702125489*VALUE^4 - 14659.909549588*VALUE^3 + 6604.79645950556*VALUE^2 - 1505.96747775728*VALUE^1 + 335.703192599174)",null,9.8261540000000007]
["Set 15",5400,"IF(VALUE>=0.85,19.9999999999974*VALUE + 155.000000000001,-6414.6964213252*VALUE^5 + 15696.4702125489*VALUE^4 - 14659.909549588*VALUE^3 + 6604.79645950556*VALUE^2 - 1505.96747775728*VALUE^1 + 335.703192599174)",null,9.8261540000000007]
["Set 16",6000,"IF(VALUE>=0.85,19.9999999999974*VALUE + 155.000000000001,-6414.6964213252*VALUE^5 + 15696.4702125489*VALUE^4 - 14659.909549588*VALUE^3 + 6604.79645950556*VALUE^2 - 1505.96747775728*VALUE^1 + 335.703192599174)",null,9.8261540000000007]
["Set 17",7200,"IF(VALUE>=0.85,23.3333333333328*VALUE + 151.166666666665,-7016.53902375698*VALUE^5 + 17230.5694482922*VALUE^4 - 16090.1021365166*VALUE^3 + 7191.39644346774*VALUE^2 - 1606.88333976646*VALUE^1 + 341.211580050282)",null,9.8261540000000007]
["Set 18",8120,"IF(VALUE>=0.85,13.3333333333316*VALUE + 162.666666666669,156.776556786615*VALUE^4 - 1023.66300368197*VALUE^3 + 1426.5311355435*VALUE^2 - 726.790293044539*VALUE^1 + 307.921703297768)",null,9.8261540000000007]
["Set 19",9600,"IF(VALUE>=0.85,23.3333333333328*VALUE + 151.166666666665,-7016.53902375698*VALUE^5 + 17230.5694482922*VALUE^4 - 16090.1021365166*VALUE^3 + 7191.39644346774*VALUE^2 - 1606.88333976646*VALUE^1 + 341.211580050282)",null,9.8261540000000007]
["Set 20",12000,"IF(VALUE>=0.85,23.3333333333328*VALUE + 151.166666666665,-7016.53902375698*VALUE^5 + 17230.5694482922*VALUE^4 - 16090.1021365166*VALUE^3 + 7191.39644346774*VALUE^2 - 1606.88333976646*VALUE^1 + 341.211580050282)",null,9.8261540000000007]
["Set 21",3600,"IF(VALUE>=0.85,6.6666666666658*VALUE + 168.333333333333,-8241.31424945592*VALUE^5 + 20052.5141722857*VALUE^4 - 18458.6152916491*VALUE^3 + 8081.21770620942*VALUE^2 - 1751.10545110288*VALUE^1 + 348.834144990409)",null,9.8261540000000007]
["Set 22",4060,"IF(VALUE>=0.85,10.0000000000012*VALUE + 166.500000000005,220.268620280083*VALUE^4 - 1125.25030527152*VALUE^3 + 1479.70573871962*VALUE^2 - 737.107753362321*VALUE^1 + 308.516941393028)",null,9.8261540000000007]
["Set 23",4800,"IF(VALUE>=0.85,6.6666666666658*VALUE + 168.333333333333,-8241.31424945592*VALUE^5 + 20052.5141722857*VALUE^4 - 18458.6152916491*VALUE^3 + 8081.21770620942*VALUE^2 - 1751.10545110288*VALUE^1 + 348.834144990409)",null,9.8261540000000007]
["Set 24",5400,"IF(VALUE>=0.85,6.6666666666658*VALUE + 168.333333333333,-8241.31424945592*VALUE^5 + 20052.5141722857*VALUE^4 - 18458.6152916491*VALUE^3 + 8081.21770620942*VALUE^2 - 1751.10545110288*VALUE^1 + 348.834144990409)",null,9.8261540000000007]
["Set 25",6000,"IF(VALUE>=0.85,6.6666666666658*VALUE + 168.333333333333,-8241.31424945592*VALUE^5 + 20052.5141722857*VALUE^4 - 18458.6152916491*VALUE^3 + 8081.21770620942*VALUE^2 - 1751.10545110288*VALUE^1 + 348.834144990409)",null,9.8261540000000007]
["Set 26",7200,"IF(VALUE>=0.85,9.99999999999617*VALUE + 164.500000000007,-8843.15685164928*VALUE^5 + 21586.6134075522*VALUE^4 - 19888.8078777552*VALUE^3 + 8667.81768990636*VALUE^2 - 1852.02131308377*VALUE^1 + 354.342532440556)",null,9.8261540000000007]
["Set 27",8120,"IF(VALUE>=0.85,13.3333333333316*VALUE + 162.666666666669,156.776556786615*VALUE^4 - 1023.66300368197*VALUE^3 + 1426.5311355435*VALUE^2 - 726.790293044539*VALUE^1 + 307.921703297768)",null,9.8261540000000007]
["Set 28",9600,"IF(VALUE>=0.85,9.99999999999617*VALUE + 164.500000000007,-8843.15685164928*VALUE^5 + 21586.6134075522*VALUE^4 - 19888.8078777552*VALUE^3 + 8667.81768990636*VALUE^2 - 1852.02131308377*VALUE^1 + 354.342532440556)",null,9.8261540000000007]
["Set 29",12000,"IF(VALUE>=0.85,9.99999999999617*VALUE + 164.500000000007,-8843.15685164928*VALUE^5 + 21586.6134075522*VALUE^4 - 19888.8078777552*VALUE^3 + 8667.81768990636*VALUE^2 - 1852.02131308377*VALUE^1 + 354.342532440556)",null,9.8261540000000007]
["Set 30",3600,"IF(VALUE>=0,-984.126989364624*VALUE^5 + 3309.52382850646*VALUE^4 - 4302.46034145355*VALUE^3 + 2766.48810917139*VALUE^2 - 923.037702590227*VALUE^1 + 309.613096068185,1)",null,9.8261540000000007]
["Set 31",4060,"IF(VALUE>=0.85,23.3333333333278*VALUE + 153.166666666668,IF(VALUE>=0.75,-50.0000000000147*VALUE + 215.500000000017,-543.333333333255*VALUE^3 + 898.999999999476*VALUE^2 - 498.541666666555*VALUE^1 + 275.437500000053))",null,9.8261540000000007]
["Set 32",4800,"IF(VALUE>=0,-984.126989364624*VALUE^5 + 3309.52382850646*VALUE^4 - 4302.46034145355*VALUE^3 + 2766.48810917139*VALUE^2 - 923.037702590227*VALUE^1 + 309.613096068185,1)",null,9.8261540000000007]
["Set 33",5400,"IF(VALUE>=0,-984.126989364624*VALUE^5 + 3309.52382850646*VALUE^4 - 4302.46034145355*VALUE^3 + 2766.48810917139*VALUE^2 - 923.037702590227*VALUE^1 + 309.613096068185,1)",null,9.8261540000000007]
["Set 34",6000,"IF(VALUE>=0,-984.126989364624*VALUE^5 + 3309.52382850646*VALUE^4 - 4302.46034145355*VALUE^3 + 2766.48810917139*VALUE^2 - 923.037702590227*VALUE^1 + 309.613096068185,1)",null,9.8261540000000007]
["Set 35",7200,"IF(VALUE>=0,-2698.41271185874*VALUE^5 + 9014.28576010465*VALUE^4 - 11573.4127558171*VALUE^3 + 7161.94051017612*VALUE^2 - 2168.04961301665*VALUE^1 + 439.148810940739,1)",null,9.8261540000000007]
["Set 36",8120,"IF(VALUE>=0.85,26.6666666666632*VALUE + 149.333333333332,IF(VALUE>=0.75,-60.0000000000062*VALUE + 223.000000000016,-543.333333333255*VALUE^3 + 898.999999999476*VALUE^2 - 498.541666666555*VALUE^1 + 275.437500000053))",null,9.8261540000000007]
["Set 37",9600,"IF(VALUE>=0,-2698.41271185874*VALUE^5 + 9014.28576010465*VALUE^4 - 11573.4127558171*VALUE^3 + 7161.94051017612*VALUE^2 - 2168.04961301665*VALUE^1 + 439.148810940739,1)",null,9.8261540000000007]
["Set 38",10800,"IF(VALUE>=0,-2698.41271185874*VALUE^5 + 9014.28576010465*VALUE^4 - 11573.4127558171*VALUE^3 + 7161.94051017612*VALUE^2 - 2168.04961301665*VALUE^1 + 439.148810940739,1)",null,9.8261540000000007]
["Set 39",12000,"IF(VALUE>=0,-2698.41271185874*VALUE^5 + 9014.28576010465*VALUE^4 - 11573.4127558171*VALUE^3 + 7161.94051017612*VALUE^2 - 2168.04961301665*VALUE^1 + 439.148810940739,1)",null,9.8261540000000007]
["Set 40",3480,"IF(VALUE>=0,-33.523809524253*VALUE^3 + 157.828571429476*VALUE^2 - 187.076190476946*VALUE^1 + 247.471428571646,1)",null,"-42.6666666666661*VALUE^3 + 104*VALUE^2 - 87.3333333333311*VALUE + 37.9999999999985"]
["Set 41",4240,"IF(VALUE>=0.85,5.99999999999972*VALUE + 169.800000000005,IF(VALUE>=0.5,1.71428571428987*VALUE^2 - 29.7428571428645*VALUE + 198.94285714286, -241.95*VALUE + 305.475))",null,"-42.6666666666661*VALUE^3 + 104*VALUE^2 - 87.3333333333311*VALUE + 37.9999999999985"]
["Set 42",4240,"IF(VALUE>=0.85,-4.00000000000008*VALUE + 7.79999999999999,IF(VALUE>=0.5,12.571428571428*VALUE^2 - 26.114285714285*VALUE + 17.5142857142855,-31*VALUE + 23.1))","IF(VALUE>=0.85,-160.000000000262*VALUE + 7257.00000000004,IF(VALUE>=0.5,-51.4285714295692*VALUE^2 - 967.714285712921*VALUE + 7980.71428571386,-9677.99999999999*VALUE + 12323))","0"]
["Set 43",4240,0,"-883.809523805975*VALUE^3 + 4004.57142857462*VALUE^2 - 5728.19047619961*VALUE + 9761.42857143228","0"]
["Set 44",5300,"IF(VALUE>=0.85,5.99999999999972*VALUE + 169.800000000005,IF(VALUE>=0.5,1.71428571428987*VALUE^2 - 29.7428571428645*VALUE + 198.94285714286, -241.95*VALUE + 305.475))",null,"-42.6666666666661*VALUE^3 + 104*VALUE^2 - 87.3333333333311*VALUE + 37.9999999999985"]
["Set 45",5300,"IF(VALUE>=0.85,-4.00000000000008*VALUE + 7.79999999999999,IF(VALUE>=0.5,12.571428571428*VALUE^2 - 26.114285714285*VALUE + 17.5142857142855,-31*VALUE + 23.1))","IF(VALUE>=0.85,-160.000000000262*VALUE + 7257.00000000004,IF(VALUE>=0.5,-51.4285714295692*VALUE^2 - 967.714285712921*VALUE + 7980.71428571386,-9677.99999999999*VALUE + 12323))","0"]
["Set 46",5300,0,"-883.809523805975*VALUE^3 + 4004.57142857462*VALUE^2 - 5728.19047619961*VALUE + 9761.42857143228","0"]
["Set 47",6360,"IF(VALUE>=0.85,5.99999999999972*VALUE + 169.800000000005,IF(VALUE>=0.5,1.71428571428987*VALUE^2 - 29.7428571428645*VALUE + 198.94285714286, -241.95*VALUE + 305.475))",null,"-42.6666666666661*VALUE^3 + 104*VALUE^2 - 87.3333333333311*VALUE + 37.9999999999985"]
["Set 48",6360,"IF(VALUE>=0.85,-4.00000000000008*VALUE + 7.79999999999999,IF(VALUE>=0.5,12.571428571428*VALUE^2 - 26.114285714285*VALUE + 17.5142857142855,-31*VALUE + 23.1))","IF(VALUE>=0.85,-160.000000000262*VALUE + 7257.00000000004,IF(VALUE>=0.5,-51.4285714295692*VALUE^2 - 967.714285712921*VALUE + 7980.71428571386,-9677.99999999999*VALUE + 12323))","0"]
["Set 49",6360,0,"-883.809523805975*VALUE^3 + 4004.57142857462*VALUE^2 - 5728.19047619961*VALUE + 9761.42857143228","0"]
["Set 50",5760,null,null,"-42.6666666666661*VALUE^3 + 104*VALUE^2 - 87.3333333333311*VALUE + 37.9999999999985"]
["Set 51",6600,null,null,"-42.6666666666661*VALUE^3 + 104*VALUE^2 - 87.3333333333311*VALUE + 37.9999999999985"]
["Set 52",5760,{"$f":"'p4'!N49","v":"IF(VALUE>=0.85,0*VALUE^6+0*VALUE^5+0*VALUE^4+0*VALUE^3+0*VALUE^2+18.6666666666666*VALUE + 168.533333333333,IF(VALUE>=0.5,0*VALUE^6+0*VALUE^5+0*VALUE^4+-349.919413919413*VALUE^3+832.545054945053*VALUE^2+-658.352014652014*VALUE+357.37967032967,0*VALUE^6+0*VALUE^5+0*VALUE^4+-349.919413919413*VALUE^3+832.545054945053*VALUE^2+-658.352014652014*VALUE+357.37967032967))"},null,"-42.6666666666661*VALUE^3 + 104*VALUE^2 - 87.3333333333311*VALUE + 37.9999999999985"]
["Set 53",5760,{"$f":"'p4'!N15","v":"IF(VALUE>=0.85,0*VALUE^6+0*VALUE^5+0*VALUE^4+0*VALUE^3+0*VALUE^2+-2*VALUE + 3.9,IF(VALUE>=0.5,0*VALUE^6+0*VALUE^5+0*VALUE^4+-64.0293040293037*VALUE^3+140.747252747252*VALUE^2+-105.099267399267*VALUE+29.1664835164835,0*VALUE^6+0*VALUE^5+0*VALUE^4+-64.0293040293037*VALUE^3+140.747252747252*VALUE^2+-105.099267399267*VALUE+29.1664835164835))"},{"$f":"'p4'!N32","v":"IF(VALUE>=0.85,0*VALUE^6+0*VALUE^5+0*VALUE^4+0*VALUE^3+0*VALUE^2+-926.666666666667*VALUE + 8275.16666666667,IF(VALUE>=0.5,0*VALUE^6+0*VALUE^5+0*VALUE^4+-9312.23443223434*VALUE^3+21289.9780219779*VALUE^2+-18306.1941391941*VALUE+13384.6318681319,0*VALUE^6+0*VALUE^5+0*VALUE^4+-9312.23443223434*VALUE^3+21289.9780219779*VALUE^2+-18306.1941391941*VALUE+13384.6318681319))"},"-42.6666666666661*VALUE^3 + 104*VALUE^2 - 87.3333333333311*VALUE + 37.9999999999985"]
["Set 54",8260,null,null,"-42.6666666666661*VALUE^3 + 104*VALUE^2 - 87.3333333333311*VALUE + 37.9999999999985"]
["Set 55",7420,"IF(VALUE>=0.85,5.99999999999972*VALUE + 169.800000000005,IF(VALUE>=0.5,1.71428571428987*VALUE^2 - 29.7428571428645*VALUE + 198.94285714286, -241.95*VALUE + 305.475))",null,"-42.6666666666661*VALUE^3 + 104*VALUE^2 - 87.3333333333311*VALUE + 37.9999999999985"]
["Set 56",7420,"IF(VALUE>=0.85,-4.00000000000008*VALUE + 7.79999999999999,IF(VALUE>=0.5,12.571428571428*VALUE^2 - 26.114285714285*VALUE + 17.5142857142855,-31*VALUE + 23.1))","IF(VALUE>=0.85,-160.000000000262*VALUE + 7257.00000000004,IF(VALUE>=0.5,-51.4285714295692*VALUE^2 - 967.714285712921*VALUE + 7980.71428571386,-9677.99999999999*VALUE + 12323))","0"]
["Set 57",7420,0,"-883.809523805975*VALUE^3 + 4004.57142857462*VALUE^2 - 5728.19047619961*VALUE + 9761.42857143228","0"]
["Set 58",9440,null,null,"-42.6666666666661*VALUE^3 + 104*VALUE^2 - 87.3333333333311*VALUE + 37.9999999999985"]
["Set 59",8480,"IF(VALUE>=0.85,5.99999999999972*VALUE + 169.800000000005,IF(VALUE>=0.5,1.71428571428987*VALUE^2 - 29.7428571428645*VALUE + 198.94285714286, -241.95*VALUE + 305.475))",null,"-42.6666666666661*VALUE^3 + 104*VALUE^2 - 87.3333333333311*VALUE + 37.9999999999985"]
["Set 60",8480,"IF(VALUE>=0.85,-4.00000000000008*VALUE + 7.79999999999999,IF(VALUE>=0.5,12.571428571428*VALUE^2 - 26.114285714285*VALUE + 17.5142857142855,-31*VALUE + 23.1))","IF(VALUE>=0.85,-160.000000000262*VALUE + 7257.00000000004,IF(VALUE>=0.5,-51.4285714295692*VALUE^2 - 967.714285712921*VALUE + 7980.71428571386,-9677.99999999999*VALUE + 12323))","0"]
["Set 61",8480,0,"-883.809523805975*VALUE^3 + 4004.57142857462*VALUE^2 - 5728.19047619961*VALUE + 9761.42857143228","0"]
["Set 62",8960,null,null,"-42.6666666666661*VALUE^3 + 104*VALUE^2 - 87.3333333333311*VALUE + 37.9999999999985"]
["Set 63",6960,null,null,"-42.6666666666661*VALUE^3 + 104*VALUE^2 - 87.3333333333311*VALUE + 37.9999999999985"]
["Set 64",7680,{"$f":"'p4'!N49","v":"IF(VALUE>=0.85,0*VALUE^6+0*VALUE^5+0*VALUE^4+0*VALUE^3+0*VALUE^2+18.6666666666666*VALUE + 168.533333333333,IF(VALUE>=0.5,0*VALUE^6+0*VALUE^5+0*VALUE^4+-349.919413919413*VALUE^3+832.545054945053*VALUE^2+-658.352014652014*VALUE+357.37967032967,0*VALUE^6+0*VALUE^5+0*VALUE^4+-349.919413919413*VALUE^3+832.545054945053*VALUE^2+-658.352014652014*VALUE+357.37967032967))"},null,"-42.6666666666661*VALUE^3 + 104*VALUE^2 - 87.3333333333311*VALUE + 37.9999999999985"]
["Set 65",7680,{"$f":"'p4'!N15","v":"IF(VALUE>=0.85,0*VALUE^6+0*VALUE^5+0*VALUE^4+0*VALUE^3+0*VALUE^2+-2*VALUE + 3.9,IF(VALUE>=0.5,0*VALUE^6+0*VALUE^5+0*VALUE^4+-64.0293040293037*VALUE^3+140.747252747252*VALUE^2+-105.099267399267*VALUE+29.1664835164835,0*VALUE^6+0*VALUE^5+0*VALUE^4+-64.0293040293037*VALUE^3+140.747252747252*VALUE^2+-105.099267399267*VALUE+29.1664835164835))"},{"$f":"'p4'!N32","v":"IF(VALUE>=0.85,0*VALUE^6+0*VALUE^5+0*VALUE^4+0*VALUE^3+0*VALUE^2+-926.666666666667*VALUE + 8275.16666666667,IF(VALUE>=0.5,0*VALUE^6+0*VALUE^5+0*VALUE^4+-9312.23443223434*VALUE^3+21289.9780219779*VALUE^2+-18306.1941391941*VALUE+13384.6318681319,0*VALUE^6+0*VALUE^5+0*VALUE^4+-9312.23443223434*VALUE^3+21289.9780219779*VALUE^2+-18306.1941391941*VALUE+13384.6318681319))"},"-42.6666666666661*VALUE^3 + 104*VALUE^2 - 87.3333333333311*VALUE + 37.9999999999985"]

{"sheet":"p4","index":3,"n_rows":435,"n_cols":20,"rows_kept":435,"cut":false,"hidden":false,"merged":[]}
["Set 53"]
["Reference data:",null,null,null,null,null,null,null,null,null,null,null,null,"x6","x5","x4","x3","x2","x","b"]
[1,1.9]
[0.85,2.2000000000000002,null,null,null,null,null,null,null,null,null,null,"s2",0,0,0,0,0,{"$f":"LINEST(B3:B4,A3:A4,TRUE,FALSE)","v":-2.0000000000000009},3.9000000000000008]
[0.75,2.5,null,null,null,null,null,null,null,null,null,null,"s1",0,0,0,{"$f":"LINEST(B4:B7,A4:A7^{1,2,3},TRUE,FALSE)","v":-64.029304029303674},140.74725274725219,-105.09926739926716,29.166483516483513]
[0.5,3.8,null,null,null,null,null,null,null,null,null,null,"s3"]
[0.1,20]
[]
["Extrapolated ref:",null,"Deviation:"]
[1,{"$f":"IF(A10>=0.85,N4*A10^6+O4*A10^5+P4*A10^4+Q4*A10^3+R4*A10^2+S4*A10 + T4,IF(A10>=0.5,N5*A10^6+O5*A10^5+P5*A10^4+Q5*A10^3+R5*A10^2+S5*A10+T5,N5*A10^6+O5*A10^5+P5*A10^4+Q5*A10^3+R5*A10^2+S5*A10+T5))","v":1.9},{"$f":"ABS(B3-B10)","v":0}]
[0.85,{"$f":"IF(A11>=0.85,N4*A11^6+O4*A11^5+P4*A11^4+Q4*A11^3+R4*A11^2+S4*A11 + T4,IF(A11>=0.5,N5*A11^6+O5*A11^5+P5*A11^4+Q5*A11^3+R5*A11^2+S5*A11+T5,N5*A11^6+O5*A11^5+P5*A11^4+Q5*A11^3+R5*A11^2+S5*A11+T5))","v":2.2000000000000002},{"$f":"ABS(B4-B11)","v":0}]
[0.75,{"$f":"IF(A12>=0.85,N4*A12^6+O4*A12^5+P4*A12^4+Q4*A12^3+R4*A12^2+S4*A12 + T4,IF(A12>=0.5,N5*A12^6+O5*A12^5+P5*A12^4+Q5*A12^3+R5*A12^2+S5*A12+T5,N5*A12^6+O5*A12^5+P5*A12^4+Q5*A12^3+R5*A12^2+S5*A12+T5))","v":2.5000000000000036},{"$f":"ABS(B5-B12)","v":3.5527136788005009E-15}]
[0.5,{"$f":"IF(A13>=0.85,N4*A13^6+O4*A13^5+P4*A13^4+Q4*A13^3+R4*A13^2+S4*A13 + T4,IF(A13>=0.5,N5*A13^6+O5*A13^5+P5*A13^4+Q5*A13^3+R5*A13^2+S5*A13+T5,N5*A13^6+O5*A13^5+P5*A13^4+Q5*A13^3+R5*A13^2+S5*A13+T5))","v":3.800000000000022},{"$f":"ABS(B6-B13)","v":2.2204460492503131E-14}]
[]
["Extrapolated example:",null,null,null,null,null,null,null,null,null,null,null,"formula",{"$f":"\"IF(VALUE>=0.85,\"&N4&\"*VALUE^6+\"&O4&\"*VALUE^5+\"&P4&\"*VALUE^4+\"&Q4&\"*VALUE^3+\"&R4&\"*VALUE^2+\"&S4&\"*VALUE + \"&T4&\",IF(VALUE>=0.5,\"&N5&\"*VALUE^6+\"&O5&\"*VALUE^5+\"&P5&\"*VALUE^4+\"&Q5&\"*VALUE^3+\"&R5&\"*VALUE^2+\"&S5&\"*VALUE+\"&T5&\",\"&N5&\"*VALUE^6+\"&O5&\"*VALUE^5+\"&P5&\"*VALUE^4+\"&Q5&\"*VALUE^3+\"&R5&\"*VALUE^2+\"&S5&\"*VALUE+\"&T5&\"))\"","v":"IF(VALUE>=0.85,0*VALUE^6+0*VALUE^5+0*VALUE^4+0*VALUE^3+0*VALUE^2+-2*VALUE + 3.9,IF(VALUE>=0.5,0*VALUE^6+0*VALUE^5+0*VALUE^4+-64.0293040293037*VALUE^3+140.747252747252*VALUE^2+-105.099267399267*VALUE+29.1664835164835,0*VALUE^6+0*VALUE^5+0*VALUE^4+-64.0293040293037*VALUE^3+140.747252747252*VALUE^2+-105.099267399267*VALUE+29.1664835164835))"}]
[0.65,{"$f":"IF(A16>=0.85,N4*A16^6+O4*A16^5+P4*A16^4+Q4*A16^3+R4*A16^2+S4*A16 + T4,IF(A16>=0.5,N5*A16^6+O5*A16^5+P5*A16^4+Q5*A16^3+R5*A16^2+S5*A16+T5,N5*A16^6+O5*A16^5+P5*A16^4+Q5*A16^3+R5*A16^2+S5*A16+T5))","v":2.7336263736263824}]
[]
["Set 53 (D2)"]
["Reference data:",null,null,null,null,null,null,null,null,null,null,null,null,"x6","x5","x4","x3","x2","x","b"]
[1,7348.5]
[0.85,7487.5,null,null,null,null,null,null,null,null,null,null,"s2",0,0,0,0,0,{"$f":"LINEST(B20:B21,A20:A21,TRUE,FALSE)","v":-926.66666666666652},8275.1666666666661]
[0.75,7702,null,null,null,null,null,null,null,null,null,null,"s1",0,0,0,{"$f":"LINEST(B21:B24,A21:A24^{1,2,3},TRUE,FALSE)","v":-9312.2344322343397},21289.978021977884,-18306.194139194085,13384.631868131864]
[0.5,8390,null,null,null,null,null,null,null,null,null,null,"s3"]
[0.1,{"$f":"B20*1.6","v":11757.6}]
[]
["Extrapolated ref:",null,"Deviation:"]
[1,{"$f":"IF(A27>=0.85,N21*A27^6+O21*A27^5+P21*A27^4+Q21*A27^3+R21*A27^2+S21*A27 + T21,IF(A27>=0.5,N22*A27^6+O22*A27^5+P22*A27^4+Q22*A27^3+R22*A27^2+S22*A27+T22,N22*A27^6+O22*A27^5+P22*A27^4+Q22*A27^3+R22*A27^2+S22*A27+T22))","v":7348.5},{"$f":"ABS(B20-B27)","v":0}]
[0.85,{"$f":"IF(A28>=0.85,N21*A28^6+O21*A28^5+P21*A28^4+Q21*A28^3+R21*A28^2+S21*A28 + T21,IF(A28>=0.5,N22*A28^6+O22*A28^5+P22*A28^4+Q22*A28^3+R22*A28^2+S22*A28+T22,N22*A28^6+O22*A28^5+P22*A28^4+Q22*A28^3+R22*A28^2+S22*A28+T22))","v":7487.5},{"$f":"ABS(B21-B28)","v":0}]
[0.75,{"$f":"IF(A29>=0.85,N21*A29^6+O21*A29^5+P21*A29^4+Q21*A29^3+R21*A29^2+S21*A29 + T21,IF(A29>=0.5,N22*A29^6+O22*A29^5+P22*A29^4+Q22*A29^3+R22*A29^2+S22*A29+T22,N22*A29^6+O22*A29^5+P22*A29^4+Q22*A29^3+R22*A29^2+S22*A29+T22))","v":7701.9999999999982},{"$f":"ABS(B22-B29)","v":1.8189894035458565E-12}]
[0.5,{"$f":"IF(A30>=0.85,N21*A30^6+O21*A30^5+P21*A30^4+Q21*A30^3+R21*A30^2+S21*A30 + T21,IF(A30>=0.5,N22*A30^6+O22*A30^5+P22*A30^4+Q22*A30^3+R22*A30^2+S22*A30+T22,N22*A30^6+O22*A30^5+P22*A30^4+Q22*A30^3+R22*A30^2+S22*A30+T22))","v":8390},{"$f":"ABS(B23-B30)","v":0}]
[]
["Extrapolated example:",null,null,null,null,null,null,null,null,null,null,null,"formula",{"$f":"\"IF(VALUE>=0.85,\"&N21&\"*VALUE^6+\"&O21&\"*VALUE^5+\"&P21&\"*VALUE^4+\"&Q21&\"*VALUE^3+\"&R21&\"*VALUE^2+\"&S21&\"*VALUE + \"&T21&\",IF(VALUE>=0.5,\"&N22&\"*VALUE^6+\"&O22&\"*VALUE^5+\"&P22&\"*VALUE^4+\"&Q22&\"*VALUE^3+\"&R22&\"*VALUE^2+\"&S22&\"*VALUE+\"&T22&\",\"&N22&\"*VALUE^6+\"&O22&\"*VALUE^5+\"&P22&\"*VALUE^4+\"&Q22&\"*VALUE^3+\"&R22&\"*VALUE^2+\"&S22&\"*VALUE+\"&T22&\"))\"","v":"IF(VALUE>=0.85,0*VALUE^6+0*VALUE^5+0*VALUE^4+0*VALUE^3+0*VALUE^2+-926.666666666667*VALUE + 8275.16666666667,IF(VALUE>=0.5,0*VALUE^6+0*VALUE^5+0*VALUE^4+-9312.23443223434*VALUE^3+21289.9780219779*VALUE^2+-18306.1941391941*VALUE+13384.6318681319,0*VALUE^6+0*VALUE^5+0*VALUE^4+-9312.23443223434*VALUE^3+21289.9780219779*VALUE^2+-18306.1941391941*VALUE+13384.6318681319))"}]
[0.93,{"$f":"IF(A33>=0.85,N21*A33^6+O21*A33^5+P21*A33^4+Q21*A33^3+R21*A33^2+S21*A33 + T21,IF(A33>=0.5,N22*A33^6+O22*A33^5+P22*A33^4+Q22*A33^3+R22*A33^2+S22*A33+T22,N22*A33^6+O22*A33^5+P22*A33^4+Q22*A33^3+R22*A33^2+S22*A33+T22))","v":7413.3666666666659}]
[]
["Set 52"]
["Reference data:",null,null,null,null,null,null,null,null,null,null,null,null,"x6","x5","x4","x3","x2","x","b"]
[1,187.2]
[0.85,184.4,null,null,null,null,null,null,null,null,null,null,"s2",0,0,0,0,0,{"$f":"LINEST(B37:B38,A37:A38,TRUE,FALSE)","v":18.666666666666551},168.53333333333345]
[0.75,184.3,null,null,null,null,null,null,null,null,null,null,"s1",0,0,0,{"$f":"LINEST(B38:B41,A38:A41^{1,2,3},TRUE,FALSE)","v":-349.91941391941259},832.54505494505281,-658.35201465201362,357.37967032967026]
[0.5,192.6,null,null,null,null,null,null,null,null,null,null,"s3"]
[0.1,{"$f":"B37*1.6","v":299.52}]
[]
["Extrapolated ref:",null,"Deviation:"]
[1,{"$f":"IF(A44>=0.85,N38*A44^6+O38*A44^5+P38*A44^4+Q38*A44^3+R38*A44^2+S38*A44 + T38,IF(A44>=0.5,N39*A44^6+O39*A44^5+P39*A44^4+Q39*A44^3+R39*A44^2+S39*A44+T39,N39*A44^6+O39*A44^5+P39*A44^4+Q39*A44^3+R39*A44^2+S39*A44+T39))","v":187.2},{"$f":"ABS(B37-B44)","v":0}]
[0.85,{"$f":"IF(A45>=0.85,N38*A45^6+O38*A45^5+P38*A45^4+Q38*A45^3+R38*A45^2+S38*A45 + T38,IF(A45>=0.5,N39*A45^6+O39*A45^5+P39*A45^4+Q39*A45^3+R39*A45^2+S39*A45+T39,N39*A45^6+O39*A45^5+P39*A45^4+Q39*A45^3+R39*A45^2+S39*A45+T39))","v":184.4},{"$f":"ABS(B38-B45)","v":0}]
[0.75,{"$f":"IF(A46>=0.85,N38*A46^6+O38*A46^5+P38*A46^4+Q38*A46^3+R38*A46^2+S38*A46 + T38,IF(A46>=0.5,N39*A46^6+O39*A46^5+P39*A46^4+Q39*A46^3+R39*A46^2+S39*A46+T39,N39*A46^6+O39*A46^5+P39*A46^4+Q39*A46^3+R39*A46^2+S39*A46+T39))","v":184.30000000000007},{"$f":"ABS(B39-B46)","v":5.6843418860808015E-14}]
[0.5,{"$f":"IF(A47>=0.85,N38*A47^6+O38*A47^5+P38*A47^4+Q38*A47^3+R38*A47^2+S38*A47 + T38,IF(A47>=0.5,N39*A47^6+O39*A47^5+P39*A47^4+Q39*A47^3+R39*A47^2+S39*A47+T39,N39*A47^6+O39*A47^5+P39*A47^4+Q39*A47^3+R39*A47^2+S39*A47+T39))","v":192.60000000000008},{"$f":"ABS(B40-B47)","v":8.5265128291212022E-14}]
[]
["Extrapolated example:",null,null,null,null,null,null,null,null,null,null,null,"formula",{"$f":"\"IF(VALUE>=0.85,\"&N38&\"*VALUE^6+\"&O38&\"*VALUE^5+\"&P38&\"*VALUE^4+\"&Q38&\"*VALUE^3+\"&R38&\"*VALUE^2+\"&S38&\"*VALUE + \"&T38&\",IF(VALUE>=0.5,\"&N39&\"*VALUE^6+\"&O39&\"*VALUE^5+\"&P39&\"*VALUE^4+\"&Q39&\"*VALUE^3+\"&R39&\"*VALUE^2+\"&S39&\"*VALUE+\"&T39&\",\"&N39&\"*VALUE^6+\"&O39&\"*VALUE^5+\"&P39&\"*VALUE^4+\"&Q39&\"*VALUE^3+\"&R39&\"*VALUE^2+\"&S39&\"*VALUE+\"&T39&\"))\"","v":"IF(VALUE>=0.85,0*VALUE^6+0*VALUE^5+0*VALUE^4+0*VALUE^3+0*VALUE^2+18.6666666666666*VALUE + 168.533333333333,IF(VALUE>=0.5,0*VALUE^6+0*VALUE^5+0*VALUE^4+-349.919413919413*VALUE^3+832.545054945053*VALUE^2+-658.352014652014*VALUE+357.37967032967,0*VALUE^6+0*VALUE^5+0*VALUE^4+-349.919413919413*VALUE^3+832.545054945053*VALUE^2+-658.352014652014*VALUE+357.37967032967))"}]
[0.93,{"$f":"IF(A50>=0.85,N38*A50^6+O38*A50^5+P38*A50^4+Q38*A50^3+R38*A50^2+S38*A50 + T38,IF(A50>=0.5,N39*A50^6+O39*A50^5+P39*A50^4+Q39*A50^3+R39*A50^2+S39*A50+T39,N39*A50^6+O39*A50^5+P39*A50^4+Q39*A50^3+R39*A50^2+S39*A50+T39))","v":185.89333333333335}]
[]
[]
["Reference data:"]
[1,184.7]
[0.85,181.9]
[0.75,181.8]
[0.5,189.2]
[]
[]
[]
[]
["Extrapolated ref:",null,"Deviation:"]
[1,{"$f":"IF(A63>=0,-33.523809524253*A63^3 + 157.828571429476*A63^2 - 187.076190476946*A63^1 + 247.471428571646,1)","v":184.69999999992297},{"$f":"ABS(B54-B63)","v":7.702283255639486E-11}]
[0.85,{"$f":"IF(A64>=0,-33.523809524253*A64^3 + 157.828571429476*A64^2 - 187.076190476946*A64^1 + 247.471428571646,1)","v":181.89999999995641},4.3598902266239747E-11]
[0.75,181.7999999999725,2.7512214728631079E-11]
[0.5,189.20000000001036,1.0373923942097463E-11]
[]
[]
[]
[]
["Extrapolated example:"]
[0.83,{"$f":"IF(A72>=0,-33.523809524253*A72^3 + 157.828571429476*A72^2 - 187.076190476946*A72^1 + 247.471428571646,1)","v":181.75781485710277}]
[]
[]
[]
["Reference data:"]
[1,176]
[0.85,172]
[0.75,178]
[0.65,182]
[0.5,183]
[0.25,198.5]
[]
[]
["Extrapolated ref:",null,"Deviation:"]
[1,{"$f":"IF(A86>=0.85,26.6666666666632*A86 + 149.333333333332,IF(A86>=0.75,-60.0000000000062*A86 + 223.000000000016,-543.333333333255*A86^3 + 898.999999999476*A86^2 - 498.541666666555*A86^1 + 275.437500000053))","v":175.9999999999952},{"$f":"ABS(B77-B86)","v":4.8032688937382773E-12}]
[0.85,{"$f":"IF(A87>=0.85,26.6666666666632*A87 + 149.333333333332,IF(A87>=0.75,-60.0000000000062*A87 + 223.000000000016,-543.333333333255*A87^3 + 898.999999999476*A87^2 - 498.541666666555*A87^1 + 275.437500000053))","v":171.99999999999574},4.2632564145606011E-12]
[0.75,178.00000000001134,1.1340262062731199E-11]
[0.65,181.99999999992568,7.4322770160506479E-11]
[0.5,182.99999999998761,1.2391865311656147E-11]
[0.25,198.50000000004937,{"$f":"ABS(B82-B91)","v":4.9368509280611761E-11}]
[]
[]
["Extrapolated example:"]
[0.83,{"$f":"IF(A95>=0.85,26.6666666666632*A95 + 149.333333333332,IF(A95>=0.75,-60.0000000000062*A95 + 223.000000000016,-543.333333333255*A95^3 + 898.999999999476*A95^2 - 498.541666666555*A95^1 + 275.437500000053))","v":173.20000000001085}]
[]
[]
[]
["Reference data:"]
[1,176.5]
[0.85,173]
[0.75,178]
[0.65,182]
[0.5,183]
[0.25,198.5]
[]
[]
["Extrapolated ref:",null,"Deviation:"]
[1,{"$f":"IF(A109>=0.85,23.3333333333278*A109 + 153.166666666668,IF(A109>=0.75,-50.0000000000147*A109 + 215.500000000017,-543.333333333255*A109^3 + 898.999999999476*A109^2 - 498.541666666555*A109^1 + 275.437500000053))","v":176.49999999999579},{"$f":"ABS(B100-B109)","v":4.2064129956997931E-12}]
[0.85,{"$f":"IF(A110>=0.85,23.3333333333278*A110 + 153.166666666668,IF(A110>=0.75,-50.0000000000147*A110 + 215.500000000017,-543.333333333255*A110^3 + 898.999999999476*A110^2 - 498.541666666555*A110^1 + 275.437500000053))","v":172.99999999999662},3.3821834222180769E-12]
[0.75,178.00000000000597,5.9685589803848416E-12]
[0.65,181.99999999992568,7.4322770160506479E-11]
[0.5,182.99999999998761,1.2391865311656147E-11]
[0.25,198.50000000004937,{"$f":"ABS(B105-B114)","v":4.9368509280611761E-11}]
[]
[]
["Extrapolated example:"]
[0.83,{"$f":"IF(A118>=0.85,23.3333333333278*A118 + 153.166666666668,IF(A118>=0.75,-50.0000000000147*A118 + 215.500000000017,-543.333333333255*A118^3 + 898.999999999476*A118^2 - 498.541666666555*A118^1 + 275.437500000053))","v":174.0000000000048}]
[]
[]
[]
["Reference data:"]
[1,175.5]
[0.85,171.5]
[0.75,171]
[0.65,173.5]
[0.5,178]
[0.25,196.5]
[]
[]
["Extrapolated ref:",null,"Deviation:"]
[1,{"$f":"IF(A132>=0,-2698.41271185874*A132^5 + 9014.28576010465*A132^4 - 11573.4127558171*A132^3 + 7161.94051017612*A132^2 - 2168.04961301665*A132^1 + 439.148810940739,1)","v":175.5000005290197},{"$f":"ABS(B123-B132)","v":5.2901970093444106E-7}]
[0.85,{"$f":"IF(A133>=0,-2698.41271185874*A133^5 + 9014.28576010465*A133^4 - 11573.4127558171*A133^3 + 7161.94051017612*A133^2 - 2168.04961301665*A133^1 + 439.148810940739,1)","v":171.50000030403027},3.0403026585190673E-7]
[0.75,171.00000024142702,2.4142701704477076E-7]
[0.65,173.5000002326845,2.3268449922397849E-7]
[0.5,178.00000026026174,2.6026174282378634E-7]
[0.25,196.5000003494261,{"$f":"ABS(B128-B137)","v":3.4942610227517434E-7}]
[]
[]
["Extrapolated example:"]
[0.78,{"$f":"IF(A141>=0,-2698.41271185874*A141^5 + 9014.28576010465*A141^4 - 11573.4127558171*A141^3 + 7161.94051017612*A141^2 - 2168.04961301665*A141^1 + 439.148810940739,1)","v":170.7726695867571}]
[]
[]
[]
["Reference data:"]
[1,176]
[0.85,172.5]
[0.75,172]
[0.65,173.5]
[0.5,178]
[0.25,196.5]
[]
[]
["Extrapolated ref:",null,"Deviation:"]
[1,{"$f":"IF(A155>=0,-984.126989364624*A155^5 + 3309.52382850646*A155^4 - 4302.46034145355*A155^3 + 2766.48810917139*A155^2 - 923.037702590227*A155^1 + 309.613096068185,1)","v":176.00000033763376},{"$f":"ABS(B146-B155)","v":3.3763376450224314E-7}]
[0.85,{"$f":"IF(A156>=0,-984.126989364624*A156^5 + 3309.52382850646*A156^4 - 4302.46034145355*A156^3 + 2766.48810917139*A156^2 - 923.037702590227*A156^1 + 309.613096068185,1)","v":172.50000019624508},1.9624508240667637E-7]
[0.75,172.00000017558932,1.7558932086103596E-7]
[0.65,173.50000019317486,1.9317485566716641E-7]
[0.5,178.00000024823447,2.4823447120070341E-7]
[0.25,196.50000035068035,{"$f":"ABS(B151-B160)","v":3.5068035231233807E-7}]
[]
[]
["Extrapolated example:"]
[0.83,{"$f":"IF(A164>=0,-984.126989364624*A164^5 + 3309.52382850646*A164^4 - 4302.46034145355*A164^3 + 2766.48810917139*A164^2 - 923.037702590227*A164^1 + 309.613096068185,1)","v":172.22739127380305}]
[]
[]
[]
["Reference data:"]
[1,176]
[0.85,174]
[0.75,183]
[0.5,183]
[0.25,200]
[0.1,248.5]
[]
[]
["Extrapolated ref:",null,"Deviation:"]
[1,{"$f":"IF(A178>=0.85,13.3333333333316*A178 + 162.666666666669,156.776556786615*A178^4 - 1023.66300368197*A178^3 + 1426.5311355435*A178^2 - 726.790293044539*A178^1 + 307.921703297768)","v":176.0000000000006},{"$f":"ABS(B169-B178)","v":5.9685589803848416E-13}]
[0.85,{"$f":"IF(A179>=0.85,13.3333333333316*A179 + 162.666666666669,156.776556786615*A179^4 - 1023.66300368197*A179^3 + 1426.5311355435*A179^2 - 726.790293044539*A179^1 + 307.921703297768)","v":174.00000000000085},8.5265128291212022E-13]
[0.75,183.00000000001631,1.63140612130519E-11]
[0.5,183.0000000002907,2.9069724405417219E-10]
[0.25,200.00000000051892,5.1892357078031637E-10]
[0.1,248.50000000074576,7.4575723374437075E-10]
[]
[]
["Extrapolated example:"]
[0.83,{"$f":"IF(A187>=0.85,13.3333333333316*A187 + 162.666666666669,156.776556786615*A187^4 - 1023.66300368197*A187^3 + 1426.5311355435*A187^2 - 726.790293044539*A187^1 + 307.921703297768)","v":176.50938303295425}]
[]
[]
[]
["Reference data:"]
[1,176.5]
[0.85,175]
[0.75,183]
[0.5,183]
[0.25,200]
[0.1,248.5]
[]
[]
["Extrapolated ref:",null,"Deviation:"]
[1,{"$f":"IF(A201>=0.85,10.0000000000012*A201 + 166.500000000005,220.268620280083*A201^4 - 1125.25030527152*A201^3 + 1479.70573871962*A201^2 - 737.107753362321*A201^1 + 308.516941393028)","v":176.5000000000062},{"$f":"ABS(B192-B201)","v":6.1959326558280736E-12}]
[0.85,{"$f":"IF(A202>=0.85,10.0000000000012*A202 + 166.500000000005,220.268620280083*A202^4 - 1125.25030527152*A202^3 + 1479.70573871962*A202^2 - 737.107753362321*A202^1 + 308.516941393028)","v":175.00000000000603},6.0254023992456496E-12]
[0.75,183.00000000014609,1.460875864722766E-10]
[0.5,183.00000000033771,3.3770675145206042E-10]
[0.25,200.00000000052557,5.2557425078703091E-10]
[0.1,248.50000000074857,7.4857098297798075E-10]
[]
[]
["Extrapolated example:"]
[0.4,{"$f":"IF(A210>=0.85,10.0000000000012*A210 + 166.500000000005,220.268620280083*A210^4 - 1125.25030527152*A210^3 + 1479.70573871962*A210^2 - 737.107753362321*A210^1 + 308.516941393028)","v":184.04961538503164}]
[]
[]
[]
["Reference data:"]
[1,174.5]
[0.85,173]
[0.75,182]
[0.65,178]
[0.5,182]
[0.25,198]
[0.1,238]
[]
["Extrapolated ref:",null,"Deviation:"]
[1,{"$f":"IF(A224>=0.85,9.99999999999617*A224 + 164.500000000007,-8843.15685164928*A224^5 + 21586.6134075522*A224^4 - 19888.8078777552*A224^3 + 8667.81768990636*A224^2 - 1852.02131308377*A224^1 + 354.342532440556)","v":174.50000000000315},{"$f":"ABS(B215-B224)","v":3.1548097467748448E-12}]
[0.85,{"$f":"IF(A225>=0.85,9.99999999999617*A225 + 164.500000000007,-8843.15685164928*A225^5 + 21586.6134075522*A225^4 - 19888.8078777552*A225^3 + 8667.81768990636*A225^2 - 1852.02131308377*A225^1 + 354.342532440556)","v":173.00000000000372},3.723243935382925E-12]
[0.75,182.00000006127817,6.1278171870071674E-8]
[0.65,178.00000003756764,3.7567644994851435E-8]
[0.5,182.00000001383324,1.3833243883709656E-8]
[0.25,197.999999959148,4.0852000893210061E-8]
[0.1,237.99999992572612,7.4273884820286185E-8]
[]
["Extrapolated example:"]
[0.83,{"$f":"IF(A233>=0.85,9.99999999999617*A233 + 164.500000000007,-8843.15685164928*A233^5 + 21586.6134075522*A233^4 - 19888.8078777552*A233^3 + 8667.81768990636*A233^2 - 1852.02131308377*A233^1 + 354.342532440556)","v":177.55151803762107}]
[]
[]
[]
["Reference data:"]
[1,174.5]
[0.85,171]
[0.75,180]
[0.65,178]
[0.5,182]
[0.25,198]
[0.1,238]
[]
["Extrapolated ref:",null,"Deviation:"]
[1,{"$f":"IF(A247>=0.85,23.3333333333328*A247 + 151.166666666665,-7016.53902375698*A247^5 + 17230.5694482922*A247^4 - 16090.1021365166*A247^3 + 7191.39644346774*A247^2 - 1606.88333976646*A247^1 + 341.211580050282)","v":174.49999999999781},{"$f":"ABS(B238-B247)","v":2.1884716261411086E-12}]
[0.85,{"$f":"IF(A248>=0.85,23.3333333333328*A248 + 151.166666666665,-7016.53902375698*A248^5 + 17230.5694482922*A248^4 - 16090.1021365166*A248^3 + 7191.39644346774*A248^2 - 1606.88333976646*A248^1 + 341.211580050282)","v":170.9999999999979},2.1032064978498966E-12]
[0.75,179.99999996759857,3.2401430871686898E-8]
[0.65,177.99999998435374,1.5646264728275128E-8]
[0.5,181.99999999526892,4.7310777517850511E-9]
[0.25,197.99999995933263,4.0667373468750156E-8]
[0.1,237.99999992638845,7.361154530372005E-8]
[]
["Extrapolated example:"]
[0.83,{"$f":"IF(A256>=0.85,23.3333333333328*A256 + 151.166666666665,-7016.53902375698*A256^5 + 17230.5694482922*A256^4 - 16090.1021365166*A256^3 + 7191.39644346774*A256^2 - 1606.88333976646*A256^1 + 341.211580050282)","v":175.03590773764267}]
[]
[]
[]
["Reference data:"]
[1,175]
[0.85,174]
[0.75,183]
[0.65,179]
[0.5,182]
[0.25,198]
[0.1,238]
[]
["Extrapolated ref:",null,"Deviation:"]
[1,{"$f":"IF(A270>=0.85,6.6666666666658*A270 + 168.333333333333,-8241.31424945592*A270^5 + 20052.5141722857*A270^4 - 18458.6152916491*A270^3 + 8081.21770620942*A270^2 - 1751.10545110288*A270^1 + 348.834144990409)","v":174.99999999999881},{"$f":"ABS(B261-B270)","v":1.1937117960769683E-12}]
[0.85,{"$f":"IF(A271>=0.85,6.6666666666658*A271 + 168.333333333333,-8241.31424945592*A271^5 + 20052.5141722857*A271^4 - 18458.6152916491*A271^3 + 8081.21770620942*A271^2 - 1751.10545110288*A271^1 + 348.834144990409)","v":173.99999999999892},1.0800249583553523E-12]
[0.75,183.00000000992173,9.921734545059735E-9]
[0.65,179.00000001219547,1.2195471299492056E-8]
[0.5,182.00000000754511,7.5451112024893519E-9]
[0.25,197.99999995951731,4.0482689200871391E-8]
[0.1,237.99999992530013,7.469986940122908E-8]
[]
["Extrapolated example:"]
[0.83,{"$f":"IF(A279>=0.85,6.6666666666658*A279 + 168.333333333333,-8241.31424945592*A279^5 + 20052.5141722857*A279^4 - 18458.6152916491*A279^3 + 8081.21770620942*A279^2 - 1751.10545110288*A279^1 + 348.834144990409)","v":178.47060303617292}]
[]
[]
[]
["Reference data:"]
[1,175]
[0.85,172]
[0.75,181]
[0.65,179]
[0.5,182]
[0.25,198]
[0.1,238]
[]
["Extrapolated ref:",null,"Deviation:"]
[1,{"$f":"IF(A293>=0.85,19.9999999999974*A293 + 155.000000000001,-6414.6964213252*A293^5 + 15696.4702125489*A293^4 - 14659.909549588*A293^3 + 6604.79645950556*A293^2 - 1505.96747775728*A293^1 + 335.703192599174)","v":174.99999999999841},{"$f":"ABS(B284-B293)","v":1.5916157281026244E-12}]
[0.85,{"$f":"IF(A294>=0.85,19.9999999999974*A294 + 155.000000000001,-6414.6964213252*A294^5 + 15696.4702125489*A294^4 - 14659.909549588*A294^3 + 6604.79645950556*A294^2 - 1505.96747775728*A294^1 + 335.703192599174)","v":171.99999999999878},1.2221335055073723E-12]
[0.75,181.00000004000987,4.000986564278719E-8]
[0.65,179.00000003277563,3.2775631098047597E-8]
[0.5,182.00000001631798,1.6317983408953296E-8]
[0.25,197.99999996045773,3.9542271679238183E-8]
[0.1,237.99999992595522,7.4044777420567698E-8]
[]
["Extrapolated example:"]
[0.83,{"$f":"IF(A302>=0.85,19.9999999999974*A302 + 155.000000000001,-6414.6964213252*A302^5 + 15696.4702125489*A302^4 - 14659.909549588*A302^3 + 6604.79645950556*A302^2 - 1505.96747775728*A302^1 + 335.703192599174)","v":175.95499291391576}]
[]
[]
[]
["Reference data:"]
[1,7154]
[0.85,7243]
[0.75,7345]
[0.5,7788]
[]
[]
["Extrapolated ref:",null,"Deviation:"]
[1,{"$f":"-883.809523805975*A314^3 + 4004.57142857462*A314^2 - 5728.19047619961*A314 + 9761.42857143228","v":7154.0000000013142},{"$f":"ABS(B307-B314)","v":1.3142198440618813E-9}]
[0.85,{"$f":"-883.809523805975*A315^3 + 4004.57142857462*A315^2 - 5728.19047619961*A315 + 9761.42857143228","v":7243.0000000004293},{"$f":"ABS(B308-B315)","v":4.2928149923682213E-10}]
[0.75,7345.000000000151,1.5097612049430609E-10]
[0.5,7788.000000000382,3.8198777474462986E-10]
[]
["Extrapolated example:"]
[0.93,{"$f":"-883.809523805975*A320^3 + 4004.57142857462*A320^2 - 5728.19047619961*A320 + 9761.42857143228","v":7186.866880000829}]
[]
[]
["Reference data:"]
[1,3.8]
[0.85,4.4000000000000004]
[0.75,5]
[0.5,7.6]
[0.1,20]
[]
["Extrapolated ref:",null,"Deviation:"]
[1,{"$f":"IF(A331>=0.85,-4.00000000000008*A331 + 7.79999999999999,IF(A331>=0.5,12.571428571428*A331^2 - 26.114285714285*A331 + 17.5142857142855,-31*A331 + 23.1))","v":3.7999999999999101},{"$f":"ABS(B324-B331)","v":8.9706020389712648E-14}]
[0.85,{"$f":"IF(A332>=0.85,-4.00000000000008*A332 + 7.79999999999999,IF(A332>=0.5,12.571428571428*A332^2 - 26.114285714285*A332 + 17.5142857142855,-31*A332 + 23.1))","v":4.3999999999999222},7.815970093361102E-14]
[0.75,5,0]
[0.5,7.6,0]
[]
["Extrapolated example:"]
[0.93,{"$f":"IF(A337>=0.85,-4.00000000000008*A337 + 7.79999999999999,IF(A337>=0.5,12.571428571428*A337^2 - 26.114285714285*A337 + 17.5142857142855,-31*A337 + 23.1))","v":4.0799999999999157}]
[]
[]
["Reference data:"]
[1,7097]
[0.85,7121]
[0.75,7226]
[0.5,7484]
[0.1,{"$f":"B341*1.6","v":11355.2}]
[]
["Extrapolated ref:",null,"Deviation:"]
[1,{"$f":"IF(A348>=0.85,-160.000000000262*A348 + 7257.00000000004,IF(A348>=0.5,-51.4285714295692*A348^2 - 967.714285712921*A348 + 7980.71428571386,-9677.99999999999*A348 + 12323))","v":7096.9999999997781},{"$f":"ABS(B341-B348)","v":2.2191670723259449E-10}]
[0.85,{"$f":"IF(A349>=0.85,-160.000000000262*A349 + 7257.00000000004,IF(A349>=0.5,-51.4285714295692*A349^2 - 967.714285712921*A349 + 7980.71428571386,-9677.99999999999*A349 + 12323))","v":7120.9999999998172},1.8280843505635858E-10]
[0.75,7226.0000000000364,3.637978807091713E-11]
[0.5,7484.0000000000073,7.2759576141834259E-12]
[]
["Extrapolated example:"]
[0.93,{"$f":"IF(A354>=0.85,-160.000000000262*A354 + 7257.00000000004,IF(A354>=0.5,-51.4285714295692*A354^2 - 967.714285712921*A354 + 7980.71428571386,-9677.99999999999*A354 + 12323))","v":7108.1999999997961}]
[]
[]
["Reference data:"]
[1,175.8]
[0.85,174.9]
[0.75,177.6]
[0.5,184.5]
[0.1,{"$f":"B358*1.6","v":281.28000000000003}]
[]
["Extrapolated ref:",null,"Deviation:"]
[1,{"$f":"IF(A365>=0.85,5.99999999999972*A365 + 169.800000000005,IF(A365>=0.5,1.71428571428987*A365^2 - 29.7428571428645*A365 + 198.94285714286, -241.95*A365 + 305.475))","v":175.80000000000473},{"$f":"ABS(B358-B365)","v":4.7180037654470652E-12}]
[0.85,174.90000000000478,4.7748471843078732E-12]
[0.75,177.59999999999968,3.1263880373444408E-13]
[0.5,184.5000000000002,1.9895196601282805E-13]
[]
["Extrapolated example:"]
[0.93,{"$f":"IF(A371>=0.85,5.99999999999972*A371 + 169.800000000005,IF(A371>=0.5,1.71428571428987*A371^2 - 29.7428571428645*A371 + 198.94285714286, -241.95*A371 + 305.475))","v":175.38000000000474}]
[]
[]
[100,184,null,null,null,null,null,null,null,null,null,null,null,null,100,182.2]
[85,182,null,null,null,null,null,null,null,null,null,null,null,null,85,179.9]
[75,182,null,null,null,null,null,null,null,null,null,null,null,null,75,180.1]
[50,190,null,null,null,null,null,null,null,null,null,null,null,null,50,188.3]
[]
[]
[100,{"$f":"-0.0000761904761912291*A380^3+0.0251428571429706*A380^2-2.55809523809908*A380+264.571428571357","v":183.99999999992593},null,null,null,null,null,null,null,null,null,null,null,null,100,{"$f":"-0.0000373333333341108*O380^3 + 0.016640000000125*O380^2 - 1.96466666667158*O380 + 249.599999999957","v":182.1999999999382}]
[85,{"$f":"-0.0000761904761912291*A381^3+0.0251428571429706*A381^2-2.55809523809908*A381+264.571428571357","v":181.99999999995924},null,null,null,null,null,null,null,null,null,null,null,null,85,{"$f":"-0.0000373333333341108*O381^3 + 0.016640000000125*O381^2 - 1.96466666667158*O381 + 249.599999999957","v":179.89999999996502}]
[75,181.99999999996086,null,null,null,null,null,null,null,null,null,null,null,null,75,180.09999999996361]
[50,189.99999999992588,null,null,null,null,null,null,null,null,null,null,null,null,50,188.29999999992663]
[]
[]
[100,{"$f":"-0.0000761904761912291*A386^3+0.0251428571429706*A386^2-2.55809523809908*A386+264.571428571357","v":183.99999999992593},null,null,null,null,null,null,null,null,null,null,null,null,100,{"$f":"-0.0000373333333341108*O386^3 + 0.016640000000125*O386^2 - 1.96466666667158*O386 + 249.599999999957","v":182.1999999999382}]
[]
[]
[]
[]
[100,179.1,null,null,null,null,null,null,null,null,null,null,null,null,null,null,100,170.6]
[95,178.4,null,null,null,null,null,null,null,null,null,null,null,null,null,null,85,168.5]
[90,177.7,null,null,null,null,null,null,null,null,null,null,null,null,null,null,75,172.3]
[85,176.9,null,null,null,null,null,null,null,null,null,null,null,null,null,null,50,179.5]
[80,178.8,null,null,null,null,null,null,null,null,null,null,null,null,null,null,25,201.2]
[75,180.9]
[70,182.2]
[65,183.6,null,null,null,null,null,null,null,null,null,null,null,null,null,null,100,{"$f":"0.0000094095238095*Q398^4 - 0.0024483809523768*Q398^3 + 0.231833333333307*Q398^2 - 9.74919047618003*Q398 + 334.614285714366","v":170.60000000263301}]
[60,185.4,null,null,null,null,null,null,null,null,null,null,null,null,null,null,85,{"$f":"0.0000094095238095*Q399^4 - 0.0024483809523768*Q399^3 + 0.231833333333307*Q399^2 - 9.74919047618003*Q399 + 334.614285714366","v":168.50000000208524}]
[55,187.3,null,null,null,null,null,null,null,null,null,null,null,null,null,null,75,172.30000000171401]
[50,188.5,null,null,null,null,null,null,null,null,null,null,null,null,null,null,25,201.20000000038061]
[45,191]
[40,194.2]
[35,198.2,null,null,null,null,null,null,null,null,null,null,null,null,null,null,100,{"$f":"-0.0000761904761912291*Q404^3+0.0251428571429706*Q404^2-2.55809523809908*Q404+264.571428571357","v":183.99999999992593}]
[30,203.7]
[25,211.3]
[20,222.9]
[15,242.3]
[10,281]
[]
[]
[100,{"$f":"IF(A412<=50,0.0000001398518532*A412^6 - 0.0000291117951081*A412^5 + 0.0025053561426172*A412^4 - 0.115128609816081*A412^3 + 3.03836961152705*A412^2 - 45.8143779368619*A412 + 528.148890228893,IF(A412<=85,0.0000001155555561*A412^6-0.0000450769232605*A412^5+0.0072506837920165*A412^4-0.615384968179415*A412^3+29.058241291203*A412^2-723.973502671241*A412+7628.9028828465,-0.0020000000000024*A412^2 + 0.510000000000488*A412 + 147.999999999976))","v":179.0000000000008}]
[85,{"$f":"IF(A413<=50,0.0000001398518532*A413^6 - 0.0000291117951081*A413^5 + 0.0025053561426172*A413^4 - 0.115128609816081*A413^3 + 3.03836961152705*A413^2 - 45.8143779368619*A413 + 528.148890228893,IF(A413<=85,0.0000001155555561*A413^6-0.0000450769232605*A413^5+0.0072506837920165*A413^4-0.615384968179415*A413^3+29.058241291203*A413^2-723.973502671241*A413+7628.9028828465,-0.0020000000000024*A413^2 + 0.510000000000488*A413 + 147.999999999976))","v":176.89931468655232}]
[75,{"$f":"IF(A414<=50,0.0000001398518532*A414^6 - 0.0000291117951081*A414^5 + 0.0025053561426172*A414^4 - 0.115128609816081*A414^3 + 3.03836961152705*A414^2 - 45.8143779368619*A414 + 528.148890228893,IF(A414<=85,0.0000001155555561*A414^6-0.0000450769232605*A414^5+0.0072506837920165*A414^4-0.615384968179415*A414^3+29.058241291203*A414^2-723.973502671241*A414+7628.9028828465,-0.0020000000000024*A414^2 + 0.510000000000488*A414 + 147.999999999976))","v":180.88532055671203}]
[50,{"$f":"IF(A415<=50,0.0000001398518532*A415^6 - 0.0000291117951081*A415^5 + 0.0025053561426172*A415^4 - 0.115128609816081*A415^3 + 3.03836961152705*A415^2 - 45.8143779368619*A415 + 528.148890228893,IF(A415<=85,0.0000001155555561*A415^6-0.0000450769232605*A415^5+0.0072506837920165*A415^4-0.615384968179415*A415^3+29.058241291203*A415^2-723.973502671241*A415+7628.9028828465,-0.0020000000000024*A415^2 + 0.510000000000488*A415 + 147.999999999976))","v":188.50292151954875}]
[]
[]
[100,{"$f":"IF(A418<=50,0.0000001398518532*A418^6 - 0.0000291117951081*A418^5 + 0.0025053561426172*A418^4 - 0.115128609816081*A418^3 + 3.03836961152705*A418^2 - 45.8143779368619*A418 + 528.148890228893,IF(A418<=85,0.0000001155555561*A418^6-0.0000450769232605*A418^5+0.0072506837920165*A418^4-0.615384968179415*A418^3+29.058241291203*A418^2-723.973502671241*A418+7628.9028828465,-0.0020000000000024*A418^2 + 0.510000000000488*A418 + 147.999999999976))","v":179.0000000000008}]
[]
[]
[]
[]
[100,173.4]
[85,170.6]
[75,171.5]
[50,180.4]
[]
[]
[100,{"$f":"IF(A429<=85,0.00760000000000005*A429^2 - 1.306*A429 + 226.7,0.1867*A429 + 154.73)","v":173.39999999999998}]
[85,{"$f":"IF(A430<=85,0.00760000000000005*A430^2 - 1.306*A430 + 226.7,0.1867*A430 + 154.73)","v":170.60000000000036}]
[75,171.50000000000028]
[50,180.40000000000012]
[]
[]
[100,{"$f":"IF(A435<=85,0.00760000000000005*A435^2 - 1.306*A435 + 226.7,0.1867*A435 + 154.73)","v":173.39999999999998}]