{"text_format":"1","workbook":"xlsx","n_sheets":4,"sheets":["p1","p2","p3","p4"],"not_rendered":{"charts":23,"images":0,"macros":0,"external_links":0,"defined_names":2,"comments":0,"pivot_tables":0},"unopened":[],"bounds":{"document_bytes":16777216,"sheet_cells":100000,"rows_first":2000,"rows_last":500,"rows_between":2000,"halvings":0,"cell_chars":16384,"cell_head_chars":4096},"cells_cut":0,"cells_raw":0,"read":"whole","date_system":"1900"}

{"sheet":"p1","index":0,"n_rows":6,"n_cols":3,"rows_kept":6,"cut":false,"hidden":false,"merged":[]}
[]
["Set","Set 48"]
[]
[]
[]
[null,null,0.89]

{"sheet":"p2","index":1,"n_rows":91,"n_cols":7,"rows_kept":91,"cut":false,"hidden":false,"merged":[]}
[]
[]
[null,"M1","M2","M3","M4","M5","M6"]
[null,23399.200000000001,23250,26274,7465.3,5511.8]
[null,5,5,6,2,2]
[null,0.96699999999999997,0.96099999999999997,0.90500000000000003,0.77100000000000002,0.56899999999999995]
[]
[null,{"$f":"'p1'!B2","v":"Set 48"}]
[null,{"$f":"SUMIF('p3'!A2:A68,'p1'!B2,'p3'!B2:B68)","v":6360}]
[null,0.96]
[]
[]
[null,{"$f":"B5","v":5},{"$f":"C5","v":5},6,{"$f":"E5","v":2},2]
[null,{"$f":"B4/B13/$B9/$B10","v":0.76648322851153039},{"$f":"C4/C13/$B9/$B10","v":0.76159591194968557},0.71721042976939209,{"$f":"E4/E13/$B9/$B10","v":0.6113485980083857},0.45137251048218036]
["formula",{"$f":"\"=\"&SUBSTITUTE(_xlfn.XLOOKUP('p1'!$B$2,'p3'!$A$2:$A$68,'p3'!$C$2:$C$68),\"VALUE\",B14)","v":"=IF(0.76648322851153>=0.85,-4.00000000000008*0.76648322851153 + 7.79999999999999,IF(0.76648322851153>=0.5,12.571428571428*0.76648322851153^2 - 26.114285714285*0.76648322851153 + 17.5142857142855,-31*0.76648322851153 + 23.1))"},{"$f":"\"=\"&SUBSTITUTE(_xlfn.XLOOKUP('p1'!$B$2,'p3'!$A$2:$A$68,'p3'!$C$2:$C$68),\"VALUE\",C14)","v":"=IF(0.761595911949686>=0.85,-4.00000000000008*0.761595911949686 + 7.79999999999999,IF(0.761595911949686>=0.5,12.571428571428*0.761595911949686^2 - 26.114285714285*0.761595911949686 + 17.5142857142855,-31*0.761595911949686 + 23.1))"},{"$f":"\"=\"&SUBSTITUTE(_xlfn.XLOOKUP('p1'!$B$2,'p3'!$A$2:$A$68,'p3'!$C$2:$C$68),\"VALUE\",D14)","v":"=IF(0.717210429769392>=0.85,-4.00000000000008*0.717210429769392 + 7.79999999999999,IF(0.717210429769392>=0.5,12.571428571428*0.717210429769392^2 - 26.114285714285*0.717210429769392 + 17.5142857142855,-31*0.717210429769392 + 23.1))"},{"$f":"\"=\"&SUBSTITUTE(_xlfn.XLOOKUP('p1'!$B$2,'p3'!$A$2:$A$68,'p3'!$C$2:$C$68),\"VALUE\",E14)","v":"=IF(0.611348598008386>=0.85,-4.00000000000008*0.611348598008386 + 7.79999999999999,IF(0.611348598008386>=0.5,12.571428571428*0.611348598008386^2 - 26.114285714285*0.611348598008386 + 17.5142857142855,-31*0.611348598008386 + 23.1))"},{"$f":"\"=\"&SUBSTITUTE(_xlfn.XLOOKUP('p1'!$B$2,'p3'!$A$2:$A$68,'p3'!$C$2:$C$68),\"VALUE\",F14)","v":"=IF(0.45137251048218>=0.85,-4.00000000000008*0.45137251048218 + 7.79999999999999,IF(0.45137251048218>=0.5,12.571428571428*0.45137251048218^2 - 26.114285714285*0.45137251048218 + 17.5142857142855,-31*0.45137251048218 + 23.1))"}]
[null,{"$f":"TextToFormula","v":4.8837944731378045},{"$f":"TextToFormula","v":4.9175372297518685},{"$f":"TextToFormula","v":5.2514748411878323},{"$f":"TextToFormula","v":6.2478888304724531},{"$f":"TextToFormula","v":9.1074521750524209}]
[null,{"$f":"B14","v":0.76648322851153039},{"$f":"C14","v":0.76159591194968557},0.71721042976939209,{"$f":"E14","v":0.6113485980083857},0.45137251048218036]
["formula",{"$f":"\"=\"&SUBSTITUTE(_xlfn.XLOOKUP('p1'!$B$2,'p3'!$A$2:$A$68,'p3'!$D$2:$D$68),\"VALUE\",B17)","v":"=IF(0.76648322851153>=0.85,-160.000000000262*0.76648322851153 + 7257.00000000004,IF(0.76648322851153>=0.5,-51.4285714295692*0.76648322851153^2 - 967.714285712921*0.76648322851153 + 7980.71428571386,-9677.99999999999*0.76648322851153 + 12323))"},{"$f":"\"=\"&SUBSTITUTE(_xlfn.XLOOKUP('p1'!$B$2,'p3'!$A$2:$A$68,'p3'!$D$2:$D$68),\"VALUE\",C17)","v":"=IF(0.761595911949686>=0.85,-160.000000000262*0.761595911949686 + 7257.00000000004,IF(0.761595911949686>=0.5,-51.4285714295692*0.761595911949686^2 - 967.714285712921*0.761595911949686 + 7980.71428571386,-9677.99999999999*0.761595911949686 + 12323))"},{"$f":"\"=\"&SUBSTITUTE(_xlfn.XLOOKUP('p1'!$B$2,'p3'!$A$2:$A$68,'p3'!$D$2:$D$68),\"VALUE\",D17)","v":"=IF(0.717210429769392>=0.85,-160.000000000262*0.717210429769392 + 7257.00000000004,IF(0.717210429769392>=0.5,-51.4285714295692*0.717210429769392^2 - 967.714285712921*0.717210429769392 + 7980.71428571386,-9677.99999999999*0.717210429769392 + 12323))"},{"$f":"\"=\"&SUBSTITUTE(_xlfn.XLOOKUP('p1'!$B$2,'p3'!$A$2:$A$68,'p3'!$D$2:$D$68),\"VALUE\",E17)","v":"=IF(0.611348598008386>=0.85,-160.000000000262*0.611348598008386 + 7257.00000000004,IF(0.611348598008386>=0.5,-51.4285714295692*0.611348598008386^2 - 967.714285712921*0.611348598008386 + 7980.71428571386,-9677.99999999999*0.611348598008386 + 12323))"},{"$f":"\"=\"&SUBSTITUTE(_xlfn.XLOOKUP('p1'!$B$2,'p3'!$A$2:$A$68,'p3'!$D$2:$D$68),\"VALUE\",F17)","v":"=IF(0.45137251048218>=0.85,-160.000000000262*0.45137251048218 + 7257.00000000004,IF(0.45137251048218>=0.5,-51.4285714295692*0.45137251048218^2 - 967.714285712921*0.45137251048218 + 7980.71428571386,-9677.99999999999*0.45137251048218 + 12323))"}]
[null,{"$f":"TextToFormula","v":7208.7634079729896},{"$f":"TextToFormula","v":7213.8770132196596},{"$f":"TextToFormula","v":7260.2051229338886},{"$f":"TextToFormula","v":7369.8822340154547},{"$f":"TextToFormula","v":7954.6168435534655}]
[]
[null,14]
[null,6.1999999999999998E-3,0.1401,8.2600000000000007E-2,6.8999999999999999E-3,0.76419999999999999]
[null,{"$f":"$B21*B22","v":8.6800000000000002E-2},{"$f":"$B21*C22","v":1.9614},1.1564000000000001,9.6599999999999991E-2,10.6988]
[]
[null,{"$f":"$B9*B14*B16/1000/'p1'!$C$6/1000*24*B23*B13","v":0.27863015448290568},{"$f":"$B9*C14*C16/1000/'p1'!$C$6/1000*24*C23*C13","v":6.2992201515904798},{"$f":"$B9*D14*D16/1000/'p1'!$C$6/1000*24*D23*D13","v":4.4819351649952148},{"$f":"$B9*E14*E16/1000/'p1'!$C$6/1000*24*E23*E13","v":0.12656326992583625},{"$f":"$B9*F14*F16/1000/'p1'!$C$6/1000*24*F23*F13","v":15.086045765943233}]
[null,{"$f":"$B9*B14*B19*24*B23*B13/49700/1000/0.45","v":16.366379339001842},{"$f":"$B9*C14*C19*24*C23*C13/49700/1000/0.45","v":367.72992084641197},{"$f":"$B9*D14*D19*24*D23*D13/49700/1000/0.45","v":246.57797165003308},{"$f":"$B9*E14*E19*24*E23*E13/49700/1000/0.45","v":5.9409520298436531},{"$f":"$B9*F14*F19*24*F23*F13/49700/1000/0.45","v":524.34712503604578}]
[]
[null,1]
[null,0.90580000000000005,9.4200000000000006E-2,0,0,0]
[null,{"$f":"$B28*B29","v":0.90580000000000005},{"$f":"$B28*C29","v":9.4200000000000006E-2},{"$f":"$B28*D29","v":0},{"$f":"$B28*E29","v":0},{"$f":"$B28*F29","v":0}]
[]
[null,{"$f":"$B9*B14*B16/1000/'p1'!$C$6/1000*24*B30*B13","v":2.9076404830716123},{"$f":"$B9*C14*C16/1000/'p1'!$C$6/1000*24*C30*C13","v":0.30253213943092849},{"$f":"$B9*D14*D16/1000/'p1'!$C$6/1000*24*D30*D13","v":0},{"$f":"$B9*E14*E16/1000/'p1'!$C$6/1000*24*E30*E13","v":0},{"$f":"$B9*F14*F16/1000/'p1'!$C$6/1000*24*F30*F13","v":0}]
[null,{"$f":"$B16*B21*B26*24*B30*B20/49700/1000/0.45","v":0},{"$f":"$B16*C21*C26*24*C30*C20/49700/1000/0.45","v":0},{"$f":"$B16*D21*D26*24*D30*D20/49700/1000/0.45","v":0},{"$f":"$B16*E21*E26*24*E30*E20/49700/1000/0.45","v":0},{"$f":"$B16*F21*F26*24*F30*F20/49700/1000/0.45","v":0}]
[]
[]
[null,{"$f":"MAX(SUM(B25:F25),SUM(B32:F32))","v":26.272394506937669},{"$f":"SUM(B26:F26)","v":1160.9623489013363}]
[null,0.98]
[null,null,0.98]
[null,1.1000000000000001,1.05]
[null,{"$f":"B36/B37*B39","v":29.489422405746367},{"$f":"C36/C38*C39","v":1243.8882309657176}]
{"$rows_left_out":52}
{"sheet":"p3","index":2,"n_rows":67,"n_cols":5,"rows_kept":67,"cut":false,"hidden":false,"merged":[]}
[null,"P","D1","D2","D3"]
[]
["Set 01",957.9]
["Set 02",1603]
["Set 03",1825]
["Set 04",1889]
["Set 05",2500]
["Set 06",1930]
["Set 07",1930]
["Set 08",3800]
["Set 09",5420]
["Set 10",6000]
["Set 11",7680]
["Set 12",3600,"IF(VALUE>=0.85,19.9999999999974*VALUE + 155.000000000001,-6414.6964213252*VALUE^5 + 15696.4702125489*VALUE^4 - 14659.909549588*VALUE^3 + 6604.79645950556*VALUE^2 - 1505.96747775728*VALUE^1 + 335.703192599174)",null,{"$f":"13*0.000755858*1000","v":9.8261540000000007}]
["Set 13",4060,"IF(VALUE>=0.85,10.0000000000012*VALUE + 166.500000000005,220.268620280083*VALUE^4 - 1125.25030527152*VALUE^3 + 1479.70573871962*VALUE^2 - 737.107753362321*VALUE^1 + 308.516941393028)",null,{"$f":"13*0.000755858*1000","v":9.8261540000000007}]
["Set 14",4800,"IF(VALUE>=0.85,19.9999999999974*VALUE + 155.000000000001,-6414.6964213252*VALUE^5 + 15696.4702125489*VALUE^4 - 14659.909549588*VALUE^3 + 6604.79645950556*VALUE^2 - 1505.96747775728*VALUE^1 + 335.703192599174)",null,9.8261540000000007]
["Set 15",5400,"IF(VALUE>=0.85,19.9999999999974*VALUE + 155.000000000001,-6414.6964213252*VALUE^5 + 15696.4702125489*VALUE^4 - 14659.909549588*VALUE^3 + 6604.79645950556*VALUE^2 - 1505.96747775728*VALUE^1 + 335.703192599174)",null,9.8261540000000007]
["Set 16",6000,"IF(VALUE>=0.85,19.9999999999974*VALUE + 155.000000000001,-6414.6964213252*VALUE^5 + 15696.4702125489*VALUE^4 - 14659.909549588*VALUE^3 + 6604.79645950556*VALUE^2 - 1505.96747775728*VALUE^1 + 335.703192599174)",null,9.8261540000000007]
["Set 17",7200,"IF(VALUE>=0.85,23.3333333333328*VALUE + 151.166666666665,-7016.53902375698*VALUE^5 + 17230.5694482922*VALUE^4 - 16090.1021365166*VALUE^3 + 7191.39644346774*VALUE^2 - 1606.88333976646*VALUE^1 + 341.211580050282)",null,9.8261540000000007]
["Set 18",8120,"IF(VALUE>=0.85,13.3333333333316*VALUE + 162.666666666669,156.776556786615*VALUE^4 - 1023.66300368197*VALUE^3 + 1426.5311355435*VALUE^2 - 726.790293044539*VALUE^1 + 307.921703297768)",null,9.8261540000000007]
["Set 19",9600,"IF(VALUE>=0.85,23.3333333333328*VALUE + 151.166666666665,-7016.53902375698*VALUE^5 + 17230.5694482922*VALUE^4 - 16090.1021365166*VALUE^3 + 7191.39644346774*VALUE^2 - 1606.88333976646*VALUE^1 + 341.211580050282)",null,9.8261540000000007]
["Set 20",12000,"IF(VALUE>=0.85,23.3333333333328*VALUE + 151.166666666665,-7016.53902375698*VALUE^5 + 17230.5694482922*VALUE^4 - 16090.1021365166*VALUE^3 + 7191.39644346774*VALUE^2 - 1606.88333976646*VALUE^1 + 341.211580050282)",null,9.8261540000000007]
["Set 21",3600,"IF(VALUE>=0.85,6.6666666666658*VALUE + 168.333333333333,-8241.31424945592*VALUE^5 + 20052.5141722857*VALUE^4 - 18458.6152916491*VALUE^3 + 8081.21770620942*VALUE^2 - 1751.10545110288*VALUE^1 + 348.834144990409)",null,9.8261540000000007]
["Set 22",4060,"IF(VALUE>=0.85,10.0000000000012*VALUE + 166.500000000005,220.268620280083*VALUE^4 - 1125.25030527152*VALUE^3 + 1479.70573871962*VALUE^2 - 737.107753362321*VALUE^1 + 308.516941393028)",null,9.8261540000000007]
["Set 23",4800,"IF(VALUE>=0.85,6.6666666666658*VALUE + 168.333333333333,-8241.31424945592*VALUE^5 + 20052.5141722857*VALUE^4 - 18458.6152916491*VALUE^3 + 8081.21770620942*VALUE^2 - 1751.10545110288*VALUE^1 + 348.834144990409)",null,9.8261540000000007]
["Set 24",5400,"IF(VALUE>=0.85,6.6666666666658*VALUE + 168.333333333333,-8241.31424945592*VALUE^5 + 20052.5141722857*VALUE^4 - 18458.6152916491*VALUE^3 + 8081.21770620942*VALUE^2 - 1751.10545110288*VALUE^1 + 348.834144990409)",null,9.8261540000000007]
["Set 25",6000,"IF(VALUE>=0.85,6.6666666666658*VALUE + 168.333333333333,-8241.31424945592*VALUE^5 + 20052.5141722857*VALUE^4 - 18458.6152916491*VALUE^3 + 8081.21770620942*VALUE^2 - 1751.10545110288*VALUE^1 + 348.834144990409)",null,9.8261540000000007]
["Set 26",7200,"IF(VALUE>=0.85,9.99999999999617*VALUE + 164.500000000007,-8843.15685164928*VALUE^5 + 21586.6134075522*VALUE^4 - 19888.8078777552*VALUE^3 + 8667.81768990636*VALUE^2 - 1852.02131308377*VALUE^1 + 354.342532440556)",null,9.8261540000000007]
["Set 27",8120,"IF(VALUE>=0.85,13.3333333333316*VALUE + 162.666666666669,156.776556786615*VALUE^4 - 1023.66300368197*VALUE^3 + 1426.5311355435*VALUE^2 - 726.790293044539*VALUE^1 + 307.921703297768)",null,9.8261540000000007]
["Set 28",9600,"IF(VALUE>=0.85,9.99999999999617*VALUE + 164.500000000007,-8843.15685164928*VALUE^5 + 21586.6134075522*VALUE^4 - 19888.8078777552*VALUE^3 + 8667.81768990636*VALUE^2 - 1852.02131308377*VALUE^1 + 354.342532440556)",null,9.8261540000000007]
["Set 29",12000,"IF(VALUE>=0.85,9.99999999999617*VALUE + 164.500000000007,-8843.15685164928*VALUE^5 + 21586.6134075522*VALUE^4 - 19888.8078777552*VALUE^3 + 8667.81768990636*VALUE^2 - 1852.02131308377*VALUE^1 + 354.342532440556)",null,9.8261540000000007]
["Set 30",3600,"IF(VALUE>=0,-984.126989364624*VALUE^5 + 3309.52382850646*VALUE^4 - 4302.46034145355*VALUE^3 + 2766.48810917139*VALUE^2 - 923.037702590227*VALUE^1 + 309.613096068185,1)",null,9.8261540000000007]
["Set 31",4060,"IF(VALUE>=0.85,23.3333333333278*VALUE + 153.166666666668,IF(VALUE>=0.75,-50.0000000000147*VALUE + 215.500000000017,-543.333333333255*VALUE^3 + 898.999999999476*VALUE^2 - 498.541666666555*VALUE^1 + 275.437500000053))",null,9.8261540000000007]
["Set 32",4800,"IF(VALUE>=0,-984.126989364624*VALUE^5 + 3309.52382850646*VALUE^4 - 4302.46034145355*VALUE^3 + 2766.48810917139*VALUE^2 - 923.037702590227*VALUE^1 + 309.613096068185,1)",null,9.8261540000000007]
["Set 33",5400,"IF(VALUE>=0,-984.126989364624*VALUE^5 + 3309.52382850646*VALUE^4 - 4302.46034145355*VALUE^3 + 2766.48810917139*VALUE^2 - 923.037702590227*VALUE^1 + 309.613096068185,1)",null,9.8261540000000007]
["Set 34",6000,"IF(VALUE>=0,-984.126989364624*VALUE^5 + 3309.52382850646*VALUE^4 - 4302.46034145355*VALUE^3 + 2766.48810917139*VALUE^2 - 923.037702590227*VALUE^1 + 309.613096068185,1)",null,9.8261540000000007]
["Set 35",7200,"IF(VALUE>=0,-2698.41271185874*VALUE^5 + 9014.28576010465*VALUE^4 - 11573.4127558171*VALUE^3 + 7161.94051017612*VALUE^2 - 2168.04961301665*VALUE^1 + 439.148810940739,1)",null,9.8261540000000007]
["Set 36",8120,"IF(VALUE>=0.85,26.6666666666632*VALUE + 149.333333333332,IF(VALUE>=0.75,-60.0000000000062*VALUE + 223.000000000016,-543.333333333255*VALUE^3 + 898.999999999476*VALUE^2 - 498.541666666555*VALUE^1 + 275.437500000053))",null,9.8261540000000007]
["Set 37",9600,"IF(VALUE>=0,-2698.41271185874*VALUE^5 + 9014.28576010465*VALUE^4 - 11573.4127558171*VALUE^3 + 7161.94051017612*VALUE^2 - 2168.04961301665*VALUE^1 + 439.148810940739,1)",null,9.8261540000000007]
["Set 38",10800,"IF(VALUE>=0,-2698.41271185874*VALUE^5 + 9014.28576010465*VALUE^4 - 11573.4127558171*VALUE^3 + 7161.94051017612*VALUE^2 - 2168.04961301665*VALUE^1 + 439.148810940739,1)",null,9.8261540000000007]
{"$rows_left_out":28}
{"sheet":"p4","index":3,"n_rows":435,"n_cols":20,"rows_kept":435,"cut":false,"hidden":false,"merged":[]}
["Set 53"]
["Reference data:",null,null,null,null,null,null,null,null,null,null,null,null,"x6","x5","x4","x3","x2","x","b"]
[1,1.9]
[0.85,2.2000000000000002,null,null,null,null,null,null,null,null,null,null,"s2",0,0,0,0,0,{"$f":"LINEST(B3:B4,A3:A4,TRUE,FALSE)","v":-2.0000000000000009},3.9000000000000008]
[0.75,2.5,null,null,null,null,null,null,null,null,null,null,"s1",0,0,0,{"$f":"LINEST(B4:B7,A4:A7^{1,2,3},TRUE,FALSE)","v":-64.029304029303674},140.74725274725219,-105.09926739926716,29.166483516483513]
[0.5,3.8,null,null,null,null,null,null,null,null,null,null,"s3"]
[0.1,20]
[]
["Extrapolated ref:",null,"Deviation:"]
[1,{"$f":"IF(A10>=0.85,N4*A10^6+O4*A10^5+P4*A10^4+Q4*A10^3+R4*A10^2+S4*A10 + T4,IF(A10>=0.5,N5*A10^6+O5*A10^5+P5*A10^4+Q5*A10^3+R5*A10^2+S5*A10+T5,N5*A10^6+O5*A10^5+P5*A10^4+Q5*A10^3+R5*A10^2+S5*A10+T5))","v":1.9},{"$f":"ABS(B3-B10)","v":0}]
[0.85,{"$f":"IF(A11>=0.85,N4*A11^6+O4*A11^5+P4*A11^4+Q4*A11^3+R4*A11^2+S4*A11 + T4,IF(A11>=0.5,N5*A11^6+O5*A11^5+P5*A11^4+Q5*A11^3+R5*A11^2+S5*A11+T5,N5*A11^6+O5*A11^5+P5*A11^4+Q5*A11^3+R5*A11^2+S5*A11+T5))","v":2.2000000000000002},{"$f":"ABS(B4-B11)","v":0}]
[0.75,{"$f":"IF(A12>=0.85,N4*A12^6+O4*A12^5+P4*A12^4+Q4*A12^3+R4*A12^2+S4*A12 + T4,IF(A12>=0.5,N5*A12^6+O5*A12^5+P5*A12^4+Q5*A12^3+R5*A12^2+S5*A12+T5,N5*A12^6+O5*A12^5+P5*A12^4+Q5*A12^3+R5*A12^2+S5*A12+T5))","v":2.5000000000000036},{"$f":"ABS(B5-B12)","v":3.5527136788005009E-15}]
[0.5,{"$f":"IF(A13>=0.85,N4*A13^6+O4*A13^5+P4*A13^4+Q4*A13^3+R4*A13^2+S4*A13 + T4,IF(A13>=0.5,N5*A13^6+O5*A13^5+P5*A13^4+Q5*A13^3+R5*A13^2+S5*A13+T5,N5*A13^6+O5*A13^5+P5*A13^4+Q5*A13^3+R5*A13^2+S5*A13+T5))","v":3.800000000000022},{"$f":"ABS(B6-B13)","v":2.2204460492503131E-14}]
[]
["Extrapolated example:",null,null,null,null,null,null,null,null,null,null,null,"formula",{"$f":"\"IF(VALUE>=0.85,\"&N4&\"*VALUE^6+\"&O4&\"*VALUE^5+\"&P4&\"*VALUE^4+\"&Q4&\"*VALUE^3+\"&R4&\"*VALUE^2+\"&S4&\"*VALUE + \"&T4&\",IF(VALUE>=0.5,\"&N5&\"*VALUE^6+\"&O5&\"*VALUE^5+\"&P5&\"*VALUE^4+\"&Q5&\"*VALUE^3+\"&R5&\"*VALUE^2+\"&S5&\"*VALUE+\"&T5&\",\"&N5&\"*VALUE^6+\"&O5&\"*VALUE^5+\"&P5&\"*VALUE^4+\"&Q5&\"*VALUE^3+\"&R5&\"*VALUE^2+\"&S5&\"*VALUE+\"&T5&\"))\"","v":"IF(VALUE>=0.85,0*VALUE^6+0*VALUE^5+0*VALUE^4+0*VALUE^3+0*VALUE^2+-2*VALUE + 3.9,IF(VALUE>=0.5,0*VALUE^6+0*VALUE^5+0*VALUE^4+-64.0293040293037*VALUE^3+140.747252747252*VALUE^2+-105.099267399267*VALUE+29.1664835164835,0*VALUE^6+0*VALUE^5+0*VALUE^4+-64.0293040293037*VALUE^3+140.747252747252*VALUE^2+-105.099267399267*VALUE+29.1664835164835))"}]
[0.65,{"$f":"IF(A16>=0.85,N4*A16^6+O4*A16^5+P4*A16^4+Q4*A16^3+R4*A16^2+S4*A16 + T4,IF(A16>=0.5,N5*A16^6+O5*A16^5+P5*A16^4+Q5*A16^3+R5*A16^2+S5*A16+T5,N5*A16^6+O5*A16^5+P5*A16^4+Q5*A16^3+R5*A16^2+S5*A16+T5))","v":2.7336263736263824}]
[]
["Set 53 (D2)"]
["Reference data:",null,null,null,null,null,null,null,null,null,null,null,null,"x6","x5","x4","x3","x2","x","b"]
[1,7348.5]
[0.85,7487.5,null,null,null,null,null,null,null,null,null,null,"s2",0,0,0,0,0,{"$f":"LINEST(B20:B21,A20:A21,TRUE,FALSE)","v":-926.66666666666652},8275.1666666666661]
[0.75,7702,null,null,null,null,null,null,null,null,null,null,"s1",0,0,0,{"$f":"LINEST(B21:B24,A21:A24^{1,2,3},TRUE,FALSE)","v":-9312.2344322343397},21289.978021977884,-18306.194139194085,13384.631868131864]
[0.5,8390,null,null,null,null,null,null,null,null,null,null,"s3"]
[0.1,{"$f":"B20*1.6","v":11757.6}]
[]
["Extrapolated ref:",null,"Deviation:"]
[1,{"$f":"IF(A27>=0.85,N21*A27^6+O21*A27^5+P21*A27^4+Q21*A27^3+R21*A27^2+S21*A27 + T21,IF(A27>=0.5,N22*A27^6+O22*A27^5+P22*A27^4+Q22*A27^3+R22*A27^2+S22*A27+T22,N22*A27^6+O22*A27^5+P22*A27^4+Q22*A27^3+R22*A27^2+S22*A27+T22))","v":7348.5},{"$f":"ABS(B20-B27)","v":0}]
[0.85,{"$f":"IF(A28>=0.85,N21*A28^6+O21*A28^5+P21*A28^4+Q21*A28^3+R21*A28^2+S21*A28 + T21,IF(A28>=0.5,N22*A28^6+O22*A28^5+P22*A28^4+Q22*A28^3+R22*A28^2+S22*A28+T22,N22*A28^6+O22*A28^5+P22*A28^4+Q22*A28^3+R22*A28^2+S22*A28+T22))","v":7487.5},{"$f":"ABS(B21-B28)","v":0}]
[0.75,{"$f":"IF(A29>=0.85,N21*A29^6+O21*A29^5+P21*A29^4+Q21*A29^3+R21*A29^2+S21*A29 + T21,IF(A29>=0.5,N22*A29^6+O22*A29^5+P22*A29^4+Q22*A29^3+R22*A29^2+S22*A29+T22,N22*A29^6+O22*A29^5+P22*A29^4+Q22*A29^3+R22*A29^2+S22*A29+T22))","v":7701.9999999999982},{"$f":"ABS(B22-B29)","v":1.8189894035458565E-12}]
[0.5,{"$f":"IF(A30>=0.85,N21*A30^6+O21*A30^5+P21*A30^4+Q21*A30^3+R21*A30^2+S21*A30 + T21,IF(A30>=0.5,N22*A30^6+O22*A30^5+P22*A30^4+Q22*A30^3+R22*A30^2+S22*A30+T22,N22*A30^6+O22*A30^5+P22*A30^4+Q22*A30^3+R22*A30^2+S22*A30+T22))","v":8390},{"$f":"ABS(B23-B30)","v":0}]
[]
["Extrapolated example:",null,null,null,null,null,null,null,null,null,null,null,"formula",{"$f":"\"IF(VALUE>=0.85,\"&N21&\"*VALUE^6+\"&O21&\"*VALUE^5+\"&P21&\"*VALUE^4+\"&Q21&\"*VALUE^3+\"&R21&\"*VALUE^2+\"&S21&\"*VALUE + \"&T21&\",IF(VALUE>=0.5,\"&N22&\"*VALUE^6+\"&O22&\"*VALUE^5+\"&P22&\"*VALUE^4+\"&Q22&\"*VALUE^3+\"&R22&\"*VALUE^2+\"&S22&\"*VALUE+\"&T22&\",\"&N22&\"*VALUE^6+\"&O22&\"*VALUE^5+\"&P22&\"*VALUE^4+\"&Q22&\"*VALUE^3+\"&R22&\"*VALUE^2+\"&S22&\"*VALUE+\"&T22&\"))\"","v":"IF(VALUE>=0.85,0*VALUE^6+0*VALUE^5+0*VALUE^4+0*VALUE^3+0*VALUE^2+-926.666666666667*VALUE + 8275.16666666667,IF(VALUE>=0.5,0*VALUE^6+0*VALUE^5+0*VALUE^4+-9312.23443223434*VALUE^3+21289.9780219779*VALUE^2+-18306.1941391941*VALUE+13384.6318681319,0*VALUE^6+0*VALUE^5+0*VALUE^4+-9312.23443223434*VALUE^3+21289.9780219779*VALUE^2+-18306.1941391941*VALUE+13384.6318681319))"}]
[0.93,{"$f":"IF(A33>=0.85,N21*A33^6+O21*A33^5+P21*A33^4+Q21*A33^3+R21*A33^2+S21*A33 + T21,IF(A33>=0.5,N22*A33^6+O22*A33^5+P22*A33^4+Q22*A33^3+R22*A33^2+S22*A33+T22,N22*A33^6+O22*A33^5+P22*A33^4+Q22*A33^3+R22*A33^2+S22*A33+T22))","v":7413.3666666666659}]
[]
["Set 52"]
["Reference data:",null,null,null,null,null,null,null,null,null,null,null,null,"x6","x5","x4","x3","x2","x","b"]
[1,187.2]
[0.85,184.4,null,null,null,null,null,null,null,null,null,null,"s2",0,0,0,0,0,{"$f":"LINEST(B37:B38,A37:A38,TRUE,FALSE)","v":18.666666666666551},168.53333333333345]
[0.75,184.3,null,null,null,null,null,null,null,null,null,null,"s1",0,0,0,{"$f":"LINEST(B38:B41,A38:A41^{1,2,3},TRUE,FALSE)","v":-349.91941391941259},832.54505494505281,-658.35201465201362,357.37967032967026]
[0.5,192.6,null,null,null,null,null,null,null,null,null,null,"s3"]
{"$rows_left_out":395}