{"text_format":"1","workbook":"xlsx","n_sheets":2,"sheets":["Лист1","Лист2"],"not_rendered":{"charts":0,"images":0,"macros":1,"external_links":0,"defined_names":0,"comments":0,"pivot_tables":0},"unopened":[],"bounds":{"document_bytes":16777216,"sheet_cells":100000,"rows_first":2000,"rows_last":500,"rows_between":2000,"halvings":0,"cell_chars":16384,"cell_head_chars":4096},"cells_cut":0,"cells_raw":0,"read":"whole","date_system":"1900"}

{"sheet":"Лист1","index":0,"n_rows":200,"n_cols":2,"rows_kept":200,"cut":false,"hidden":false,"merged":[]}
[1,{"$f":"VLOOKUP(A1,Лист2!A1:F200,2,FALSE)","v":11}]
[null,{"$f":"VLOOKUP(A2,Лист2!A2:F201,2,FALSE)","v":{"$error":"#N/A"}}]
[null,{"$f":"VLOOKUP(A3,Лист2!A3:F202,2,FALSE)","v":{"$error":"#N/A"}}]
[null,{"$f":"VLOOKUP(A4,Лист2!A4:F203,2,FALSE)","v":{"$error":"#N/A"}}]
[null,{"$f":"VLOOKUP(A5,Лист2!A5:F204,2,FALSE)","v":{"$error":"#N/A"}}]
[null,{"$f":"VLOOKUP(A6,Лист2!A6:F205,2,FALSE)","v":{"$error":"#N/A"}}]
[null,{"$f":"VLOOKUP(A7,Лист2!A7:F206,2,FALSE)","v":{"$error":"#N/A"}}]
[null,{"$f":"VLOOKUP(A8,Лист2!A8:F207,2,FALSE)","v":{"$error":"#N/A"}}]
[null,{"$f":"VLOOKUP(A9,Лист2!A9:F208,2,FALSE)","v":{"$error":"#N/A"}}]
[null,{"$f":"VLOOKUP(A10,Лист2!A10:F209,2,FALSE)","v":{"$error":"#N/A"}}]
[null,{"$f":"VLOOKUP(A11,Лист2!A11:F210,2,FALSE)","v":{"$error":"#N/A"}}]
[null,{"$f":"VLOOKUP(A12,Лист2!A12:F211,2,FALSE)","v":{"$error":"#N/A"}}]
[null,{"$f":"VLOOKUP(A13,Лист2!A13:F212,2,FALSE)","v":{"$error":"#N/A"}}]
[null,{"$f":"VLOOKUP(A14,Лист2!A14:F213,2,FALSE)","v":{"$error":"#N/A"}}]
[null,{"$f":"VLOOKUP(A15,Лист2!A15:F214,2,FALSE)","v":{"$error":"#N/A"}}]
[null,{"$f":"VLOOKUP(A16,Лист2!A16:F215,2,FALSE)","v":{"$error":"#N/A"}}]
[null,{"$f":"VLOOKUP(A17,Лист2!A17:F216,2,FALSE)","v":{"$error":"#N/A"}}]
[null,{"$f":"VLOOKUP(A18,Лист2!A18:F217,2,FALSE)","v":{"$error":"#N/A"}}]
[null,{"$f":"VLOOKUP(A19,Лист2!A19:F218,2,FALSE)","v":{"$error":"#N/A"}}]
[null,{"$f":"VLOOKUP(A20,Лист2!A20:F219,2,FALSE)","v":{"$error":"#N/A"}}]
[null,{"$f":"VLOOKUP(A21,Лист2!A21:F220,2,FALSE)","v":{"$error":"#N/A"}}]
[null,{"$f":"VLOOKUP(A22,Лист2!A22:F221,2,FALSE)","v":{"$error":"#N/A"}}]
[null,{"$f":"VLOOKUP(A23,Лист2!A23:F222,2,FALSE)","v":{"$error":"#N/A"}}]
[null,{"$f":"VLOOKUP(A24,Лист2!A24:F223,2,FALSE)","v":{"$error":"#N/A"}}]
[null,{"$f":"VLOOKUP(A25,Лист2!A25:F224,2,FALSE)","v":{"$error":"#N/A"}}]
[null,{"$f":"VLOOKUP(A26,Лист2!A26:F225,2,FALSE)","v":{"$error":"#N/A"}}]
[null,{"$f":"VLOOKUP(A27,Лист2!A27:F226,2,FALSE)","v":{"$error":"#N/A"}}]
[null,{"$f":"VLOOKUP(A28,Лист2!A28:F227,2,FALSE)","v":{"$error":"#N/A"}}]
[null,{"$f":"VLOOKUP(A29,Лист2!A29:F228,2,FALSE)","v":{"$error":"#N/A"}}]
[null,{"$f":"VLOOKUP(A30,Лист2!A30:F229,2,FALSE)","v":{"$error":"#N/A"}}]
[null,{"$f":"VLOOKUP(A31,Лист2!A31:F230,2,FALSE)","v":{"$error":"#N/A"}}]
[null,{"$f":"VLOOKUP(A32,Лист2!A32:F231,2,FALSE)","v":{"$error":"#N/A"}}]
[null,{"$f":"VLOOKUP(A33,Лист2!A33:F232,2,FALSE)","v":{"$error":"#N/A"}}]
[null,{"$f":"VLOOKUP(A34,Лист2!A34:F233,2,FALSE)","v":{"$error":"#N/A"}}]
[null,{"$f":"VLOOKUP(A35,Лист2!A35:F234,2,FALSE)","v":{"$error":"#N/A"}}]
[null,{"$f":"VLOOKUP(A36,Лист2!A36:F235,2,FALSE)","v":{"$error":"#N/A"}}]
[null,{"$f":"VLOOKUP(A37,Лист2!A37:F236,2,FALSE)","v":{"$error":"#N/A"}}]
[null,{"$f":"VLOOKUP(A38,Лист2!A38:F237,2,FALSE)","v":{"$error":"#N/A"}}]
[null,{"$f":"VLOOKUP(A39,Лист2!A39:F238,2,FALSE)","v":{"$error":"#N/A"}}]
[null,{"$f":"VLOOKUP(A40,Лист2!A40:F239,2,FALSE)","v":{"$error":"#N/A"}}]
[null,{"$f":"VLOOKUP(A41,Лист2!A41:F240,2,FALSE)","v":{"$error":"#N/A"}}]
[null,{"$f":"VLOOKUP(A42,Лист2!A42:F241,2,FALSE)","v":{"$error":"#N/A"}}]
[null,{"$f":"VLOOKUP(A43,Лист2!A43:F242,2,FALSE)","v":{"$error":"#N/A"}}]
[null,{"$f":"VLOOKUP(A44,Лист2!A44:F243,2,FALSE)","v":{"$error":"#N/A"}}]
[null,{"$f":"VLOOKUP(A45,Лист2!A45:F244,2,FALSE)","v":{"$error":"#N/A"}}]
[null,{"$f":"VLOOKUP(A46,Лист2!A46:F245,2,FALSE)","v":{"$error":"#N/A"}}]
[null,{"$f":"VLOOKUP(A47,Лист2!A47:F246,2,FALSE)","v":{"$error":"#N/A"}}]
[null,{"$f":"VLOOKUP(A48,Лист2!A48:F247,2,FALSE)","v":{"$error":"#N/A"}}]
[null,{"$f":"VLOOKUP(A49,Лист2!A49:F248,2,FALSE)","v":{"$error":"#N/A"}}]
[null,{"$f":"VLOOKUP(A50,Лист2!A50:F249,2,FALSE)","v":{"$error":"#N/A"}}]
[null,{"$f":"VLOOKUP(A51,Лист2!A51:F250,2,FALSE)","v":{"$error":"#N/A"}}]
[null,{"$f":"VLOOKUP(A52,Лист2!A52:F251,2,FALSE)","v":{"$error":"#N/A"}}]
[null,{"$f":"VLOOKUP(A53,Лист2!A53:F252,2,FALSE)","v":{"$error":"#N/A"}}]
[null,{"$f":"VLOOKUP(A54,Лист2!A54:F253,2,FALSE)","v":{"$error":"#N/A"}}]
[null,{"$f":"VLOOKUP(A55,Лист2!A55:F254,2,FALSE)","v":{"$error":"#N/A"}}]
[null,{"$f":"VLOOKUP(A56,Лист2!A56:F255,2,FALSE)","v":{"$error":"#N/A"}}]
[null,{"$f":"VLOOKUP(A57,Лист2!A57:F256,2,FALSE)","v":{"$error":"#N/A"}}]
[null,{"$f":"VLOOKUP(A58,Лист2!A58:F257,2,FALSE)","v":{"$error":"#N/A"}}]
[null,{"$f":"VLOOKUP(A59,Лист2!A59:F258,2,FALSE)","v":{"$error":"#N/A"}}]
[null,{"$f":"VLOOKUP(A60,Лист2!A60:F259,2,FALSE)","v":{"$error":"#N/A"}}]
[null,{"$f":"VLOOKUP(A61,Лист2!A61:F260,2,FALSE)","v":{"$error":"#N/A"}}]
[null,{"$f":"VLOOKUP(A62,Лист2!A62:F261,2,FALSE)","v":{"$error":"#N/A"}}]
[null,{"$f":"VLOOKUP(A63,Лист2!A63:F262,2,FALSE)","v":{"$error":"#N/A"}}]
[null,{"$f":"VLOOKUP(A64,Лист2!A64:F263,2,FALSE)","v":{"$error":"#N/A"}}]
[null,{"$f":"VLOOKUP(A65,Лист2!A65:F264,2,FALSE)","v":{"$error":"#N/A"}}]
[null,{"$f":"VLOOKUP(A66,Лист2!A66:F265,2,FALSE)","v":{"$error":"#N/A"}}]
[null,{"$f":"VLOOKUP(A67,Лист2!A67:F266,2,FALSE)","v":{"$error":"#N/A"}}]
[null,{"$f":"VLOOKUP(A68,Лист2!A68:F267,2,FALSE)","v":{"$error":"#N/A"}}]
[null,{"$f":"VLOOKUP(A69,Лист2!A69:F268,2,FALSE)","v":{"$error":"#N/A"}}]
[null,{"$f":"VLOOKUP(A70,Лист2!A70:F269,2,FALSE)","v":{"$error":"#N/A"}}]
[null,{"$f":"VLOOKUP(A71,Лист2!A71:F270,2,FALSE)","v":{"$error":"#N/A"}}]
[null,{"$f":"VLOOKUP(A72,Лист2!A72:F271,2,FALSE)","v":{"$error":"#N/A"}}]
[null,{"$f":"VLOOKUP(A73,Лист2!A73:F272,2,FALSE)","v":{"$error":"#N/A"}}]
[null,{"$f":"VLOOKUP(A74,Лист2!A74:F273,2,FALSE)","v":{"$error":"#N/A"}}]
[null,{"$f":"VLOOKUP(A75,Лист2!A75:F274,2,FALSE)","v":{"$error":"#N/A"}}]
[null,{"$f":"VLOOKUP(A76,Лист2!A76:F275,2,FALSE)","v":{"$error":"#N/A"}}]
[null,{"$f":"VLOOKUP(A77,Лист2!A77:F276,2,FALSE)","v":{"$error":"#N/A"}}]
[null,{"$f":"VLOOKUP(A78,Лист2!A78:F277,2,FALSE)","v":{"$error":"#N/A"}}]
[null,{"$f":"VLOOKUP(A79,Лист2!A79:F278,2,FALSE)","v":{"$error":"#N/A"}}]
[null,{"$f":"VLOOKUP(A80,Лист2!A80:F279,2,FALSE)","v":{"$error":"#N/A"}}]
[null,{"$f":"VLOOKUP(A81,Лист2!A81:F280,2,FALSE)","v":{"$error":"#N/A"}}]
[null,{"$f":"VLOOKUP(A82,Лист2!A82:F281,2,FALSE)","v":{"$error":"#N/A"}}]
[null,{"$f":"VLOOKUP(A83,Лист2!A83:F282,2,FALSE)","v":{"$error":"#N/A"}}]
[null,{"$f":"VLOOKUP(A84,Лист2!A84:F283,2,FALSE)","v":{"$error":"#N/A"}}]
[null,{"$f":"VLOOKUP(A85,Лист2!A85:F284,2,FALSE)","v":{"$error":"#N/A"}}]
[null,{"$f":"VLOOKUP(A86,Лист2!A86:F285,2,FALSE)","v":{"$error":"#N/A"}}]
[null,{"$f":"VLOOKUP(A87,Лист2!A87:F286,2,FALSE)","v":{"$error":"#N/A"}}]
[null,{"$f":"VLOOKUP(A88,Лист2!A88:F287,2,FALSE)","v":{"$error":"#N/A"}}]
[null,{"$f":"VLOOKUP(A89,Лист2!A89:F288,2,FALSE)","v":{"$error":"#N/A"}}]
[null,{"$f":"VLOOKUP(A90,Лист2!A90:F289,2,FALSE)","v":{"$error":"#N/A"}}]
[null,{"$f":"VLOOKUP(A91,Лист2!A91:F290,2,FALSE)","v":{"$error":"#N/A"}}]
[null,{"$f":"VLOOKUP(A92,Лист2!A92:F291,2,FALSE)","v":{"$error":"#N/A"}}]
[null,{"$f":"VLOOKUP(A93,Лист2!A93:F292,2,FALSE)","v":{"$error":"#N/A"}}]
[null,{"$f":"VLOOKUP(A94,Лист2!A94:F293,2,FALSE)","v":{"$error":"#N/A"}}]
[null,{"$f":"VLOOKUP(A95,Лист2!A95:F294,2,FALSE)","v":{"$error":"#N/A"}}]
[null,{"$f":"VLOOKUP(A96,Лист2!A96:F295,2,FALSE)","v":{"$error":"#N/A"}}]
[null,{"$f":"VLOOKUP(A97,Лист2!A97:F296,2,FALSE)","v":{"$error":"#N/A"}}]
[null,{"$f":"VLOOKUP(A98,Лист2!A98:F297,2,FALSE)","v":{"$error":"#N/A"}}]
[null,{"$f":"VLOOKUP(A99,Лист2!A99:F298,2,FALSE)","v":{"$error":"#N/A"}}]
[null,{"$f":"VLOOKUP(A100,Лист2!A100:F299,2,FALSE)","v":{"$error":"#N/A"}}]
[null,{"$f":"VLOOKUP(A101,Лист2!A101:F300,2,FALSE)","v":{"$error":"#N/A"}}]
[null,{"$f":"VLOOKUP(A102,Лист2!A102:F301,2,FALSE)","v":{"$error":"#N/A"}}]
[null,{"$f":"VLOOKUP(A103,Лист2!A103:F302,2,FALSE)","v":{"$error":"#N/A"}}]
[null,{"$f":"VLOOKUP(A104,Лист2!A104:F303,2,FALSE)","v":{"$error":"#N/A"}}]
[null,{"$f":"VLOOKUP(A105,Лист2!A105:F304,2,FALSE)","v":{"$error":"#N/A"}}]
[null,{"$f":"VLOOKUP(A106,Лист2!A106:F305,2,FALSE)","v":{"$error":"#N/A"}}]
[null,{"$f":"VLOOKUP(A107,Лист2!A107:F306,2,FALSE)","v":{"$error":"#N/A"}}]
[null,{"$f":"VLOOKUP(A108,Лист2!A108:F307,2,FALSE)","v":{"$error":"#N/A"}}]
[null,{"$f":"VLOOKUP(A109,Лист2!A109:F308,2,FALSE)","v":{"$error":"#N/A"}}]
[null,{"$f":"VLOOKUP(A110,Лист2!A110:F309,2,FALSE)","v":{"$error":"#N/A"}}]
[null,{"$f":"VLOOKUP(A111,Лист2!A111:F310,2,FALSE)","v":{"$error":"#N/A"}}]
[null,{"$f":"VLOOKUP(A112,Лист2!A112:F311,2,FALSE)","v":{"$error":"#N/A"}}]
[null,{"$f":"VLOOKUP(A113,Лист2!A113:F312,2,FALSE)","v":{"$error":"#N/A"}}]
[null,{"$f":"VLOOKUP(A114,Лист2!A114:F313,2,FALSE)","v":{"$error":"#N/A"}}]
[null,{"$f":"VLOOKUP(A115,Лист2!A115:F314,2,FALSE)","v":{"$error":"#N/A"}}]
[null,{"$f":"VLOOKUP(A116,Лист2!A116:F315,2,FALSE)","v":{"$error":"#N/A"}}]
[null,{"$f":"VLOOKUP(A117,Лист2!A117:F316,2,FALSE)","v":{"$error":"#N/A"}}]
[null,{"$f":"VLOOKUP(A118,Лист2!A118:F317,2,FALSE)","v":{"$error":"#N/A"}}]
[null,{"$f":"VLOOKUP(A119,Лист2!A119:F318,2,FALSE)","v":{"$error":"#N/A"}}]
[null,{"$f":"VLOOKUP(A120,Лист2!A120:F319,2,FALSE)","v":{"$error":"#N/A"}}]
[null,{"$f":"VLOOKUP(A121,Лист2!A121:F320,2,FALSE)","v":{"$error":"#N/A"}}]
[null,{"$f":"VLOOKUP(A122,Лист2!A122:F321,2,FALSE)","v":{"$error":"#N/A"}}]
[null,{"$f":"VLOOKUP(A123,Лист2!A123:F322,2,FALSE)","v":{"$error":"#N/A"}}]
[null,{"$f":"VLOOKUP(A124,Лист2!A124:F323,2,FALSE)","v":{"$error":"#N/A"}}]
[null,{"$f":"VLOOKUP(A125,Лист2!A125:F324,2,FALSE)","v":{"$error":"#N/A"}}]
[null,{"$f":"VLOOKUP(A126,Лист2!A126:F325,2,FALSE)","v":{"$error":"#N/A"}}]
[null,{"$f":"VLOOKUP(A127,Лист2!A127:F326,2,FALSE)","v":{"$error":"#N/A"}}]
[null,{"$f":"VLOOKUP(A128,Лист2!A128:F327,2,FALSE)","v":{"$error":"#N/A"}}]
[null,{"$f":"VLOOKUP(A129,Лист2!A129:F328,2,FALSE)","v":{"$error":"#N/A"}}]
[null,{"$f":"VLOOKUP(A130,Лист2!A130:F329,2,FALSE)","v":{"$error":"#N/A"}}]
[null,{"$f":"VLOOKUP(A131,Лист2!A131:F330,2,FALSE)","v":{"$error":"#N/A"}}]
[null,{"$f":"VLOOKUP(A132,Лист2!A132:F331,2,FALSE)","v":{"$error":"#N/A"}}]
[null,{"$f":"VLOOKUP(A133,Лист2!A133:F332,2,FALSE)","v":{"$error":"#N/A"}}]
[null,{"$f":"VLOOKUP(A134,Лист2!A134:F333,2,FALSE)","v":{"$error":"#N/A"}}]
[null,{"$f":"VLOOKUP(A135,Лист2!A135:F334,2,FALSE)","v":{"$error":"#N/A"}}]
[null,{"$f":"VLOOKUP(A136,Лист2!A136:F335,2,FALSE)","v":{"$error":"#N/A"}}]
[null,{"$f":"VLOOKUP(A137,Лист2!A137:F336,2,FALSE)","v":{"$error":"#N/A"}}]
[null,{"$f":"VLOOKUP(A138,Лист2!A138:F337,2,FALSE)","v":{"$error":"#N/A"}}]
[null,{"$f":"VLOOKUP(A139,Лист2!A139:F338,2,FALSE)","v":{"$error":"#N/A"}}]
[null,{"$f":"VLOOKUP(A140,Лист2!A140:F339,2,FALSE)","v":{"$error":"#N/A"}}]
[null,{"$f":"VLOOKUP(A141,Лист2!A141:F340,2,FALSE)","v":{"$error":"#N/A"}}]
[null,{"$f":"VLOOKUP(A142,Лист2!A142:F341,2,FALSE)","v":{"$error":"#N/A"}}]
[null,{"$f":"VLOOKUP(A143,Лист2!A143:F342,2,FALSE)","v":{"$error":"#N/A"}}]
[null,{"$f":"VLOOKUP(A144,Лист2!A144:F343,2,FALSE)","v":{"$error":"#N/A"}}]
[null,{"$f":"VLOOKUP(A145,Лист2!A145:F344,2,FALSE)","v":{"$error":"#N/A"}}]
[null,{"$f":"VLOOKUP(A146,Лист2!A146:F345,2,FALSE)","v":{"$error":"#N/A"}}]
[null,{"$f":"VLOOKUP(A147,Лист2!A147:F346,2,FALSE)","v":{"$error":"#N/A"}}]
[null,{"$f":"VLOOKUP(A148,Лист2!A148:F347,2,FALSE)","v":{"$error":"#N/A"}}]
[null,{"$f":"VLOOKUP(A149,Лист2!A149:F348,2,FALSE)","v":{"$error":"#N/A"}}]
[null,{"$f":"VLOOKUP(A150,Лист2!A150:F349,2,FALSE)","v":{"$error":"#N/A"}}]
[null,{"$f":"VLOOKUP(A151,Лист2!A151:F350,2,FALSE)","v":{"$error":"#N/A"}}]
[null,{"$f":"VLOOKUP(A152,Лист2!A152:F351,2,FALSE)","v":{"$error":"#N/A"}}]
[null,{"$f":"VLOOKUP(A153,Лист2!A153:F352,2,FALSE)","v":{"$error":"#N/A"}}]
[null,{"$f":"VLOOKUP(A154,Лист2!A154:F353,2,FALSE)","v":{"$error":"#N/A"}}]
[null,{"$f":"VLOOKUP(A155,Лист2!A155:F354,2,FALSE)","v":{"$error":"#N/A"}}]
[null,{"$f":"VLOOKUP(A156,Лист2!A156:F355,2,FALSE)","v":{"$error":"#N/A"}}]
[null,{"$f":"VLOOKUP(A157,Лист2!A157:F356,2,FALSE)","v":{"$error":"#N/A"}}]
[null,{"$f":"VLOOKUP(A158,Лист2!A158:F357,2,FALSE)","v":{"$error":"#N/A"}}]
[null,{"$f":"VLOOKUP(A159,Лист2!A159:F358,2,FALSE)","v":{"$error":"#N/A"}}]
[null,{"$f":"VLOOKUP(A160,Лист2!A160:F359,2,FALSE)","v":{"$error":"#N/A"}}]
[null,{"$f":"VLOOKUP(A161,Лист2!A161:F360,2,FALSE)","v":{"$error":"#N/A"}}]
[null,{"$f":"VLOOKUP(A162,Лист2!A162:F361,2,FALSE)","v":{"$error":"#N/A"}}]
[null,{"$f":"VLOOKUP(A163,Лист2!A163:F362,2,FALSE)","v":{"$error":"#N/A"}}]
[null,{"$f":"VLOOKUP(A164,Лист2!A164:F363,2,FALSE)","v":{"$error":"#N/A"}}]
[null,{"$f":"VLOOKUP(A165,Лист2!A165:F364,2,FALSE)","v":{"$error":"#N/A"}}]
[null,{"$f":"VLOOKUP(A166,Лист2!A166:F365,2,FALSE)","v":{"$error":"#N/A"}}]
[null,{"$f":"VLOOKUP(A167,Лист2!A167:F366,2,FALSE)","v":{"$error":"#N/A"}}]
[null,{"$f":"VLOOKUP(A168,Лист2!A168:F367,2,FALSE)","v":{"$error":"#N/A"}}]
[null,{"$f":"VLOOKUP(A169,Лист2!A169:F368,2,FALSE)","v":{"$error":"#N/A"}}]
[null,{"$f":"VLOOKUP(A170,Лист2!A170:F369,2,FALSE)","v":{"$error":"#N/A"}}]
[null,{"$f":"VLOOKUP(A171,Лист2!A171:F370,2,FALSE)","v":{"$error":"#N/A"}}]
[null,{"$f":"VLOOKUP(A172,Лист2!A172:F371,2,FALSE)","v":{"$error":"#N/A"}}]
[null,{"$f":"VLOOKUP(A173,Лист2!A173:F372,2,FALSE)","v":{"$error":"#N/A"}}]
[null,{"$f":"VLOOKUP(A174,Лист2!A174:F373,2,FALSE)","v":{"$error":"#N/A"}}]
[null,{"$f":"VLOOKUP(A175,Лист2!A175:F374,2,FALSE)","v":{"$error":"#N/A"}}]
[null,{"$f":"VLOOKUP(A176,Лист2!A176:F375,2,FALSE)","v":{"$error":"#N/A"}}]
[null,{"$f":"VLOOKUP(A177,Лист2!A177:F376,2,FALSE)","v":{"$error":"#N/A"}}]
[null,{"$f":"VLOOKUP(A178,Лист2!A178:F377,2,FALSE)","v":{"$error":"#N/A"}}]
[null,{"$f":"VLOOKUP(A179,Лист2!A179:F378,2,FALSE)","v":{"$error":"#N/A"}}]
[null,{"$f":"VLOOKUP(A180,Лист2!A180:F379,2,FALSE)","v":{"$error":"#N/A"}}]
[null,{"$f":"VLOOKUP(A181,Лист2!A181:F380,2,FALSE)","v":{"$error":"#N/A"}}]
[null,{"$f":"VLOOKUP(A182,Лист2!A182:F381,2,FALSE)","v":{"$error":"#N/A"}}]
[null,{"$f":"VLOOKUP(A183,Лист2!A183:F382,2,FALSE)","v":{"$error":"#N/A"}}]
[null,{"$f":"VLOOKUP(A184,Лист2!A184:F383,2,FALSE)","v":{"$error":"#N/A"}}]
[null,{"$f":"VLOOKUP(A185,Лист2!A185:F384,2,FALSE)","v":{"$error":"#N/A"}}]
[null,{"$f":"VLOOKUP(A186,Лист2!A186:F385,2,FALSE)","v":{"$error":"#N/A"}}]
[null,{"$f":"VLOOKUP(A187,Лист2!A187:F386,2,FALSE)","v":{"$error":"#N/A"}}]
[null,{"$f":"VLOOKUP(A188,Лист2!A188:F387,2,FALSE)","v":{"$error":"#N/A"}}]
[null,{"$f":"VLOOKUP(A189,Лист2!A189:F388,2,FALSE)","v":{"$error":"#N/A"}}]
[null,{"$f":"VLOOKUP(A190,Лист2!A190:F389,2,FALSE)","v":{"$error":"#N/A"}}]
[null,{"$f":"VLOOKUP(A191,Лист2!A191:F390,2,FALSE)","v":{"$error":"#N/A"}}]
[null,{"$f":"VLOOKUP(A192,Лист2!A192:F391,2,FALSE)","v":{"$error":"#N/A"}}]
[null,{"$f":"VLOOKUP(A193,Лист2!A193:F392,2,FALSE)","v":{"$error":"#N/A"}}]
[null,{"$f":"VLOOKUP(A194,Лист2!A194:F393,2,FALSE)","v":{"$error":"#N/A"}}]
[null,{"$f":"VLOOKUP(A195,Лист2!A195:F394,2,FALSE)","v":{"$error":"#N/A"}}]
[null,{"$f":"VLOOKUP(A196,Лист2!A196:F395,2,FALSE)","v":{"$error":"#N/A"}}]
[null,{"$f":"VLOOKUP(A197,Лист2!A197:F396,2,FALSE)","v":{"$error":"#N/A"}}]
[null,{"$f":"VLOOKUP(A198,Лист2!A198:F397,2,FALSE)","v":{"$error":"#N/A"}}]
[null,{"$f":"VLOOKUP(A199,Лист2!A199:F398,2,FALSE)","v":{"$error":"#N/A"}}]
[null,{"$f":"VLOOKUP(A200,Лист2!A200:F399,2,FALSE)","v":{"$error":"#N/A"}}]

{"sheet":"Лист2","index":1,"n_rows":1,"n_cols":2,"rows_kept":1,"cut":false,"hidden":false,"merged":[]}
[1,11]