{"text_format":"1","workbook":"xlsx","n_sheets":2,"sheets":["Списки КРР","Списки УОП"],"not_rendered":{"charts":0,"images":0,"macros":1,"external_links":1,"defined_names":31,"comments":0,"pivot_tables":0},"unopened":[],"bounds":{"document_bytes":16777216,"sheet_cells":100000,"rows_first":2000,"rows_last":500,"rows_between":2000,"halvings":0,"cell_chars":16384,"cell_head_chars":4096},"cells_cut":0,"cells_raw":0,"read":"whole","date_system":"1900"}

{"sheet":"Списки КРР","index":0,"n_rows":28,"n_cols":18,"rows_kept":28,"cut":false,"hidden":false,"merged":[]}
[]
[]
[null,null,null,null,null,null,null,null,null,null,null,"1 группа"]
[null,null,null,"индивидуальные занятия",null,null,null,null,null,null,null,"Групповые занятия",null,null,null,13,"общеразвивающая"]
["данные подставляются из таблицы \"Списки УОП\" по столбцу \"Номер в списке\" через функцию ВПР",null,null,"Номер в списке","код ребенка","Группа","пол","возраст","код нарушения","Программа\n сопровождения",null,"Номер в списке","код ребенка","Группа","пол","возраст","код нарушения","Программа\n сопровождения"]
[null,null,null,{"$f":"INDEX('Списки УОП'!B6:S69,MATCH($D$4,список_детей[Форма сопровождения],0),1)","v":1},"ЗМН",2,"м","6 лет","ТНР",{"$f":"VLOOKUP(Индивидуальные_занятия[[#This Row],[Номер в списке]],список_детей[],13)","v":"АОП для детей с ТНР"},null,{"$f":"INDEX('Списки УОП'!B6:S66,MATCH($P$4,список_детей[Группа],0),1)","v":19},"КРД",{"$f":"VLOOKUP(первая_группа[[#This Row],[Номер в списке]],список_детей[],10)","v":13},"м","7 лет","ЗПР","В гости к Монсикам"]
["Вставляются ненужные данные из таблицы",null,null,{"$f":"INDEX('Списки УОП'!B7:S70,MATCH($D$4,список_детей[Форма сопровождения],0),1)","v":2},"ЗМО",3,"м","6 лет","ТНР",{"$f":"VLOOKUP(Индивидуальные_занятия[[#This Row],[Номер в списке]],список_детей[],13)","v":"АОП для детей с ТНР"},null,{"$f":"INDEX('Списки УОП'!B7:S67,MATCH($P$4,список_детей[Группа],0),1)","v":20},"ВИД",{"$f":"VLOOKUP(первая_группа[[#This Row],[Номер в списке]],список_детей[],10)","v":13},"м","7 лет","ЗПР","В гости к Монсикам"]
["в таблице \"Индивидуальные занятия\" должны быть только \"АОП для …\"",null,null,{"$f":"INDEX('Списки УОП'!B8:S71,MATCH($D$4,список_детей[Форма сопровождения],0),1)","v":3},"ИЧЕ",4,"м","6 лет","ТНР",{"$f":"VLOOKUP(Индивидуальные_занятия[[#This Row],[Номер в списке]],список_детей[],13)","v":"АОП для детей с ТНР"},null,{"$f":"INDEX('Списки УОП'!B8:S68,MATCH($P$4,список_детей[Группа],0),1)","v":21},"ННС",{"$f":"VLOOKUP(первая_группа[[#This Row],[Номер в списке]],список_детей[],10)","v":13},"д","7 лет","ЗПР","В гости к Монсикам"]
["в таблице групповые занятия только группа из ячейки Р4",null,null,{"$f":"INDEX('Списки УОП'!B9:S72,MATCH($D$4,список_детей[Форма сопровождения],0),1)","v":4},"ИПА",5,"м","7 лет","ТНР",{"$f":"VLOOKUP(Индивидуальные_занятия[[#This Row],[Номер в списке]],список_детей[],13)","v":"АОП для детей с ТНР"},null,{"$f":"INDEX('Списки УОП'!B9:S69,MATCH($P$4,список_детей[Группа],0),1)","v":22},"ЩЕИ",{"$f":"VLOOKUP(первая_группа[[#This Row],[Номер в списке]],список_детей[],10)","v":13},"д","7 лет","ЗПР","В гости к Монсикам"]
[null,null,null,{"$f":"INDEX('Списки УОП'!B10:S73,MATCH($D$4,список_детей[Форма сопровождения],0),1)","v":5},"КДР",11,"д","6 лет","ТНР",{"$f":"VLOOKUP(Индивидуальные_занятия[[#This Row],[Номер в списке]],список_детей[],13)","v":"АОП для детей с ТНР"},null,{"$f":"INDEX('Списки УОП'!B10:S70,MATCH($P$4,список_детей[Группа],0),1)","v":23},"УЯГ",{"$f":"VLOOKUP(первая_группа[[#This Row],[Номер в списке]],список_детей[],10)","v":13},"д","7 лет","ЗПР","В гости к Монсикам"]
[null,null,null,{"$f":"INDEX('Списки УОП'!B11:S74,MATCH($D$4,список_детей[Форма сопровождения],0),1)","v":6},"КАИ",11,"м","6 лет","ТНР",{"$f":"VLOOKUP(Индивидуальные_занятия[[#This Row],[Номер в списке]],список_детей[],13)","v":"АОП для детей с ТНР"},null,{"$f":"INDEX('Списки УОП'!B11:S71,MATCH($P$4,список_детей[Группа],0),1)","v":24},"БДП",{"$f":"VLOOKUP(первая_группа[[#This Row],[Номер в списке]],список_детей[],10)","v":13},"м","7 лет","ЗПР","В гости к Монсикам"]
[null,null,null,{"$f":"INDEX('Списки УОП'!B12:S75,MATCH($D$4,список_детей[Форма сопровождения],0),1)","v":7},"КАЯ",17,"м","6 лет","ТНР",{"$f":"VLOOKUP(Индивидуальные_занятия[[#This Row],[Номер в списке]],список_детей[],13)","v":"АОП для детей с ТНР"},null,{"$f":"INDEX('Списки УОП'!B12:S72,MATCH($P$4,список_детей[Группа],0),1)","v":25},"КМК",{"$f":"VLOOKUP(первая_группа[[#This Row],[Номер в списке]],список_детей[],10)","v":13},"м","7 лет","ЗПР","В гости к Монсикам"]
[null,null,null,{"$f":"INDEX('Списки УОП'!B13:S76,MATCH($D$4,список_детей[Форма сопровождения],0),1)","v":8},"СИК",17,"м","6 лет","ТНР",{"$f":"VLOOKUP(Индивидуальные_занятия[[#This Row],[Номер в списке]],список_детей[],13)","v":"Школа Фиолетового леса"},null,{"$f":"INDEX('Списки УОП'!B13:S73,MATCH($P$4,список_детей[Группа],0),1)","v":26},"КАИ",{"$f":"VLOOKUP(первая_группа[[#This Row],[Номер в списке]],список_детей[],10)","v":13},"м","7 лет","ЗПР","В гости к Монсикам"]
[null,null,null,{"$f":"INDEX('Списки УОП'!B14:S77,MATCH($D$4,список_детей[Форма сопровождения],0),1)","v":9},"ФВФ",17,"м","2 лет","УО",{"$f":"VLOOKUP(Индивидуальные_занятия[[#This Row],[Номер в списке]],список_детей[],13)","v":"Школа Фиолетового леса"},null,{"$f":"INDEX('Списки УОП'!B14:S74,MATCH($P$4,список_детей[Группа],0),1)","v":27},"НЕА",{"$f":"VLOOKUP(первая_группа[[#This Row],[Номер в списке]],список_детей[],10)","v":13},"д","7 лет","ЗПР","В гости к Монсикам"]
[null,null,null,{"$f":"INDEX('Списки УОП'!B15:S78,MATCH($D$4,список_детей[Форма сопровождения],0),1)","v":10},"КМЧ",17,"м","6 лет","ЗПР",{"$f":"VLOOKUP(Индивидуальные_занятия[[#This Row],[Номер в списке]],список_детей[],13)","v":"Школа Фиолетового леса"},null,{"$f":"INDEX('Списки УОП'!B15:S75,MATCH($P$4,список_детей[Группа],0),1)","v":28},"ГАН",{"$f":"VLOOKUP(первая_группа[[#This Row],[Номер в списке]],список_детей[],10)","v":13},"д","7 лет","ЗПР","В гости к Монсикам"]
[null,null,null,{"$f":"INDEX('Списки УОП'!B16:S79,MATCH($D$4,список_детей[Форма сопровождения],0),1)","v":11},"КЕА",17,"д","6 лет","ЗПР",{"$f":"VLOOKUP(Индивидуальные_занятия[[#This Row],[Номер в списке]],список_детей[],13)","v":"Школа Фиолетового леса"},null,{"$f":"INDEX('Списки УОП'!B16:S76,MATCH($P$4,список_детей[Группа],0),1)","v":29},"ЛАД",{"$f":"VLOOKUP(первая_группа[[#This Row],[Номер в списке]],список_детей[],10)","v":13},"м","7 лет","ЗПР","В гости к Монсикам"]
[null,null,null,{"$f":"INDEX('Списки УОП'!B17:S80,MATCH($D$4,список_детей[Форма сопровождения],0),1)","v":12},"КДИ",17,"д","6 лет","ЗПР",{"$f":"VLOOKUP(Индивидуальные_занятия[[#This Row],[Номер в списке]],список_детей[],13)","v":"Школа Фиолетового леса"},null,{"$f":"INDEX('Списки УОП'!B17:S77,MATCH($P$4,список_детей[Группа],0),1)","v":30},"СЮМ",{"$f":"VLOOKUP(первая_группа[[#This Row],[Номер в списке]],список_детей[],10)","v":13},"м","7 лет","ЗПР","В гости к Монсикам"]
[null,null,null,{"$f":"INDEX('Списки УОП'!B18:S81,MATCH($D$4,список_детей[Форма сопровождения],0),1)","v":13},"КАП",17,"д","6 лет","УО",{"$f":"VLOOKUP(Индивидуальные_занятия[[#This Row],[Номер в списке]],список_детей[],13)","v":"Школа Фиолетового леса"},null,{"$f":"INDEX('Списки УОП'!B18:S78,MATCH($P$4,список_детей[Группа],0),1)","v":31},"ПВД",{"$f":"VLOOKUP(первая_группа[[#This Row],[Номер в списке]],список_детей[],10)","v":10},"м","7 лет","ЗПР","В гости к Монсикам"]
[null,null,null,{"$f":"INDEX('Списки УОП'!B19:S82,MATCH($D$4,список_детей[Форма сопровождения],0),1)","v":14},"ККК",1,"д","6 лет","УО",{"$f":"VLOOKUP(Индивидуальные_занятия[[#This Row],[Номер в списке]],список_детей[],13)","v":"Школа Фиолетового леса"},null,{"$f":"INDEX('Списки УОП'!B19:S79,MATCH($P$4,список_детей[Группа],0),1)","v":32},"ГМР",{"$f":"VLOOKUP(первая_группа[[#This Row],[Номер в списке]],список_детей[],10)","v":10},"м","7 лет","ЗПР","В гости к Монсикам"]
[null,null,null,{"$f":"INDEX('Списки УОП'!B20:S83,MATCH($D$4,список_детей[Форма сопровождения],0),1)","v":15},"КНМ",2,"д","6 лет","ЗПР",{"$f":"VLOOKUP(Индивидуальные_занятия[[#This Row],[Номер в списке]],список_детей[],13)","v":"АОП для детей с УО"},null,{"$f":"INDEX('Списки УОП'!B20:S80,MATCH($P$4,список_детей[Группа],0),1)","v":33},"КПИ",{"$f":"VLOOKUP(первая_группа[[#This Row],[Номер в списке]],список_детей[],10)","v":10},"д","7 лет","ЗПР","В гости к Монсикам"]
{"$rows_left_out":9}
{"sheet":"Списки УОП","index":1,"n_rows":495,"n_cols":19,"rows_kept":495,"cut":false,"hidden":false,"merged":[[3,1,3,18]]}
[]
[]
[null,1,2,3,4,5,6,7,8,9,10,11,12,13,14,15,16,17,18]
[null,"Общий список детей"]
[null,"№ ","Ф","И","О","ФИО (код)","ФИО полностью","Дата Рождения","возраст","пол","Группа","Направленность","Возраст группы","Программа","Форма сопровождения","код нарушения","Номер протокола ПМПК","Адрес проживания","Примечания"]
[null,1,"Жорж ","Дмитрий","Александрович",{"$f":"CONCATENATE(LEFT(список_детей[[#This Row],[Ф]]),LEFT(список_детей[[#This Row],[И]]),LEFT(список_детей[[#This Row],[О]]))","v":"ЖДА"},{"$f":"список_детей[[#This Row],[И]]&\" \"&LEFT(список_детей[[#This Row],[Ф]])&\".\"","v":"Дмитрий Ж."},"2015-07-25",{"$f":"IF(список_детей[[#This Row],[Дата Рождения]]=\"\",\"\",DATEDIF(список_детей[[#This Row],[Дата Рождения]],TODAY(),\"y\")&\" лет\")","v":"6 лет"},{"$f":"IF(список_детей[[#This Row],[О]]=\"\",\"\",IF(RIGHT(список_детей[[#This Row],[О]])=\"ч\",\"м\",\"д\"))","v":"м"},1,"общеразвивающая","1-2 года","АОП для детей с ТНР","индивидуальные занятия","ТНР",null,null,"ОВЗ"]
[null,2,"Зайков","Моисей","Назарович",{"$f":"CONCATENATE(LEFT(список_детей[[#This Row],[Ф]]),LEFT(список_детей[[#This Row],[И]]),LEFT(список_детей[[#This Row],[О]]))","v":"ЗМН"},{"$f":"список_детей[[#This Row],[И]]&\" \"&LEFT(список_детей[[#This Row],[Ф]])&\".\"","v":"Моисей З."},"2015-10-26",{"$f":"IF(список_детей[[#This Row],[Дата Рождения]]=\"\",\"\",DATEDIF(список_детей[[#This Row],[Дата Рождения]],TODAY(),\"y\")&\" лет\")","v":"6 лет"},{"$f":"IF(список_детей[[#This Row],[О]]=\"\",\"\",IF(RIGHT(список_детей[[#This Row],[О]])=\"ч\",\"м\",\"д\"))","v":"м"},2,"общеразвивающая","3-4 года","АОП для детей с ТНР","индивидуальные занятия","ТНР"]
[null,3,"Зощенко","Мстислав","Олегович",{"$f":"CONCATENATE(LEFT(список_детей[[#This Row],[Ф]]),LEFT(список_детей[[#This Row],[И]]),LEFT(список_детей[[#This Row],[О]]))","v":"ЗМО"},{"$f":"список_детей[[#This Row],[И]]&\" \"&LEFT(список_детей[[#This Row],[Ф]])&\".\"","v":"Мстислав З."},"2015-09-21",{"$f":"IF(список_детей[[#This Row],[Дата Рождения]]=\"\",\"\",DATEDIF(список_детей[[#This Row],[Дата Рождения]],TODAY(),\"y\")&\" лет\")","v":"6 лет"},{"$f":"IF(список_детей[[#This Row],[О]]=\"\",\"\",IF(RIGHT(список_детей[[#This Row],[О]])=\"ч\",\"м\",\"д\"))","v":"м"},3,"общеразвивающая","3-4 года","АОП для детей с ТНР","индивидуальные занятия","ТНР"]
[null,4,"Иванов","Чеслав","Елизарович",{"$f":"CONCATENATE(LEFT(список_детей[[#This Row],[Ф]]),LEFT(список_детей[[#This Row],[И]]),LEFT(список_детей[[#This Row],[О]]))","v":"ИЧЕ"},{"$f":"список_детей[[#This Row],[И]]&\" \"&LEFT(список_детей[[#This Row],[Ф]])&\".\"","v":"Чеслав И."},"2015-07-22",{"$f":"IF(список_детей[[#This Row],[Дата Рождения]]=\"\",\"\",DATEDIF(список_детей[[#This Row],[Дата Рождения]],TODAY(),\"y\")&\" лет\")","v":"6 лет"},{"$f":"IF(список_детей[[#This Row],[О]]=\"\",\"\",IF(RIGHT(список_детей[[#This Row],[О]])=\"ч\",\"м\",\"д\"))","v":"м"},4,"оздоровительная","2-3  года","АОП для детей с ТНР","индивидуальные занятия","ТНР"]
[null,5,"Иванченко","Поликарп","Анатолиевич",{"$f":"CONCATENATE(LEFT(список_детей[[#This Row],[Ф]]),LEFT(список_детей[[#This Row],[И]]),LEFT(список_детей[[#This Row],[О]]))","v":"ИПА"},{"$f":"список_детей[[#This Row],[И]]&\" \"&LEFT(список_детей[[#This Row],[Ф]])&\".\"","v":"Поликарп И."},"2015-01-18",{"$f":"IF(список_детей[[#This Row],[Дата Рождения]]=\"\",\"\",DATEDIF(список_детей[[#This Row],[Дата Рождения]],TODAY(),\"y\")&\" лет\")","v":"7 лет"},{"$f":"IF(список_детей[[#This Row],[О]]=\"\",\"\",IF(RIGHT(список_детей[[#This Row],[О]])=\"ч\",\"м\",\"д\"))","v":"м"},5,"оздоровительная","3-4 года","АОП для детей с ТНР","индивидуальные занятия","ТНР"]
[null,6,"Канадцева","Дина","Романовна",{"$f":"CONCATENATE(LEFT(список_детей[[#This Row],[Ф]]),LEFT(список_детей[[#This Row],[И]]),LEFT(список_детей[[#This Row],[О]]))","v":"КДР"},{"$f":"список_детей[[#This Row],[И]]&\" \"&LEFT(список_детей[[#This Row],[Ф]])&\".\"","v":"Дина К."},"2015-10-30",{"$f":"IF(список_детей[[#This Row],[Дата Рождения]]=\"\",\"\",DATEDIF(список_детей[[#This Row],[Дата Рождения]],TODAY(),\"y\")&\" лет\")","v":"6 лет"},{"$f":"IF(список_детей[[#This Row],[О]]=\"\",\"\",IF(RIGHT(список_детей[[#This Row],[О]])=\"ч\",\"м\",\"д\"))","v":"д"},11,"общеразвивающая","4-5 лет","АОП для детей с ТНР","индивидуальные занятия","ТНР"]
[null,7,"Караулин","Андрон","Игоревич",{"$f":"CONCATENATE(LEFT(список_детей[[#This Row],[Ф]]),LEFT(список_детей[[#This Row],[И]]),LEFT(список_детей[[#This Row],[О]]))","v":"КАИ"},{"$f":"список_детей[[#This Row],[И]]&\" \"&LEFT(список_детей[[#This Row],[Ф]])&\".\"","v":"Андрон К."},"2015-04-26",{"$f":"IF(список_детей[[#This Row],[Дата Рождения]]=\"\",\"\",DATEDIF(список_детей[[#This Row],[Дата Рождения]],TODAY(),\"y\")&\" лет\")","v":"6 лет"},{"$f":"IF(список_детей[[#This Row],[О]]=\"\",\"\",IF(RIGHT(список_детей[[#This Row],[О]])=\"ч\",\"м\",\"д\"))","v":"м"},11,"общеразвивающая","4-5 лет","АОП для детей с ТНР","индивидуальные занятия","ТНР"]
[null,8,"Кремов","Алексей","Яковович",{"$f":"CONCATENATE(LEFT(список_детей[[#This Row],[Ф]]),LEFT(список_детей[[#This Row],[И]]),LEFT(список_детей[[#This Row],[О]]))","v":"КАЯ"},{"$f":"список_детей[[#This Row],[И]]&\" \"&LEFT(список_детей[[#This Row],[Ф]])&\".\"","v":"Алексей К."},"2015-08-14",{"$f":"IF(список_детей[[#This Row],[Дата Рождения]]=\"\",\"\",DATEDIF(список_детей[[#This Row],[Дата Рождения]],TODAY(),\"y\")&\" лет\")","v":"6 лет"},{"$f":"IF(список_детей[[#This Row],[О]]=\"\",\"\",IF(RIGHT(список_детей[[#This Row],[О]])=\"ч\",\"м\",\"д\"))","v":"м"},17,"комбинированная","5-6 лет","Школа Фиолетового леса","групповые занятия","ТНР"]
[null,9,"Столин","Игорь","Кондратович",{"$f":"CONCATENATE(LEFT(список_детей[[#This Row],[Ф]]),LEFT(список_детей[[#This Row],[И]]),LEFT(список_детей[[#This Row],[О]]))","v":"СИК"},{"$f":"список_детей[[#This Row],[И]]&\" \"&LEFT(список_детей[[#This Row],[Ф]])&\".\"","v":"Игорь С."},"2015-07-21",{"$f":"IF(список_детей[[#This Row],[Дата Рождения]]=\"\",\"\",DATEDIF(список_детей[[#This Row],[Дата Рождения]],TODAY(),\"y\")&\" лет\")","v":"6 лет"},{"$f":"IF(список_детей[[#This Row],[О]]=\"\",\"\",IF(RIGHT(список_детей[[#This Row],[О]])=\"ч\",\"м\",\"д\"))","v":"м"},17,"комбинированная","5-6 лет","Школа Фиолетового леса","групповые занятия","ТНР"]
[null,10,"Федоров","Вячеслав","Федорович",{"$f":"CONCATENATE(LEFT(список_детей[[#This Row],[Ф]]),LEFT(список_детей[[#This Row],[И]]),LEFT(список_детей[[#This Row],[О]]))","v":"ФВФ"},{"$f":"список_детей[[#This Row],[И]]&\" \"&LEFT(список_детей[[#This Row],[Ф]])&\".\"","v":"Вячеслав Ф."},"2019-09-30",{"$f":"IF(список_детей[[#This Row],[Дата Рождения]]=\"\",\"\",DATEDIF(список_детей[[#This Row],[Дата Рождения]],TODAY(),\"y\")&\" лет\")","v":"2 лет"},{"$f":"IF(список_детей[[#This Row],[О]]=\"\",\"\",IF(RIGHT(список_детей[[#This Row],[О]])=\"ч\",\"м\",\"д\"))","v":"м"},17,"комбинированная","5-6 лет","Школа Фиолетового леса","групповые занятия","УО"]
[null,11,"Каретников","Мартын","Чеславович",{"$f":"CONCATENATE(LEFT(список_детей[[#This Row],[Ф]]),LEFT(список_детей[[#This Row],[И]]),LEFT(список_детей[[#This Row],[О]]))","v":"КМЧ"},{"$f":"список_детей[[#This Row],[И]]&\" \"&LEFT(список_детей[[#This Row],[Ф]])&\".\"","v":"Мартын К."},"2015-09-28",{"$f":"IF(список_детей[[#This Row],[Дата Рождения]]=\"\",\"\",DATEDIF(список_детей[[#This Row],[Дата Рождения]],TODAY(),\"y\")&\" лет\")","v":"6 лет"},{"$f":"IF(список_детей[[#This Row],[О]]=\"\",\"\",IF(RIGHT(список_детей[[#This Row],[О]])=\"ч\",\"м\",\"д\"))","v":"м"},17,"комбинированная","5-6 лет","Школа Фиолетового леса","групповые занятия","ЗПР"]
[null,12,"Каримов","Екатерина","Антониновна",{"$f":"CONCATENATE(LEFT(список_детей[[#This Row],[Ф]]),LEFT(список_детей[[#This Row],[И]]),LEFT(список_детей[[#This Row],[О]]))","v":"КЕА"},{"$f":"список_детей[[#This Row],[И]]&\" \"&LEFT(список_детей[[#This Row],[Ф]])&\".\"","v":"Екатерина К."},"2015-05-12",{"$f":"IF(список_детей[[#This Row],[Дата Рождения]]=\"\",\"\",DATEDIF(список_детей[[#This Row],[Дата Рождения]],TODAY(),\"y\")&\" лет\")","v":"6 лет"},{"$f":"IF(список_детей[[#This Row],[О]]=\"\",\"\",IF(RIGHT(список_детей[[#This Row],[О]])=\"ч\",\"м\",\"д\"))","v":"д"},17,"комбинированная","5-6 лет","Школа Фиолетового леса","групповые занятия","ЗПР"]
[null,13,"Ковшутина","Дарья","Ивановна",{"$f":"CONCATENATE(LEFT(список_детей[[#This Row],[Ф]]),LEFT(список_детей[[#This Row],[И]]),LEFT(список_детей[[#This Row],[О]]))","v":"КДИ"},{"$f":"список_детей[[#This Row],[И]]&\" \"&LEFT(список_детей[[#This Row],[Ф]])&\".\"","v":"Дарья К."},"2015-09-16",{"$f":"IF(список_детей[[#This Row],[Дата Рождения]]=\"\",\"\",DATEDIF(список_детей[[#This Row],[Дата Рождения]],TODAY(),\"y\")&\" лет\")","v":"6 лет"},{"$f":"IF(список_детей[[#This Row],[О]]=\"\",\"\",IF(RIGHT(список_детей[[#This Row],[О]])=\"ч\",\"м\",\"д\"))","v":"д"},17,"комбинированная","5-6 лет","Школа Фиолетового леса","групповые занятия","ЗПР"]
[null,14,"Косинова","Анфиса","Петровна",{"$f":"CONCATENATE(LEFT(список_детей[[#This Row],[Ф]]),LEFT(список_детей[[#This Row],[И]]),LEFT(список_детей[[#This Row],[О]]))","v":"КАП"},{"$f":"список_детей[[#This Row],[И]]&\" \"&LEFT(список_детей[[#This Row],[Ф]])&\".\"","v":"Анфиса К."},"2015-04-22",{"$f":"IF(список_детей[[#This Row],[Дата Рождения]]=\"\",\"\",DATEDIF(список_детей[[#This Row],[Дата Рождения]],TODAY(),\"y\")&\" лет\")","v":"6 лет"},{"$f":"IF(список_детей[[#This Row],[О]]=\"\",\"\",IF(RIGHT(список_детей[[#This Row],[О]])=\"ч\",\"м\",\"д\"))","v":"д"},17,"комбинированная","5-6 лет","Школа Фиолетового леса","групповые занятия","УО"]
[null,15,"Косомова","Кира","Кузьмевна",{"$f":"CONCATENATE(LEFT(список_детей[[#This Row],[Ф]]),LEFT(список_детей[[#This Row],[И]]),LEFT(список_детей[[#This Row],[О]]))","v":"ККК"},{"$f":"список_детей[[#This Row],[И]]&\" \"&LEFT(список_детей[[#This Row],[Ф]])&\".\"","v":"Кира К."},"2015-04-17",{"$f":"IF(список_детей[[#This Row],[Дата Рождения]]=\"\",\"\",DATEDIF(список_детей[[#This Row],[Дата Рождения]],TODAY(),\"y\")&\" лет\")","v":"6 лет"},{"$f":"IF(список_детей[[#This Row],[О]]=\"\",\"\",IF(RIGHT(список_детей[[#This Row],[О]])=\"ч\",\"м\",\"д\"))","v":"д"},1,"общеразвивающая","1-2 года","АОП для детей с УО","индивидуальные занятия","УО"]
{"$rows_left_out":475}