{"text_format":"1","workbook":"xlsx","n_sheets":2,"sheets":["Апрель","Алишер"],"not_rendered":{"charts":0,"images":0,"macros":1,"external_links":0,"defined_names":0,"comments":0,"pivot_tables":0},"unopened":[],"bounds":{"document_bytes":16777216,"sheet_cells":100000,"rows_first":2000,"rows_last":500,"rows_between":2000,"halvings":0,"cell_chars":16384,"cell_head_chars":4096},"cells_cut":0,"cells_raw":0,"read":"whole","date_system":"1900"}

{"sheet":"Апрель","index":0,"n_rows":6,"n_cols":10,"rows_kept":6,"cut":false,"hidden":false,"merged":[[0,0,0,1]]}
["Общая статистика"]
["ID заявки","Дата получения заявки","Имя дилера","Принято заявок","Выполнено","Причина поломки","Регион заявки","Номер дилера","Специалист","Статус"]
[9000,"2022-04-15","Бехруз",2,2,"Виндовс задан даркор","Душанбе","000775857","Сафар","Выполнен"]
[9001,"2022-04-15","Бехруз",2,2,"Виндовс задан даркор","Душанбе","000775858","Махмуд","Выполнен"]
[9002,"2022-04-15","Бехруз",2,2,"Виндовс задан даркор","Душанбе","000775859","Екуб","Выполнен"]
[9003,"2022-04-15","Бехруз",2,2,"Виндовс задан даркор","Душанбе","000775860","Алишер","Выполнен"]

{"sheet":"Алишер","index":1,"n_rows":8,"n_cols":10,"rows_kept":8,"cut":false,"hidden":false,"merged":[]}
["Алишер"]
["ID заявки","Дата получения заявки","Имя дилера","Принято заявок","Выполнено","Причина поломки","Регион заявки","Номер дилера","Специалист","Статус"]
[{"$f":"IFERROR(INDEX(Апрель!$A$1:$J$10,SMALL(IF(Апрель!$I$1:$I$10=$A$1,ROW($I$1:$I$10)),ROW(A1)),COLUMN()),\"\")","v":9003},{"$f":"IFERROR(INDEX(Апрель!$A$1:$J$10,SMALL(IF(Апрель!$I$1:$I$10=$A$1,ROW($I$1:$I$10)),ROW(B1)),COLUMN()),\"\")","v":"2022-04-15"},{"$f":"IFERROR(INDEX(Апрель!$A$1:$J$10,SMALL(IF(Апрель!$I$1:$I$10=$A$1,ROW($I$1:$I$10)),ROW(C1)),COLUMN()),\"\")","v":"Бехруз"},{"$f":"IFERROR(INDEX(Апрель!$A$1:$J$10,SMALL(IF(Апрель!$I$1:$I$10=$A$1,ROW($I$1:$I$10)),ROW(D1)),COLUMN()),\"\")","v":2},{"$f":"IFERROR(INDEX(Апрель!$A$1:$J$10,SMALL(IF(Апрель!$I$1:$I$10=$A$1,ROW($I$1:$I$10)),ROW(E1)),COLUMN()),\"\")","v":2},{"$f":"IFERROR(INDEX(Апрель!$A$1:$J$10,SMALL(IF(Апрель!$I$1:$I$10=$A$1,ROW($I$1:$I$10)),ROW(F1)),COLUMN()),\"\")","v":"Виндовс задан даркор"},{"$f":"IFERROR(INDEX(Апрель!$A$1:$J$10,SMALL(IF(Апрель!$I$1:$I$10=$A$1,ROW($I$1:$I$10)),ROW(G1)),COLUMN()),\"\")","v":"Душанбе"},{"$f":"IFERROR(INDEX(Апрель!$A$1:$J$10,SMALL(IF(Апрель!$I$1:$I$10=$A$1,ROW($I$1:$I$10)),ROW(H1)),COLUMN()),\"\")","v":"000775860"},{"$f":"IFERROR(INDEX(Апрель!$A$1:$J$10,SMALL(IF(Апрель!$I$1:$I$10=$A$1,ROW($I$1:$I$10)),ROW(I1)),COLUMN()),\"\")","v":"Алишер"},{"$f":"IFERROR(INDEX(Апрель!$A$1:$J$10,SMALL(IF(Апрель!$I$1:$I$10=$A$1,ROW($I$1:$I$10)),ROW(J1)),COLUMN()),\"\")","v":"Выполнен"}]
[{"$f":"IFERROR(INDEX(Апрель!$A$1:$J$10,SMALL(IF(Апрель!$I$1:$I$10=$A$1,ROW($I$1:$I$10)),ROW(A2)),COLUMN()),\"\")","v":""},{"$f":"IFERROR(INDEX(Апрель!$A$1:$J$10,SMALL(IF(Апрель!$I$1:$I$10=$A$1,ROW($I$1:$I$10)),ROW(B2)),COLUMN()),\"\")","v":""},{"$f":"IFERROR(INDEX(Апрель!$A$1:$J$10,SMALL(IF(Апрель!$I$1:$I$10=$A$1,ROW($I$1:$I$10)),ROW(C2)),COLUMN()),\"\")","v":""},{"$f":"IFERROR(INDEX(Апрель!$A$1:$J$10,SMALL(IF(Апрель!$I$1:$I$10=$A$1,ROW($I$1:$I$10)),ROW(D2)),COLUMN()),\"\")","v":""},{"$f":"IFERROR(INDEX(Апрель!$A$1:$J$10,SMALL(IF(Апрель!$I$1:$I$10=$A$1,ROW($I$1:$I$10)),ROW(E2)),COLUMN()),\"\")","v":""},{"$f":"IFERROR(INDEX(Апрель!$A$1:$J$10,SMALL(IF(Апрель!$I$1:$I$10=$A$1,ROW($I$1:$I$10)),ROW(F2)),COLUMN()),\"\")","v":""},{"$f":"IFERROR(INDEX(Апрель!$A$1:$J$10,SMALL(IF(Апрель!$I$1:$I$10=$A$1,ROW($I$1:$I$10)),ROW(G2)),COLUMN()),\"\")","v":""},{"$f":"IFERROR(INDEX(Апрель!$A$1:$J$10,SMALL(IF(Апрель!$I$1:$I$10=$A$1,ROW($I$1:$I$10)),ROW(H2)),COLUMN()),\"\")","v":""},{"$f":"IFERROR(INDEX(Апрель!$A$1:$J$10,SMALL(IF(Апрель!$I$1:$I$10=$A$1,ROW($I$1:$I$10)),ROW(I2)),COLUMN()),\"\")","v":""},{"$f":"IFERROR(INDEX(Апрель!$A$1:$J$10,SMALL(IF(Апрель!$I$1:$I$10=$A$1,ROW($I$1:$I$10)),ROW(J2)),COLUMN()),\"\")","v":""}]
[{"$f":"IFERROR(INDEX(Апрель!$A$1:$J$10,SMALL(IF(Апрель!$I$1:$I$10=$A$1,ROW($I$1:$I$10)),ROW(A3)),COLUMN()),\"\")","v":""},{"$f":"IFERROR(INDEX(Апрель!$A$1:$J$10,SMALL(IF(Апрель!$I$1:$I$10=$A$1,ROW($I$1:$I$10)),ROW(B3)),COLUMN()),\"\")","v":""},{"$f":"IFERROR(INDEX(Апрель!$A$1:$J$10,SMALL(IF(Апрель!$I$1:$I$10=$A$1,ROW($I$1:$I$10)),ROW(C3)),COLUMN()),\"\")","v":""},{"$f":"IFERROR(INDEX(Апрель!$A$1:$J$10,SMALL(IF(Апрель!$I$1:$I$10=$A$1,ROW($I$1:$I$10)),ROW(D3)),COLUMN()),\"\")","v":""},{"$f":"IFERROR(INDEX(Апрель!$A$1:$J$10,SMALL(IF(Апрель!$I$1:$I$10=$A$1,ROW($I$1:$I$10)),ROW(E3)),COLUMN()),\"\")","v":""},{"$f":"IFERROR(INDEX(Апрель!$A$1:$J$10,SMALL(IF(Апрель!$I$1:$I$10=$A$1,ROW($I$1:$I$10)),ROW(F3)),COLUMN()),\"\")","v":""},{"$f":"IFERROR(INDEX(Апрель!$A$1:$J$10,SMALL(IF(Апрель!$I$1:$I$10=$A$1,ROW($I$1:$I$10)),ROW(G3)),COLUMN()),\"\")","v":""},{"$f":"IFERROR(INDEX(Апрель!$A$1:$J$10,SMALL(IF(Апрель!$I$1:$I$10=$A$1,ROW($I$1:$I$10)),ROW(H3)),COLUMN()),\"\")","v":""},{"$f":"IFERROR(INDEX(Апрель!$A$1:$J$10,SMALL(IF(Апрель!$I$1:$I$10=$A$1,ROW($I$1:$I$10)),ROW(I3)),COLUMN()),\"\")","v":""},{"$f":"IFERROR(INDEX(Апрель!$A$1:$J$10,SMALL(IF(Апрель!$I$1:$I$10=$A$1,ROW($I$1:$I$10)),ROW(J3)),COLUMN()),\"\")","v":""}]
[{"$f":"IFERROR(INDEX(Апрель!$A$1:$J$10,SMALL(IF(Апрель!$I$1:$I$10=$A$1,ROW($I$1:$I$10)),ROW(A4)),COLUMN()),\"\")","v":""},{"$f":"IFERROR(INDEX(Апрель!$A$1:$J$10,SMALL(IF(Апрель!$I$1:$I$10=$A$1,ROW($I$1:$I$10)),ROW(B4)),COLUMN()),\"\")","v":""},{"$f":"IFERROR(INDEX(Апрель!$A$1:$J$10,SMALL(IF(Апрель!$I$1:$I$10=$A$1,ROW($I$1:$I$10)),ROW(C4)),COLUMN()),\"\")","v":""},{"$f":"IFERROR(INDEX(Апрель!$A$1:$J$10,SMALL(IF(Апрель!$I$1:$I$10=$A$1,ROW($I$1:$I$10)),ROW(D4)),COLUMN()),\"\")","v":""},{"$f":"IFERROR(INDEX(Апрель!$A$1:$J$10,SMALL(IF(Апрель!$I$1:$I$10=$A$1,ROW($I$1:$I$10)),ROW(E4)),COLUMN()),\"\")","v":""},{"$f":"IFERROR(INDEX(Апрель!$A$1:$J$10,SMALL(IF(Апрель!$I$1:$I$10=$A$1,ROW($I$1:$I$10)),ROW(F4)),COLUMN()),\"\")","v":""},{"$f":"IFERROR(INDEX(Апрель!$A$1:$J$10,SMALL(IF(Апрель!$I$1:$I$10=$A$1,ROW($I$1:$I$10)),ROW(G4)),COLUMN()),\"\")","v":""},{"$f":"IFERROR(INDEX(Апрель!$A$1:$J$10,SMALL(IF(Апрель!$I$1:$I$10=$A$1,ROW($I$1:$I$10)),ROW(H4)),COLUMN()),\"\")","v":""},{"$f":"IFERROR(INDEX(Апрель!$A$1:$J$10,SMALL(IF(Апрель!$I$1:$I$10=$A$1,ROW($I$1:$I$10)),ROW(I4)),COLUMN()),\"\")","v":""},{"$f":"IFERROR(INDEX(Апрель!$A$1:$J$10,SMALL(IF(Апрель!$I$1:$I$10=$A$1,ROW($I$1:$I$10)),ROW(J4)),COLUMN()),\"\")","v":""}]
[{"$f":"IFERROR(INDEX(Апрель!$A$1:$J$10,SMALL(IF(Апрель!$I$1:$I$10=$A$1,ROW($I$1:$I$10)),ROW(A5)),COLUMN()),\"\")","v":""},{"$f":"IFERROR(INDEX(Апрель!$A$1:$J$10,SMALL(IF(Апрель!$I$1:$I$10=$A$1,ROW($I$1:$I$10)),ROW(B5)),COLUMN()),\"\")","v":""},{"$f":"IFERROR(INDEX(Апрель!$A$1:$J$10,SMALL(IF(Апрель!$I$1:$I$10=$A$1,ROW($I$1:$I$10)),ROW(C5)),COLUMN()),\"\")","v":""},{"$f":"IFERROR(INDEX(Апрель!$A$1:$J$10,SMALL(IF(Апрель!$I$1:$I$10=$A$1,ROW($I$1:$I$10)),ROW(D5)),COLUMN()),\"\")","v":""},{"$f":"IFERROR(INDEX(Апрель!$A$1:$J$10,SMALL(IF(Апрель!$I$1:$I$10=$A$1,ROW($I$1:$I$10)),ROW(E5)),COLUMN()),\"\")","v":""},{"$f":"IFERROR(INDEX(Апрель!$A$1:$J$10,SMALL(IF(Апрель!$I$1:$I$10=$A$1,ROW($I$1:$I$10)),ROW(F5)),COLUMN()),\"\")","v":""},{"$f":"IFERROR(INDEX(Апрель!$A$1:$J$10,SMALL(IF(Апрель!$I$1:$I$10=$A$1,ROW($I$1:$I$10)),ROW(G5)),COLUMN()),\"\")","v":""},{"$f":"IFERROR(INDEX(Апрель!$A$1:$J$10,SMALL(IF(Апрель!$I$1:$I$10=$A$1,ROW($I$1:$I$10)),ROW(H5)),COLUMN()),\"\")","v":""},{"$f":"IFERROR(INDEX(Апрель!$A$1:$J$10,SMALL(IF(Апрель!$I$1:$I$10=$A$1,ROW($I$1:$I$10)),ROW(I5)),COLUMN()),\"\")","v":""},{"$f":"IFERROR(INDEX(Апрель!$A$1:$J$10,SMALL(IF(Апрель!$I$1:$I$10=$A$1,ROW($I$1:$I$10)),ROW(J5)),COLUMN()),\"\")","v":""}]
[{"$f":"IFERROR(INDEX(Апрель!$A$1:$J$10,SMALL(IF(Апрель!$I$1:$I$10=$A$1,ROW($I$1:$I$10)),ROW(A6)),COLUMN()),\"\")","v":""},{"$f":"IFERROR(INDEX(Апрель!$A$1:$J$10,SMALL(IF(Апрель!$I$1:$I$10=$A$1,ROW($I$1:$I$10)),ROW(B6)),COLUMN()),\"\")","v":""},{"$f":"IFERROR(INDEX(Апрель!$A$1:$J$10,SMALL(IF(Апрель!$I$1:$I$10=$A$1,ROW($I$1:$I$10)),ROW(C6)),COLUMN()),\"\")","v":""},{"$f":"IFERROR(INDEX(Апрель!$A$1:$J$10,SMALL(IF(Апрель!$I$1:$I$10=$A$1,ROW($I$1:$I$10)),ROW(D6)),COLUMN()),\"\")","v":""},{"$f":"IFERROR(INDEX(Апрель!$A$1:$J$10,SMALL(IF(Апрель!$I$1:$I$10=$A$1,ROW($I$1:$I$10)),ROW(E6)),COLUMN()),\"\")","v":""},{"$f":"IFERROR(INDEX(Апрель!$A$1:$J$10,SMALL(IF(Апрель!$I$1:$I$10=$A$1,ROW($I$1:$I$10)),ROW(F6)),COLUMN()),\"\")","v":""},{"$f":"IFERROR(INDEX(Апрель!$A$1:$J$10,SMALL(IF(Апрель!$I$1:$I$10=$A$1,ROW($I$1:$I$10)),ROW(G6)),COLUMN()),\"\")","v":""},{"$f":"IFERROR(INDEX(Апрель!$A$1:$J$10,SMALL(IF(Апрель!$I$1:$I$10=$A$1,ROW($I$1:$I$10)),ROW(H6)),COLUMN()),\"\")","v":""},{"$f":"IFERROR(INDEX(Апрель!$A$1:$J$10,SMALL(IF(Апрель!$I$1:$I$10=$A$1,ROW($I$1:$I$10)),ROW(I6)),COLUMN()),\"\")","v":""},{"$f":"IFERROR(INDEX(Апрель!$A$1:$J$10,SMALL(IF(Апрель!$I$1:$I$10=$A$1,ROW($I$1:$I$10)),ROW(J6)),COLUMN()),\"\")","v":""}]