{"text_format":"1","workbook":"xlsx","n_sheets":3,"sheets":["Ввод данных","Персональные данные","Движение"],"not_rendered":{"charts":0,"images":0,"macros":1,"external_links":0,"defined_names":0,"comments":0,"pivot_tables":0},"unopened":[],"bounds":{"document_bytes":16777216,"sheet_cells":100000,"rows_first":2000,"rows_last":500,"rows_between":2000,"halvings":0,"cell_chars":16384,"cell_head_chars":4096},"cells_cut":0,"cells_raw":0,"read":"whole","date_system":"1900"}

{"sheet":"Ввод данных","index":0,"n_rows":6,"n_cols":16,"rows_kept":6,"cut":false,"hidden":false,"merged":[[2,12,3,12],[2,13,3,13],[2,14,3,15],[0,0,0,8],[2,8,2,10],[2,11,3,11],[2,4,3,4],[2,0,3,0],[2,1,3,1],[2,2,3,2],[2,3,3,3],[2,6,3,6],[2,7,3,7]]}
["Форма ввода данных"]
[]
["№ ","Дата     выдачи","Срок    выдачи","До даты","№ ТСР","Выдано","Ф.И.О","Дата рождения","Паспортные данные",null,null,"Дата выдачи","Место регистрации","Место проживания","Телефон"]
[null,null,null,null,null,"Возврат",null,null,"серия","номер","кем выдан"]
[]
[2,"2022-02-11",6,"2022-08-11",410100100,"Выдано","Смирнов Виктор Иванович","1988-01-12",101,505642,"ГОВД ","2001-06-15","Россия","Россия",9099090000,3869570318]

{"sheet":"Персональные данные","index":1,"n_rows":5,"n_cols":11,"rows_kept":5,"cut":false,"hidden":false,"merged":[[1,9,2,10],[1,1,2,1],[1,2,2,2],[1,3,1,5],[1,0,2,0],[0,1,0,6],[1,6,2,6],[1,7,2,7],[1,8,2,8]]}
[null,"Персональные данные"]
["№","Ф.И.О","Дата рождения","Паспортные данные",null,null,"Дата выдачи","Место регистрации","Место проживания","Телефон"]
[null,null,null,"серия","номер","кем выдан"]
[1,1]
[null,"Смирнов Виктор Иванович","1988-01-12",101,505642,"ГОВД ","2001-06-15","Россия","Россия",9099090000,3869570318]

{"sheet":"Движение","index":2,"n_rows":500,"n_cols":9,"rows_kept":500,"cut":false,"hidden":false,"merged":[[6,8,7,8],[5,1,5,7],[6,1,7,1],[6,2,7,2],[6,3,7,3],[6,4,7,4],[6,5,7,5],[6,7,7,7]]}
[]
[]
[]
[]
[]
[null,"Движение"]
[null,"№ ","Дата     выдачи","Срок    выдачи","Дата возврата","№ ТСР","Выдано","Ф.И.О","Наименование"]
[null,null,null,null,null,null,"Возврат"]
[null,1]
[null,2,"2022-02-11",6,"2022-08-11",410100100,"Выдано","Смирнов Виктор Иванович",{"$f":"IFERROR(INDEX(#REF!,MATCH(F10,#REF!,)),\"\")","v":""}]
[null,null,null,null,null,null,null,null,{"$f":"IFERROR(INDEX(#REF!,MATCH(F11,#REF!,)),\"\")","v":""}]
[null,null,null,null,null,null,null,null,{"$f":"IFERROR(INDEX(#REF!,MATCH(F12,#REF!,)),\"\")","v":""}]
[null,null,null,null,null,null,null,null,{"$f":"IFERROR(INDEX(#REF!,MATCH(F13,#REF!,)),\"\")","v":""}]
[null,null,null,null,null,null,null,null,{"$f":"IFERROR(INDEX(#REF!,MATCH(F14,#REF!,)),\"\")","v":""}]
[null,null,null,null,null,null,null,null,{"$f":"IFERROR(INDEX(#REF!,MATCH(F15,#REF!,)),\"\")","v":""}]
[null,null,null,null,null,null,null,null,{"$f":"IFERROR(INDEX(#REF!,MATCH(F16,#REF!,)),\"\")","v":""}]
[null,null,null,null,null,null,null,null,{"$f":"IFERROR(INDEX(#REF!,MATCH(F17,#REF!,)),\"\")","v":""}]
[null,null,null,null,null,null,null,null,{"$f":"IFERROR(INDEX(#REF!,MATCH(F18,#REF!,)),\"\")","v":""}]
[null,null,null,null,null,null,null,null,{"$f":"IFERROR(INDEX(#REF!,MATCH(F19,#REF!,)),\"\")","v":""}]
[null,null,null,null,null,null,null,null,{"$f":"IFERROR(INDEX(#REF!,MATCH(F20,#REF!,)),\"\")","v":""}]
[null,null,null,null,null,null,null,null,{"$f":"IFERROR(INDEX(#REF!,MATCH(F21,#REF!,)),\"\")","v":""}]
[null,null,null,null,null,null,null,null,{"$f":"IFERROR(INDEX(#REF!,MATCH(F22,#REF!,)),\"\")","v":""}]
[null,null,null,null,null,null,null,null,{"$f":"IFERROR(INDEX(#REF!,MATCH(F23,#REF!,)),\"\")","v":""}]
[null,null,null,null,null,null,null,null,{"$f":"IFERROR(INDEX(#REF!,MATCH(F24,#REF!,)),\"\")","v":""}]
[null,null,null,null,null,null,null,null,{"$f":"IFERROR(INDEX(#REF!,MATCH(F25,#REF!,)),\"\")","v":""}]
[null,null,null,null,null,null,null,null,{"$f":"IFERROR(INDEX(#REF!,MATCH(F26,#REF!,)),\"\")","v":""}]
[null,null,null,null,null,null,null,null,{"$f":"IFERROR(INDEX(#REF!,MATCH(F27,#REF!,)),\"\")","v":""}]
[null,null,null,null,null,null,null,null,{"$f":"IFERROR(INDEX(#REF!,MATCH(F28,#REF!,)),\"\")","v":""}]
[null,null,null,null,null,null,null,null,{"$f":"IFERROR(INDEX(#REF!,MATCH(F29,#REF!,)),\"\")","v":""}]
[null,null,null,null,null,null,null,null,{"$f":"IFERROR(INDEX(#REF!,MATCH(F30,#REF!,)),\"\")","v":""}]
[null,null,null,null,null,null,null,null,{"$f":"IFERROR(INDEX(#REF!,MATCH(F31,#REF!,)),\"\")","v":""}]
[null,null,null,null,null,null,null,null,{"$f":"IFERROR(INDEX(#REF!,MATCH(F32,#REF!,)),\"\")","v":""}]
[null,null,null,null,null,null,null,null,{"$f":"IFERROR(INDEX(#REF!,MATCH(F33,#REF!,)),\"\")","v":""}]
[null,null,null,null,null,null,null,null,{"$f":"IFERROR(INDEX(#REF!,MATCH(F34,#REF!,)),\"\")","v":""}]
[null,null,null,null,null,null,null,null,{"$f":"IFERROR(INDEX(#REF!,MATCH(F35,#REF!,)),\"\")","v":""}]
[null,null,null,null,null,null,null,null,{"$f":"IFERROR(INDEX(#REF!,MATCH(F36,#REF!,)),\"\")","v":""}]
[null,null,null,null,null,null,null,null,{"$f":"IFERROR(INDEX(#REF!,MATCH(F37,#REF!,)),\"\")","v":""}]
[null,null,null,null,null,null,null,null,{"$f":"IFERROR(INDEX(#REF!,MATCH(F38,#REF!,)),\"\")","v":""}]
[null,null,null,null,null,null,null,null,{"$f":"IFERROR(INDEX(#REF!,MATCH(F39,#REF!,)),\"\")","v":""}]
[null,null,null,null,null,null,null,null,{"$f":"IFERROR(INDEX(#REF!,MATCH(F40,#REF!,)),\"\")","v":""}]
[null,null,null,null,null,null,null,null,{"$f":"IFERROR(INDEX(#REF!,MATCH(F41,#REF!,)),\"\")","v":""}]
[null,null,null,null,null,null,null,null,{"$f":"IFERROR(INDEX(#REF!,MATCH(F42,#REF!,)),\"\")","v":""}]
[null,null,null,null,null,null,null,null,{"$f":"IFERROR(INDEX(#REF!,MATCH(F43,#REF!,)),\"\")","v":""}]
[null,null,null,null,null,null,null,null,{"$f":"IFERROR(INDEX(#REF!,MATCH(F44,#REF!,)),\"\")","v":""}]
[null,null,null,null,null,null,null,null,{"$f":"IFERROR(INDEX(#REF!,MATCH(F45,#REF!,)),\"\")","v":""}]
[null,null,null,null,null,null,null,null,{"$f":"IFERROR(INDEX(#REF!,MATCH(F46,#REF!,)),\"\")","v":""}]
[null,null,null,null,null,null,null,null,{"$f":"IFERROR(INDEX(#REF!,MATCH(F47,#REF!,)),\"\")","v":""}]
[null,null,null,null,null,null,null,null,{"$f":"IFERROR(INDEX(#REF!,MATCH(F48,#REF!,)),\"\")","v":""}]
[null,null,null,null,null,null,null,null,{"$f":"IFERROR(INDEX(#REF!,MATCH(F49,#REF!,)),\"\")","v":""}]
[null,null,null,null,null,null,null,null,{"$f":"IFERROR(INDEX(#REF!,MATCH(F50,#REF!,)),\"\")","v":""}]
[null,null,null,null,null,null,null,null,{"$f":"IFERROR(INDEX(#REF!,MATCH(F51,#REF!,)),\"\")","v":""}]
[null,null,null,null,null,null,null,null,{"$f":"IFERROR(INDEX(#REF!,MATCH(F52,#REF!,)),\"\")","v":""}]
[null,null,null,null,null,null,null,null,{"$f":"IFERROR(INDEX(#REF!,MATCH(F53,#REF!,)),\"\")","v":""}]
[null,null,null,null,null,null,null,null,{"$f":"IFERROR(INDEX(#REF!,MATCH(F54,#REF!,)),\"\")","v":""}]
[null,null,null,null,null,null,null,null,{"$f":"IFERROR(INDEX(#REF!,MATCH(F55,#REF!,)),\"\")","v":""}]
[null,null,null,null,null,null,null,null,{"$f":"IFERROR(INDEX(#REF!,MATCH(F56,#REF!,)),\"\")","v":""}]
[null,null,null,null,null,null,null,null,{"$f":"IFERROR(INDEX(#REF!,MATCH(F57,#REF!,)),\"\")","v":""}]
[null,null,null,null,null,null,null,null,{"$f":"IFERROR(INDEX(#REF!,MATCH(F58,#REF!,)),\"\")","v":""}]
[null,null,null,null,null,null,null,null,{"$f":"IFERROR(INDEX(#REF!,MATCH(F59,#REF!,)),\"\")","v":""}]
[null,null,null,null,null,null,null,null,{"$f":"IFERROR(INDEX(#REF!,MATCH(F60,#REF!,)),\"\")","v":""}]
[null,null,null,null,null,null,null,null,{"$f":"IFERROR(INDEX(#REF!,MATCH(F61,#REF!,)),\"\")","v":""}]
[null,null,null,null,null,null,null,null,{"$f":"IFERROR(INDEX(#REF!,MATCH(F62,#REF!,)),\"\")","v":""}]
[null,null,null,null,null,null,null,null,{"$f":"IFERROR(INDEX(#REF!,MATCH(F63,#REF!,)),\"\")","v":""}]
[null,null,null,null,null,null,null,null,{"$f":"IFERROR(INDEX(#REF!,MATCH(F64,#REF!,)),\"\")","v":""}]
[null,null,null,null,null,null,null,null,{"$f":"IFERROR(INDEX(#REF!,MATCH(F65,#REF!,)),\"\")","v":""}]
[null,null,null,null,null,null,null,null,{"$f":"IFERROR(INDEX(#REF!,MATCH(F66,#REF!,)),\"\")","v":""}]
[null,null,null,null,null,null,null,null,{"$f":"IFERROR(INDEX(#REF!,MATCH(F67,#REF!,)),\"\")","v":""}]
[null,null,null,null,null,null,null,null,{"$f":"IFERROR(INDEX(#REF!,MATCH(F68,#REF!,)),\"\")","v":""}]
[null,null,null,null,null,null,null,null,{"$f":"IFERROR(INDEX(#REF!,MATCH(F69,#REF!,)),\"\")","v":""}]
[null,null,null,null,null,null,null,null,{"$f":"IFERROR(INDEX(#REF!,MATCH(F70,#REF!,)),\"\")","v":""}]
[null,null,null,null,null,null,null,null,{"$f":"IFERROR(INDEX(#REF!,MATCH(F71,#REF!,)),\"\")","v":""}]
[null,null,null,null,null,null,null,null,{"$f":"IFERROR(INDEX(#REF!,MATCH(F72,#REF!,)),\"\")","v":""}]
[null,null,null,null,null,null,null,null,{"$f":"IFERROR(INDEX(#REF!,MATCH(F73,#REF!,)),\"\")","v":""}]
[null,null,null,null,null,null,null,null,{"$f":"IFERROR(INDEX(#REF!,MATCH(F74,#REF!,)),\"\")","v":""}]
[null,null,null,null,null,null,null,null,{"$f":"IFERROR(INDEX(#REF!,MATCH(F75,#REF!,)),\"\")","v":""}]
[null,null,null,null,null,null,null,null,{"$f":"IFERROR(INDEX(#REF!,MATCH(F76,#REF!,)),\"\")","v":""}]
[null,null,null,null,null,null,null,null,{"$f":"IFERROR(INDEX(#REF!,MATCH(F77,#REF!,)),\"\")","v":""}]
[null,null,null,null,null,null,null,null,{"$f":"IFERROR(INDEX(#REF!,MATCH(F78,#REF!,)),\"\")","v":""}]
[null,null,null,null,null,null,null,null,{"$f":"IFERROR(INDEX(#REF!,MATCH(F79,#REF!,)),\"\")","v":""}]
[null,null,null,null,null,null,null,null,{"$f":"IFERROR(INDEX(#REF!,MATCH(F80,#REF!,)),\"\")","v":""}]
[null,null,null,null,null,null,null,null,{"$f":"IFERROR(INDEX(#REF!,MATCH(F81,#REF!,)),\"\")","v":""}]
[null,null,null,null,null,null,null,null,{"$f":"IFERROR(INDEX(#REF!,MATCH(F82,#REF!,)),\"\")","v":""}]
[null,null,null,null,null,null,null,null,{"$f":"IFERROR(INDEX(#REF!,MATCH(F83,#REF!,)),\"\")","v":""}]
[null,null,null,null,null,null,null,null,{"$f":"IFERROR(INDEX(#REF!,MATCH(F84,#REF!,)),\"\")","v":""}]
[null,null,null,null,null,null,null,null,{"$f":"IFERROR(INDEX(#REF!,MATCH(F85,#REF!,)),\"\")","v":""}]
[null,null,null,null,null,null,null,null,{"$f":"IFERROR(INDEX(#REF!,MATCH(F86,#REF!,)),\"\")","v":""}]
[null,null,null,null,null,null,null,null,{"$f":"IFERROR(INDEX(#REF!,MATCH(F87,#REF!,)),\"\")","v":""}]
[null,null,null,null,null,null,null,null,{"$f":"IFERROR(INDEX(#REF!,MATCH(F88,#REF!,)),\"\")","v":""}]
[null,null,null,null,null,null,null,null,{"$f":"IFERROR(INDEX(#REF!,MATCH(F89,#REF!,)),\"\")","v":""}]
[null,null,null,null,null,null,null,null,{"$f":"IFERROR(INDEX(#REF!,MATCH(F90,#REF!,)),\"\")","v":""}]
[null,null,null,null,null,null,null,null,{"$f":"IFERROR(INDEX(#REF!,MATCH(F91,#REF!,)),\"\")","v":""}]
[null,null,null,null,null,null,null,null,{"$f":"IFERROR(INDEX(#REF!,MATCH(F92,#REF!,)),\"\")","v":""}]
[null,null,null,null,null,null,null,null,{"$f":"IFERROR(INDEX(#REF!,MATCH(F93,#REF!,)),\"\")","v":""}]
[null,null,null,null,null,null,null,null,{"$f":"IFERROR(INDEX(#REF!,MATCH(F94,#REF!,)),\"\")","v":""}]
[null,null,null,null,null,null,null,null,{"$f":"IFERROR(INDEX(#REF!,MATCH(F95,#REF!,)),\"\")","v":""}]
[null,null,null,null,null,null,null,null,{"$f":"IFERROR(INDEX(#REF!,MATCH(F96,#REF!,)),\"\")","v":""}]
[null,null,null,null,null,null,null,null,{"$f":"IFERROR(INDEX(#REF!,MATCH(F97,#REF!,)),\"\")","v":""}]
[null,null,null,null,null,null,null,null,{"$f":"IFERROR(INDEX(#REF!,MATCH(F98,#REF!,)),\"\")","v":""}]
[null,null,null,null,null,null,null,null,{"$f":"IFERROR(INDEX(#REF!,MATCH(F99,#REF!,)),\"\")","v":""}]
[null,null,null,null,null,null,null,null,{"$f":"IFERROR(INDEX(#REF!,MATCH(F100,#REF!,)),\"\")","v":""}]
[null,null,null,null,null,null,null,null,{"$f":"IFERROR(INDEX(#REF!,MATCH(F101,#REF!,)),\"\")","v":""}]
[null,null,null,null,null,null,null,null,{"$f":"IFERROR(INDEX(#REF!,MATCH(F102,#REF!,)),\"\")","v":""}]
[null,null,null,null,null,null,null,null,{"$f":"IFERROR(INDEX(#REF!,MATCH(F103,#REF!,)),\"\")","v":""}]
[null,null,null,null,null,null,null,null,{"$f":"IFERROR(INDEX(#REF!,MATCH(F104,#REF!,)),\"\")","v":""}]
[null,null,null,null,null,null,null,null,{"$f":"IFERROR(INDEX(#REF!,MATCH(F105,#REF!,)),\"\")","v":""}]
[null,null,null,null,null,null,null,null,{"$f":"IFERROR(INDEX(#REF!,MATCH(F106,#REF!,)),\"\")","v":""}]
[null,null,null,null,null,null,null,null,{"$f":"IFERROR(INDEX(#REF!,MATCH(F107,#REF!,)),\"\")","v":""}]
[null,null,null,null,null,null,null,null,{"$f":"IFERROR(INDEX(#REF!,MATCH(F108,#REF!,)),\"\")","v":""}]
[null,null,null,null,null,null,null,null,{"$f":"IFERROR(INDEX(#REF!,MATCH(F109,#REF!,)),\"\")","v":""}]
[null,null,null,null,null,null,null,null,{"$f":"IFERROR(INDEX(#REF!,MATCH(F110,#REF!,)),\"\")","v":""}]
[null,null,null,null,null,null,null,null,{"$f":"IFERROR(INDEX(#REF!,MATCH(F111,#REF!,)),\"\")","v":""}]
[null,null,null,null,null,null,null,null,{"$f":"IFERROR(INDEX(#REF!,MATCH(F112,#REF!,)),\"\")","v":""}]
[null,null,null,null,null,null,null,null,{"$f":"IFERROR(INDEX(#REF!,MATCH(F113,#REF!,)),\"\")","v":""}]
[null,null,null,null,null,null,null,null,{"$f":"IFERROR(INDEX(#REF!,MATCH(F114,#REF!,)),\"\")","v":""}]
[null,null,null,null,null,null,null,null,{"$f":"IFERROR(INDEX(#REF!,MATCH(F115,#REF!,)),\"\")","v":""}]
[null,null,null,null,null,null,null,null,{"$f":"IFERROR(INDEX(#REF!,MATCH(F116,#REF!,)),\"\")","v":""}]
[null,null,null,null,null,null,null,null,{"$f":"IFERROR(INDEX(#REF!,MATCH(F117,#REF!,)),\"\")","v":""}]
[null,null,null,null,null,null,null,null,{"$f":"IFERROR(INDEX(#REF!,MATCH(F118,#REF!,)),\"\")","v":""}]
[null,null,null,null,null,null,null,null,{"$f":"IFERROR(INDEX(#REF!,MATCH(F119,#REF!,)),\"\")","v":""}]
[null,null,null,null,null,null,null,null,{"$f":"IFERROR(INDEX(#REF!,MATCH(F120,#REF!,)),\"\")","v":""}]
[null,null,null,null,null,null,null,null,{"$f":"IFERROR(INDEX(#REF!,MATCH(F121,#REF!,)),\"\")","v":""}]
[null,null,null,null,null,null,null,null,{"$f":"IFERROR(INDEX(#REF!,MATCH(F122,#REF!,)),\"\")","v":""}]
[null,null,null,null,null,null,null,null,{"$f":"IFERROR(INDEX(#REF!,MATCH(F123,#REF!,)),\"\")","v":""}]
[null,null,null,null,null,null,null,null,{"$f":"IFERROR(INDEX(#REF!,MATCH(F124,#REF!,)),\"\")","v":""}]
[null,null,null,null,null,null,null,null,{"$f":"IFERROR(INDEX(#REF!,MATCH(F125,#REF!,)),\"\")","v":""}]
[null,null,null,null,null,null,null,null,{"$f":"IFERROR(INDEX(#REF!,MATCH(F126,#REF!,)),\"\")","v":""}]
[null,null,null,null,null,null,null,null,{"$f":"IFERROR(INDEX(#REF!,MATCH(F127,#REF!,)),\"\")","v":""}]
[null,null,null,null,null,null,null,null,{"$f":"IFERROR(INDEX(#REF!,MATCH(F128,#REF!,)),\"\")","v":""}]
[null,null,null,null,null,null,null,null,{"$f":"IFERROR(INDEX(#REF!,MATCH(F129,#REF!,)),\"\")","v":""}]
[null,null,null,null,null,null,null,null,{"$f":"IFERROR(INDEX(#REF!,MATCH(F130,#REF!,)),\"\")","v":""}]
[null,null,null,null,null,null,null,null,{"$f":"IFERROR(INDEX(#REF!,MATCH(F131,#REF!,)),\"\")","v":""}]
[null,null,null,null,null,null,null,null,{"$f":"IFERROR(INDEX(#REF!,MATCH(F132,#REF!,)),\"\")","v":""}]
[null,null,null,null,null,null,null,null,{"$f":"IFERROR(INDEX(#REF!,MATCH(F133,#REF!,)),\"\")","v":""}]
[null,null,null,null,null,null,null,null,{"$f":"IFERROR(INDEX(#REF!,MATCH(F134,#REF!,)),\"\")","v":""}]
[null,null,null,null,null,null,null,null,{"$f":"IFERROR(INDEX(#REF!,MATCH(F135,#REF!,)),\"\")","v":""}]
[null,null,null,null,null,null,null,null,{"$f":"IFERROR(INDEX(#REF!,MATCH(F136,#REF!,)),\"\")","v":""}]
[null,null,null,null,null,null,null,null,{"$f":"IFERROR(INDEX(#REF!,MATCH(F137,#REF!,)),\"\")","v":""}]
[null,null,null,null,null,null,null,null,{"$f":"IFERROR(INDEX(#REF!,MATCH(F138,#REF!,)),\"\")","v":""}]
[null,null,null,null,null,null,null,null,{"$f":"IFERROR(INDEX(#REF!,MATCH(F139,#REF!,)),\"\")","v":""}]
[null,null,null,null,null,null,null,null,{"$f":"IFERROR(INDEX(#REF!,MATCH(F140,#REF!,)),\"\")","v":""}]
[null,null,null,null,null,null,null,null,{"$f":"IFERROR(INDEX(#REF!,MATCH(F141,#REF!,)),\"\")","v":""}]
[null,null,null,null,null,null,null,null,{"$f":"IFERROR(INDEX(#REF!,MATCH(F142,#REF!,)),\"\")","v":""}]
[null,null,null,null,null,null,null,null,{"$f":"IFERROR(INDEX(#REF!,MATCH(F143,#REF!,)),\"\")","v":""}]
[null,null,null,null,null,null,null,null,{"$f":"IFERROR(INDEX(#REF!,MATCH(F144,#REF!,)),\"\")","v":""}]
[null,null,null,null,null,null,null,null,{"$f":"IFERROR(INDEX(#REF!,MATCH(F145,#REF!,)),\"\")","v":""}]
[null,null,null,null,null,null,null,null,{"$f":"IFERROR(INDEX(#REF!,MATCH(F146,#REF!,)),\"\")","v":""}]
[null,null,null,null,null,null,null,null,{"$f":"IFERROR(INDEX(#REF!,MATCH(F147,#REF!,)),\"\")","v":""}]
[null,null,null,null,null,null,null,null,{"$f":"IFERROR(INDEX(#REF!,MATCH(F148,#REF!,)),\"\")","v":""}]
[null,null,null,null,null,null,null,null,{"$f":"IFERROR(INDEX(#REF!,MATCH(F149,#REF!,)),\"\")","v":""}]
[null,null,null,null,null,null,null,null,{"$f":"IFERROR(INDEX(#REF!,MATCH(F150,#REF!,)),\"\")","v":""}]
[null,null,null,null,null,null,null,null,{"$f":"IFERROR(INDEX(#REF!,MATCH(F151,#REF!,)),\"\")","v":""}]
[null,null,null,null,null,null,null,null,{"$f":"IFERROR(INDEX(#REF!,MATCH(F152,#REF!,)),\"\")","v":""}]
[null,null,null,null,null,null,null,null,{"$f":"IFERROR(INDEX(#REF!,MATCH(F153,#REF!,)),\"\")","v":""}]
[null,null,null,null,null,null,null,null,{"$f":"IFERROR(INDEX(#REF!,MATCH(F154,#REF!,)),\"\")","v":""}]
[null,null,null,null,null,null,null,null,{"$f":"IFERROR(INDEX(#REF!,MATCH(F155,#REF!,)),\"\")","v":""}]
[null,null,null,null,null,null,null,null,{"$f":"IFERROR(INDEX(#REF!,MATCH(F156,#REF!,)),\"\")","v":""}]
[null,null,null,null,null,null,null,null,{"$f":"IFERROR(INDEX(#REF!,MATCH(F157,#REF!,)),\"\")","v":""}]
[null,null,null,null,null,null,null,null,{"$f":"IFERROR(INDEX(#REF!,MATCH(F158,#REF!,)),\"\")","v":""}]
[null,null,null,null,null,null,null,null,{"$f":"IFERROR(INDEX(#REF!,MATCH(F159,#REF!,)),\"\")","v":""}]
[null,null,null,null,null,null,null,null,{"$f":"IFERROR(INDEX(#REF!,MATCH(F160,#REF!,)),\"\")","v":""}]
[null,null,null,null,null,null,null,null,{"$f":"IFERROR(INDEX(#REF!,MATCH(F161,#REF!,)),\"\")","v":""}]
[null,null,null,null,null,null,null,null,{"$f":"IFERROR(INDEX(#REF!,MATCH(F162,#REF!,)),\"\")","v":""}]
[null,null,null,null,null,null,null,null,{"$f":"IFERROR(INDEX(#REF!,MATCH(F163,#REF!,)),\"\")","v":""}]
[null,null,null,null,null,null,null,null,{"$f":"IFERROR(INDEX(#REF!,MATCH(F164,#REF!,)),\"\")","v":""}]
[null,null,null,null,null,null,null,null,{"$f":"IFERROR(INDEX(#REF!,MATCH(F165,#REF!,)),\"\")","v":""}]
[null,null,null,null,null,null,null,null,{"$f":"IFERROR(INDEX(#REF!,MATCH(F166,#REF!,)),\"\")","v":""}]
[null,null,null,null,null,null,null,null,{"$f":"IFERROR(INDEX(#REF!,MATCH(F167,#REF!,)),\"\")","v":""}]
[null,null,null,null,null,null,null,null,{"$f":"IFERROR(INDEX(#REF!,MATCH(F168,#REF!,)),\"\")","v":""}]
[null,null,null,null,null,null,null,null,{"$f":"IFERROR(INDEX(#REF!,MATCH(F169,#REF!,)),\"\")","v":""}]
[null,null,null,null,null,null,null,null,{"$f":"IFERROR(INDEX(#REF!,MATCH(F170,#REF!,)),\"\")","v":""}]
[null,null,null,null,null,null,null,null,{"$f":"IFERROR(INDEX(#REF!,MATCH(F171,#REF!,)),\"\")","v":""}]
[null,null,null,null,null,null,null,null,{"$f":"IFERROR(INDEX(#REF!,MATCH(F172,#REF!,)),\"\")","v":""}]
[null,null,null,null,null,null,null,null,{"$f":"IFERROR(INDEX(#REF!,MATCH(F173,#REF!,)),\"\")","v":""}]
[null,null,null,null,null,null,null,null,{"$f":"IFERROR(INDEX(#REF!,MATCH(F174,#REF!,)),\"\")","v":""}]
[null,null,null,null,null,null,null,null,{"$f":"IFERROR(INDEX(#REF!,MATCH(F175,#REF!,)),\"\")","v":""}]
[null,null,null,null,null,null,null,null,{"$f":"IFERROR(INDEX(#REF!,MATCH(F176,#REF!,)),\"\")","v":""}]
[null,null,null,null,null,null,null,null,{"$f":"IFERROR(INDEX(#REF!,MATCH(F177,#REF!,)),\"\")","v":""}]
[null,null,null,null,null,null,null,null,{"$f":"IFERROR(INDEX(#REF!,MATCH(F178,#REF!,)),\"\")","v":""}]
[null,null,null,null,null,null,null,null,{"$f":"IFERROR(INDEX(#REF!,MATCH(F179,#REF!,)),\"\")","v":""}]
[null,null,null,null,null,null,null,null,{"$f":"IFERROR(INDEX(#REF!,MATCH(F180,#REF!,)),\"\")","v":""}]
[null,null,null,null,null,null,null,null,{"$f":"IFERROR(INDEX(#REF!,MATCH(F181,#REF!,)),\"\")","v":""}]
[null,null,null,null,null,null,null,null,{"$f":"IFERROR(INDEX(#REF!,MATCH(F182,#REF!,)),\"\")","v":""}]
[null,null,null,null,null,null,null,null,{"$f":"IFERROR(INDEX(#REF!,MATCH(F183,#REF!,)),\"\")","v":""}]
[null,null,null,null,null,null,null,null,{"$f":"IFERROR(INDEX(#REF!,MATCH(F184,#REF!,)),\"\")","v":""}]
[null,null,null,null,null,null,null,null,{"$f":"IFERROR(INDEX(#REF!,MATCH(F185,#REF!,)),\"\")","v":""}]
[null,null,null,null,null,null,null,null,{"$f":"IFERROR(INDEX(#REF!,MATCH(F186,#REF!,)),\"\")","v":""}]
[null,null,null,null,null,null,null,null,{"$f":"IFERROR(INDEX(#REF!,MATCH(F187,#REF!,)),\"\")","v":""}]
[null,null,null,null,null,null,null,null,{"$f":"IFERROR(INDEX(#REF!,MATCH(F188,#REF!,)),\"\")","v":""}]
[null,null,null,null,null,null,null,null,{"$f":"IFERROR(INDEX(#REF!,MATCH(F189,#REF!,)),\"\")","v":""}]
[null,null,null,null,null,null,null,null,{"$f":"IFERROR(INDEX(#REF!,MATCH(F190,#REF!,)),\"\")","v":""}]
[null,null,null,null,null,null,null,null,{"$f":"IFERROR(INDEX(#REF!,MATCH(F191,#REF!,)),\"\")","v":""}]
[null,null,null,null,null,null,null,null,{"$f":"IFERROR(INDEX(#REF!,MATCH(F192,#REF!,)),\"\")","v":""}]
[null,null,null,null,null,null,null,null,{"$f":"IFERROR(INDEX(#REF!,MATCH(F193,#REF!,)),\"\")","v":""}]
[null,null,null,null,null,null,null,null,{"$f":"IFERROR(INDEX(#REF!,MATCH(F194,#REF!,)),\"\")","v":""}]
[null,null,null,null,null,null,null,null,{"$f":"IFERROR(INDEX(#REF!,MATCH(F195,#REF!,)),\"\")","v":""}]
[null,null,null,null,null,null,null,null,{"$f":"IFERROR(INDEX(#REF!,MATCH(F196,#REF!,)),\"\")","v":""}]
[null,null,null,null,null,null,null,null,{"$f":"IFERROR(INDEX(#REF!,MATCH(F197,#REF!,)),\"\")","v":""}]
[null,null,null,null,null,null,null,null,{"$f":"IFERROR(INDEX(#REF!,MATCH(F198,#REF!,)),\"\")","v":""}]
[null,null,null,null,null,null,null,null,{"$f":"IFERROR(INDEX(#REF!,MATCH(F199,#REF!,)),\"\")","v":""}]
[null,null,null,null,null,null,null,null,{"$f":"IFERROR(INDEX(#REF!,MATCH(F200,#REF!,)),\"\")","v":""}]
{"$rows_left_out":300}