{"text_format":"1","workbook":"xlsx","n_sheets":3,"sheets":["Ввод данных","Персональные данные","Движение"],"not_rendered":{"charts":0,"images":0,"macros":1,"external_links":0,"defined_names":0,"comments":0,"pivot_tables":0},"unopened":[],"bounds":{"document_bytes":16777216,"sheet_cells":100000,"rows_first":2000,"rows_last":500,"rows_between":2000,"halvings":0,"cell_chars":16384,"cell_head_chars":4096},"cells_cut":0,"cells_raw":0,"read":"whole","date_system":"1900"}

{"sheet":"Ввод данных","index":0,"n_rows":6,"n_cols":16,"rows_kept":6,"cut":false,"hidden":false,"merged":[[2,12,3,12],[2,13,3,13],[2,14,3,15],[0,0,0,8],[2,8,2,10],[2,11,3,11],[2,4,3,4],[2,0,3,0],[2,1,3,1],[2,2,3,2],[2,3,3,3],[2,6,3,6],[2,7,3,7]]}
["Форма ввода данных"]
[]
["№ ","Дата     выдачи","Срок    выдачи","До даты","№ ТСР","Выдано","Ф.И.О","Дата рождения","Паспортные данные",null,null,"Дата выдачи","Место регистрации","Место проживания","Телефон"]
[null,null,null,null,null,"Возврат",null,null,"серия","номер","кем выдан"]
[]
[2,"2022-02-11",6,"2022-08-11",410100100,"Выдано","Смирнов Виктор Иванович","1988-01-12",101,505642,"ГОВД ","2001-06-15","Россия","Россия",9099090000,3869570318]

{"sheet":"Персональные данные","index":1,"n_rows":4,"n_cols":10,"rows_kept":4,"cut":false,"hidden":false,"merged":[[0,1,0,6],[1,6,2,6],[1,7,2,7],[1,8,2,8],[1,9,2,10],[1,1,2,1],[1,2,2,2],[1,3,1,5],[1,0,2,0]]}
[null,"Персональные данные"]
["№","Ф.И.О","Дата рождения","Паспортные данные",null,null,"Дата выдачи","Место регистрации","Место проживания","Телефон"]
[null,null,null,"серия","номер","кем выдан"]
[1,1]

{"sheet":"Движение","index":2,"n_rows":500,"n_cols":8,"rows_kept":500,"cut":false,"hidden":false,"merged":[[6,7,7,7],[5,0,5,6],[6,0,7,0],[6,1,7,1],[6,2,7,2],[6,3,7,3],[6,4,7,4],[6,6,7,6]]}
[]
[]
[]
[]
[]
["Движение"]
["№ ","Дата     выдачи","Срок    выдачи","Дата возврата","№ ТСР","Выдано","Ф.И.О","Наименование"]
[null,null,null,null,null,"Возврат"]
[1]
[null,null,null,null,null,null,null,{"$f":"IFERROR(INDEX(#REF!,MATCH(E10,#REF!,)),\"\")","v":""}]
[null,null,null,null,null,null,null,{"$f":"IFERROR(INDEX(#REF!,MATCH(E11,#REF!,)),\"\")","v":""}]
[null,null,null,null,null,null,null,{"$f":"IFERROR(INDEX(#REF!,MATCH(E12,#REF!,)),\"\")","v":""}]
[null,null,null,null,null,null,null,{"$f":"IFERROR(INDEX(#REF!,MATCH(E13,#REF!,)),\"\")","v":""}]
[null,null,null,null,null,null,null,{"$f":"IFERROR(INDEX(#REF!,MATCH(E14,#REF!,)),\"\")","v":""}]
[null,null,null,null,null,null,null,{"$f":"IFERROR(INDEX(#REF!,MATCH(E15,#REF!,)),\"\")","v":""}]
[null,null,null,null,null,null,null,{"$f":"IFERROR(INDEX(#REF!,MATCH(E16,#REF!,)),\"\")","v":""}]
[null,null,null,null,null,null,null,{"$f":"IFERROR(INDEX(#REF!,MATCH(E17,#REF!,)),\"\")","v":""}]
[null,null,null,null,null,null,null,{"$f":"IFERROR(INDEX(#REF!,MATCH(E18,#REF!,)),\"\")","v":""}]
[null,null,null,null,null,null,null,{"$f":"IFERROR(INDEX(#REF!,MATCH(E19,#REF!,)),\"\")","v":""}]
[null,null,null,null,null,null,null,{"$f":"IFERROR(INDEX(#REF!,MATCH(E20,#REF!,)),\"\")","v":""}]
[null,null,null,null,null,null,null,{"$f":"IFERROR(INDEX(#REF!,MATCH(E21,#REF!,)),\"\")","v":""}]
[null,null,null,null,null,null,null,{"$f":"IFERROR(INDEX(#REF!,MATCH(E22,#REF!,)),\"\")","v":""}]
[null,null,null,null,null,null,null,{"$f":"IFERROR(INDEX(#REF!,MATCH(E23,#REF!,)),\"\")","v":""}]
[null,null,null,null,null,null,null,{"$f":"IFERROR(INDEX(#REF!,MATCH(E24,#REF!,)),\"\")","v":""}]
[null,null,null,null,null,null,null,{"$f":"IFERROR(INDEX(#REF!,MATCH(E25,#REF!,)),\"\")","v":""}]
[null,null,null,null,null,null,null,{"$f":"IFERROR(INDEX(#REF!,MATCH(E26,#REF!,)),\"\")","v":""}]
[null,null,null,null,null,null,null,{"$f":"IFERROR(INDEX(#REF!,MATCH(E27,#REF!,)),\"\")","v":""}]
[null,null,null,null,null,null,null,{"$f":"IFERROR(INDEX(#REF!,MATCH(E28,#REF!,)),\"\")","v":""}]
[null,null,null,null,null,null,null,{"$f":"IFERROR(INDEX(#REF!,MATCH(E29,#REF!,)),\"\")","v":""}]
[null,null,null,null,null,null,null,{"$f":"IFERROR(INDEX(#REF!,MATCH(E30,#REF!,)),\"\")","v":""}]
[null,null,null,null,null,null,null,{"$f":"IFERROR(INDEX(#REF!,MATCH(E31,#REF!,)),\"\")","v":""}]
[null,null,null,null,null,null,null,{"$f":"IFERROR(INDEX(#REF!,MATCH(E32,#REF!,)),\"\")","v":""}]
[null,null,null,null,null,null,null,{"$f":"IFERROR(INDEX(#REF!,MATCH(E33,#REF!,)),\"\")","v":""}]
[null,null,null,null,null,null,null,{"$f":"IFERROR(INDEX(#REF!,MATCH(E34,#REF!,)),\"\")","v":""}]
[null,null,null,null,null,null,null,{"$f":"IFERROR(INDEX(#REF!,MATCH(E35,#REF!,)),\"\")","v":""}]
[null,null,null,null,null,null,null,{"$f":"IFERROR(INDEX(#REF!,MATCH(E36,#REF!,)),\"\")","v":""}]
[null,null,null,null,null,null,null,{"$f":"IFERROR(INDEX(#REF!,MATCH(E37,#REF!,)),\"\")","v":""}]
[null,null,null,null,null,null,null,{"$f":"IFERROR(INDEX(#REF!,MATCH(E38,#REF!,)),\"\")","v":""}]
[null,null,null,null,null,null,null,{"$f":"IFERROR(INDEX(#REF!,MATCH(E39,#REF!,)),\"\")","v":""}]
[null,null,null,null,null,null,null,{"$f":"IFERROR(INDEX(#REF!,MATCH(E40,#REF!,)),\"\")","v":""}]
[null,null,null,null,null,null,null,{"$f":"IFERROR(INDEX(#REF!,MATCH(E41,#REF!,)),\"\")","v":""}]
[null,null,null,null,null,null,null,{"$f":"IFERROR(INDEX(#REF!,MATCH(E42,#REF!,)),\"\")","v":""}]
[null,null,null,null,null,null,null,{"$f":"IFERROR(INDEX(#REF!,MATCH(E43,#REF!,)),\"\")","v":""}]
[null,null,null,null,null,null,null,{"$f":"IFERROR(INDEX(#REF!,MATCH(E44,#REF!,)),\"\")","v":""}]
[null,null,null,null,null,null,null,{"$f":"IFERROR(INDEX(#REF!,MATCH(E45,#REF!,)),\"\")","v":""}]
[null,null,null,null,null,null,null,{"$f":"IFERROR(INDEX(#REF!,MATCH(E46,#REF!,)),\"\")","v":""}]
[null,null,null,null,null,null,null,{"$f":"IFERROR(INDEX(#REF!,MATCH(E47,#REF!,)),\"\")","v":""}]
[null,null,null,null,null,null,null,{"$f":"IFERROR(INDEX(#REF!,MATCH(E48,#REF!,)),\"\")","v":""}]
[null,null,null,null,null,null,null,{"$f":"IFERROR(INDEX(#REF!,MATCH(E49,#REF!,)),\"\")","v":""}]
[null,null,null,null,null,null,null,{"$f":"IFERROR(INDEX(#REF!,MATCH(E50,#REF!,)),\"\")","v":""}]
[null,null,null,null,null,null,null,{"$f":"IFERROR(INDEX(#REF!,MATCH(E51,#REF!,)),\"\")","v":""}]
[null,null,null,null,null,null,null,{"$f":"IFERROR(INDEX(#REF!,MATCH(E52,#REF!,)),\"\")","v":""}]
[null,null,null,null,null,null,null,{"$f":"IFERROR(INDEX(#REF!,MATCH(E53,#REF!,)),\"\")","v":""}]
[null,null,null,null,null,null,null,{"$f":"IFERROR(INDEX(#REF!,MATCH(E54,#REF!,)),\"\")","v":""}]
[null,null,null,null,null,null,null,{"$f":"IFERROR(INDEX(#REF!,MATCH(E55,#REF!,)),\"\")","v":""}]
[null,null,null,null,null,null,null,{"$f":"IFERROR(INDEX(#REF!,MATCH(E56,#REF!,)),\"\")","v":""}]
[null,null,null,null,null,null,null,{"$f":"IFERROR(INDEX(#REF!,MATCH(E57,#REF!,)),\"\")","v":""}]
[null,null,null,null,null,null,null,{"$f":"IFERROR(INDEX(#REF!,MATCH(E58,#REF!,)),\"\")","v":""}]
[null,null,null,null,null,null,null,{"$f":"IFERROR(INDEX(#REF!,MATCH(E59,#REF!,)),\"\")","v":""}]
[null,null,null,null,null,null,null,{"$f":"IFERROR(INDEX(#REF!,MATCH(E60,#REF!,)),\"\")","v":""}]
[null,null,null,null,null,null,null,{"$f":"IFERROR(INDEX(#REF!,MATCH(E61,#REF!,)),\"\")","v":""}]
[null,null,null,null,null,null,null,{"$f":"IFERROR(INDEX(#REF!,MATCH(E62,#REF!,)),\"\")","v":""}]
[null,null,null,null,null,null,null,{"$f":"IFERROR(INDEX(#REF!,MATCH(E63,#REF!,)),\"\")","v":""}]
[null,null,null,null,null,null,null,{"$f":"IFERROR(INDEX(#REF!,MATCH(E64,#REF!,)),\"\")","v":""}]
[null,null,null,null,null,null,null,{"$f":"IFERROR(INDEX(#REF!,MATCH(E65,#REF!,)),\"\")","v":""}]
[null,null,null,null,null,null,null,{"$f":"IFERROR(INDEX(#REF!,MATCH(E66,#REF!,)),\"\")","v":""}]
[null,null,null,null,null,null,null,{"$f":"IFERROR(INDEX(#REF!,MATCH(E67,#REF!,)),\"\")","v":""}]
[null,null,null,null,null,null,null,{"$f":"IFERROR(INDEX(#REF!,MATCH(E68,#REF!,)),\"\")","v":""}]
[null,null,null,null,null,null,null,{"$f":"IFERROR(INDEX(#REF!,MATCH(E69,#REF!,)),\"\")","v":""}]
[null,null,null,null,null,null,null,{"$f":"IFERROR(INDEX(#REF!,MATCH(E70,#REF!,)),\"\")","v":""}]
[null,null,null,null,null,null,null,{"$f":"IFERROR(INDEX(#REF!,MATCH(E71,#REF!,)),\"\")","v":""}]
[null,null,null,null,null,null,null,{"$f":"IFERROR(INDEX(#REF!,MATCH(E72,#REF!,)),\"\")","v":""}]
[null,null,null,null,null,null,null,{"$f":"IFERROR(INDEX(#REF!,MATCH(E73,#REF!,)),\"\")","v":""}]
[null,null,null,null,null,null,null,{"$f":"IFERROR(INDEX(#REF!,MATCH(E74,#REF!,)),\"\")","v":""}]
[null,null,null,null,null,null,null,{"$f":"IFERROR(INDEX(#REF!,MATCH(E75,#REF!,)),\"\")","v":""}]
[null,null,null,null,null,null,null,{"$f":"IFERROR(INDEX(#REF!,MATCH(E76,#REF!,)),\"\")","v":""}]
[null,null,null,null,null,null,null,{"$f":"IFERROR(INDEX(#REF!,MATCH(E77,#REF!,)),\"\")","v":""}]
[null,null,null,null,null,null,null,{"$f":"IFERROR(INDEX(#REF!,MATCH(E78,#REF!,)),\"\")","v":""}]
[null,null,null,null,null,null,null,{"$f":"IFERROR(INDEX(#REF!,MATCH(E79,#REF!,)),\"\")","v":""}]
[null,null,null,null,null,null,null,{"$f":"IFERROR(INDEX(#REF!,MATCH(E80,#REF!,)),\"\")","v":""}]
[null,null,null,null,null,null,null,{"$f":"IFERROR(INDEX(#REF!,MATCH(E81,#REF!,)),\"\")","v":""}]
[null,null,null,null,null,null,null,{"$f":"IFERROR(INDEX(#REF!,MATCH(E82,#REF!,)),\"\")","v":""}]
[null,null,null,null,null,null,null,{"$f":"IFERROR(INDEX(#REF!,MATCH(E83,#REF!,)),\"\")","v":""}]
[null,null,null,null,null,null,null,{"$f":"IFERROR(INDEX(#REF!,MATCH(E84,#REF!,)),\"\")","v":""}]
[null,null,null,null,null,null,null,{"$f":"IFERROR(INDEX(#REF!,MATCH(E85,#REF!,)),\"\")","v":""}]
[null,null,null,null,null,null,null,{"$f":"IFERROR(INDEX(#REF!,MATCH(E86,#REF!,)),\"\")","v":""}]
[null,null,null,null,null,null,null,{"$f":"IFERROR(INDEX(#REF!,MATCH(E87,#REF!,)),\"\")","v":""}]
[null,null,null,null,null,null,null,{"$f":"IFERROR(INDEX(#REF!,MATCH(E88,#REF!,)),\"\")","v":""}]
[null,null,null,null,null,null,null,{"$f":"IFERROR(INDEX(#REF!,MATCH(E89,#REF!,)),\"\")","v":""}]
[null,null,null,null,null,null,null,{"$f":"IFERROR(INDEX(#REF!,MATCH(E90,#REF!,)),\"\")","v":""}]
[null,null,null,null,null,null,null,{"$f":"IFERROR(INDEX(#REF!,MATCH(E91,#REF!,)),\"\")","v":""}]
[null,null,null,null,null,null,null,{"$f":"IFERROR(INDEX(#REF!,MATCH(E92,#REF!,)),\"\")","v":""}]
[null,null,null,null,null,null,null,{"$f":"IFERROR(INDEX(#REF!,MATCH(E93,#REF!,)),\"\")","v":""}]
[null,null,null,null,null,null,null,{"$f":"IFERROR(INDEX(#REF!,MATCH(E94,#REF!,)),\"\")","v":""}]
[null,null,null,null,null,null,null,{"$f":"IFERROR(INDEX(#REF!,MATCH(E95,#REF!,)),\"\")","v":""}]
[null,null,null,null,null,null,null,{"$f":"IFERROR(INDEX(#REF!,MATCH(E96,#REF!,)),\"\")","v":""}]
[null,null,null,null,null,null,null,{"$f":"IFERROR(INDEX(#REF!,MATCH(E97,#REF!,)),\"\")","v":""}]
[null,null,null,null,null,null,null,{"$f":"IFERROR(INDEX(#REF!,MATCH(E98,#REF!,)),\"\")","v":""}]
[null,null,null,null,null,null,null,{"$f":"IFERROR(INDEX(#REF!,MATCH(E99,#REF!,)),\"\")","v":""}]
[null,null,null,null,null,null,null,{"$f":"IFERROR(INDEX(#REF!,MATCH(E100,#REF!,)),\"\")","v":""}]
[null,null,null,null,null,null,null,{"$f":"IFERROR(INDEX(#REF!,MATCH(E101,#REF!,)),\"\")","v":""}]
[null,null,null,null,null,null,null,{"$f":"IFERROR(INDEX(#REF!,MATCH(E102,#REF!,)),\"\")","v":""}]
[null,null,null,null,null,null,null,{"$f":"IFERROR(INDEX(#REF!,MATCH(E103,#REF!,)),\"\")","v":""}]
[null,null,null,null,null,null,null,{"$f":"IFERROR(INDEX(#REF!,MATCH(E104,#REF!,)),\"\")","v":""}]
[null,null,null,null,null,null,null,{"$f":"IFERROR(INDEX(#REF!,MATCH(E105,#REF!,)),\"\")","v":""}]
[null,null,null,null,null,null,null,{"$f":"IFERROR(INDEX(#REF!,MATCH(E106,#REF!,)),\"\")","v":""}]
[null,null,null,null,null,null,null,{"$f":"IFERROR(INDEX(#REF!,MATCH(E107,#REF!,)),\"\")","v":""}]
[null,null,null,null,null,null,null,{"$f":"IFERROR(INDEX(#REF!,MATCH(E108,#REF!,)),\"\")","v":""}]
[null,null,null,null,null,null,null,{"$f":"IFERROR(INDEX(#REF!,MATCH(E109,#REF!,)),\"\")","v":""}]
[null,null,null,null,null,null,null,{"$f":"IFERROR(INDEX(#REF!,MATCH(E110,#REF!,)),\"\")","v":""}]
[null,null,null,null,null,null,null,{"$f":"IFERROR(INDEX(#REF!,MATCH(E111,#REF!,)),\"\")","v":""}]
[null,null,null,null,null,null,null,{"$f":"IFERROR(INDEX(#REF!,MATCH(E112,#REF!,)),\"\")","v":""}]
[null,null,null,null,null,null,null,{"$f":"IFERROR(INDEX(#REF!,MATCH(E113,#REF!,)),\"\")","v":""}]
[null,null,null,null,null,null,null,{"$f":"IFERROR(INDEX(#REF!,MATCH(E114,#REF!,)),\"\")","v":""}]
[null,null,null,null,null,null,null,{"$f":"IFERROR(INDEX(#REF!,MATCH(E115,#REF!,)),\"\")","v":""}]
[null,null,null,null,null,null,null,{"$f":"IFERROR(INDEX(#REF!,MATCH(E116,#REF!,)),\"\")","v":""}]
[null,null,null,null,null,null,null,{"$f":"IFERROR(INDEX(#REF!,MATCH(E117,#REF!,)),\"\")","v":""}]
[null,null,null,null,null,null,null,{"$f":"IFERROR(INDEX(#REF!,MATCH(E118,#REF!,)),\"\")","v":""}]
[null,null,null,null,null,null,null,{"$f":"IFERROR(INDEX(#REF!,MATCH(E119,#REF!,)),\"\")","v":""}]
[null,null,null,null,null,null,null,{"$f":"IFERROR(INDEX(#REF!,MATCH(E120,#REF!,)),\"\")","v":""}]
[null,null,null,null,null,null,null,{"$f":"IFERROR(INDEX(#REF!,MATCH(E121,#REF!,)),\"\")","v":""}]
[null,null,null,null,null,null,null,{"$f":"IFERROR(INDEX(#REF!,MATCH(E122,#REF!,)),\"\")","v":""}]
[null,null,null,null,null,null,null,{"$f":"IFERROR(INDEX(#REF!,MATCH(E123,#REF!,)),\"\")","v":""}]
[null,null,null,null,null,null,null,{"$f":"IFERROR(INDEX(#REF!,MATCH(E124,#REF!,)),\"\")","v":""}]
[null,null,null,null,null,null,null,{"$f":"IFERROR(INDEX(#REF!,MATCH(E125,#REF!,)),\"\")","v":""}]
[null,null,null,null,null,null,null,{"$f":"IFERROR(INDEX(#REF!,MATCH(E126,#REF!,)),\"\")","v":""}]
[null,null,null,null,null,null,null,{"$f":"IFERROR(INDEX(#REF!,MATCH(E127,#REF!,)),\"\")","v":""}]
[null,null,null,null,null,null,null,{"$f":"IFERROR(INDEX(#REF!,MATCH(E128,#REF!,)),\"\")","v":""}]
[null,null,null,null,null,null,null,{"$f":"IFERROR(INDEX(#REF!,MATCH(E129,#REF!,)),\"\")","v":""}]
[null,null,null,null,null,null,null,{"$f":"IFERROR(INDEX(#REF!,MATCH(E130,#REF!,)),\"\")","v":""}]
[null,null,null,null,null,null,null,{"$f":"IFERROR(INDEX(#REF!,MATCH(E131,#REF!,)),\"\")","v":""}]
[null,null,null,null,null,null,null,{"$f":"IFERROR(INDEX(#REF!,MATCH(E132,#REF!,)),\"\")","v":""}]
[null,null,null,null,null,null,null,{"$f":"IFERROR(INDEX(#REF!,MATCH(E133,#REF!,)),\"\")","v":""}]
[null,null,null,null,null,null,null,{"$f":"IFERROR(INDEX(#REF!,MATCH(E134,#REF!,)),\"\")","v":""}]
[null,null,null,null,null,null,null,{"$f":"IFERROR(INDEX(#REF!,MATCH(E135,#REF!,)),\"\")","v":""}]
[null,null,null,null,null,null,null,{"$f":"IFERROR(INDEX(#REF!,MATCH(E136,#REF!,)),\"\")","v":""}]
[null,null,null,null,null,null,null,{"$f":"IFERROR(INDEX(#REF!,MATCH(E137,#REF!,)),\"\")","v":""}]
[null,null,null,null,null,null,null,{"$f":"IFERROR(INDEX(#REF!,MATCH(E138,#REF!,)),\"\")","v":""}]
[null,null,null,null,null,null,null,{"$f":"IFERROR(INDEX(#REF!,MATCH(E139,#REF!,)),\"\")","v":""}]
[null,null,null,null,null,null,null,{"$f":"IFERROR(INDEX(#REF!,MATCH(E140,#REF!,)),\"\")","v":""}]
[null,null,null,null,null,null,null,{"$f":"IFERROR(INDEX(#REF!,MATCH(E141,#REF!,)),\"\")","v":""}]
[null,null,null,null,null,null,null,{"$f":"IFERROR(INDEX(#REF!,MATCH(E142,#REF!,)),\"\")","v":""}]
[null,null,null,null,null,null,null,{"$f":"IFERROR(INDEX(#REF!,MATCH(E143,#REF!,)),\"\")","v":""}]
[null,null,null,null,null,null,null,{"$f":"IFERROR(INDEX(#REF!,MATCH(E144,#REF!,)),\"\")","v":""}]
[null,null,null,null,null,null,null,{"$f":"IFERROR(INDEX(#REF!,MATCH(E145,#REF!,)),\"\")","v":""}]
[null,null,null,null,null,null,null,{"$f":"IFERROR(INDEX(#REF!,MATCH(E146,#REF!,)),\"\")","v":""}]
[null,null,null,null,null,null,null,{"$f":"IFERROR(INDEX(#REF!,MATCH(E147,#REF!,)),\"\")","v":""}]
[null,null,null,null,null,null,null,{"$f":"IFERROR(INDEX(#REF!,MATCH(E148,#REF!,)),\"\")","v":""}]
[null,null,null,null,null,null,null,{"$f":"IFERROR(INDEX(#REF!,MATCH(E149,#REF!,)),\"\")","v":""}]
[null,null,null,null,null,null,null,{"$f":"IFERROR(INDEX(#REF!,MATCH(E150,#REF!,)),\"\")","v":""}]
[null,null,null,null,null,null,null,{"$f":"IFERROR(INDEX(#REF!,MATCH(E151,#REF!,)),\"\")","v":""}]
[null,null,null,null,null,null,null,{"$f":"IFERROR(INDEX(#REF!,MATCH(E152,#REF!,)),\"\")","v":""}]
[null,null,null,null,null,null,null,{"$f":"IFERROR(INDEX(#REF!,MATCH(E153,#REF!,)),\"\")","v":""}]
[null,null,null,null,null,null,null,{"$f":"IFERROR(INDEX(#REF!,MATCH(E154,#REF!,)),\"\")","v":""}]
[null,null,null,null,null,null,null,{"$f":"IFERROR(INDEX(#REF!,MATCH(E155,#REF!,)),\"\")","v":""}]
[null,null,null,null,null,null,null,{"$f":"IFERROR(INDEX(#REF!,MATCH(E156,#REF!,)),\"\")","v":""}]
[null,null,null,null,null,null,null,{"$f":"IFERROR(INDEX(#REF!,MATCH(E157,#REF!,)),\"\")","v":""}]
[null,null,null,null,null,null,null,{"$f":"IFERROR(INDEX(#REF!,MATCH(E158,#REF!,)),\"\")","v":""}]
[null,null,null,null,null,null,null,{"$f":"IFERROR(INDEX(#REF!,MATCH(E159,#REF!,)),\"\")","v":""}]
[null,null,null,null,null,null,null,{"$f":"IFERROR(INDEX(#REF!,MATCH(E160,#REF!,)),\"\")","v":""}]
[null,null,null,null,null,null,null,{"$f":"IFERROR(INDEX(#REF!,MATCH(E161,#REF!,)),\"\")","v":""}]
[null,null,null,null,null,null,null,{"$f":"IFERROR(INDEX(#REF!,MATCH(E162,#REF!,)),\"\")","v":""}]
[null,null,null,null,null,null,null,{"$f":"IFERROR(INDEX(#REF!,MATCH(E163,#REF!,)),\"\")","v":""}]
[null,null,null,null,null,null,null,{"$f":"IFERROR(INDEX(#REF!,MATCH(E164,#REF!,)),\"\")","v":""}]
[null,null,null,null,null,null,null,{"$f":"IFERROR(INDEX(#REF!,MATCH(E165,#REF!,)),\"\")","v":""}]
[null,null,null,null,null,null,null,{"$f":"IFERROR(INDEX(#REF!,MATCH(E166,#REF!,)),\"\")","v":""}]
[null,null,null,null,null,null,null,{"$f":"IFERROR(INDEX(#REF!,MATCH(E167,#REF!,)),\"\")","v":""}]
[null,null,null,null,null,null,null,{"$f":"IFERROR(INDEX(#REF!,MATCH(E168,#REF!,)),\"\")","v":""}]
[null,null,null,null,null,null,null,{"$f":"IFERROR(INDEX(#REF!,MATCH(E169,#REF!,)),\"\")","v":""}]
[null,null,null,null,null,null,null,{"$f":"IFERROR(INDEX(#REF!,MATCH(E170,#REF!,)),\"\")","v":""}]
[null,null,null,null,null,null,null,{"$f":"IFERROR(INDEX(#REF!,MATCH(E171,#REF!,)),\"\")","v":""}]
[null,null,null,null,null,null,null,{"$f":"IFERROR(INDEX(#REF!,MATCH(E172,#REF!,)),\"\")","v":""}]
[null,null,null,null,null,null,null,{"$f":"IFERROR(INDEX(#REF!,MATCH(E173,#REF!,)),\"\")","v":""}]
[null,null,null,null,null,null,null,{"$f":"IFERROR(INDEX(#REF!,MATCH(E174,#REF!,)),\"\")","v":""}]
[null,null,null,null,null,null,null,{"$f":"IFERROR(INDEX(#REF!,MATCH(E175,#REF!,)),\"\")","v":""}]
[null,null,null,null,null,null,null,{"$f":"IFERROR(INDEX(#REF!,MATCH(E176,#REF!,)),\"\")","v":""}]
[null,null,null,null,null,null,null,{"$f":"IFERROR(INDEX(#REF!,MATCH(E177,#REF!,)),\"\")","v":""}]
[null,null,null,null,null,null,null,{"$f":"IFERROR(INDEX(#REF!,MATCH(E178,#REF!,)),\"\")","v":""}]
[null,null,null,null,null,null,null,{"$f":"IFERROR(INDEX(#REF!,MATCH(E179,#REF!,)),\"\")","v":""}]
[null,null,null,null,null,null,null,{"$f":"IFERROR(INDEX(#REF!,MATCH(E180,#REF!,)),\"\")","v":""}]
[null,null,null,null,null,null,null,{"$f":"IFERROR(INDEX(#REF!,MATCH(E181,#REF!,)),\"\")","v":""}]
[null,null,null,null,null,null,null,{"$f":"IFERROR(INDEX(#REF!,MATCH(E182,#REF!,)),\"\")","v":""}]
[null,null,null,null,null,null,null,{"$f":"IFERROR(INDEX(#REF!,MATCH(E183,#REF!,)),\"\")","v":""}]
[null,null,null,null,null,null,null,{"$f":"IFERROR(INDEX(#REF!,MATCH(E184,#REF!,)),\"\")","v":""}]
[null,null,null,null,null,null,null,{"$f":"IFERROR(INDEX(#REF!,MATCH(E185,#REF!,)),\"\")","v":""}]
[null,null,null,null,null,null,null,{"$f":"IFERROR(INDEX(#REF!,MATCH(E186,#REF!,)),\"\")","v":""}]
[null,null,null,null,null,null,null,{"$f":"IFERROR(INDEX(#REF!,MATCH(E187,#REF!,)),\"\")","v":""}]
[null,null,null,null,null,null,null,{"$f":"IFERROR(INDEX(#REF!,MATCH(E188,#REF!,)),\"\")","v":""}]
[null,null,null,null,null,null,null,{"$f":"IFERROR(INDEX(#REF!,MATCH(E189,#REF!,)),\"\")","v":""}]
[null,null,null,null,null,null,null,{"$f":"IFERROR(INDEX(#REF!,MATCH(E190,#REF!,)),\"\")","v":""}]
[null,null,null,null,null,null,null,{"$f":"IFERROR(INDEX(#REF!,MATCH(E191,#REF!,)),\"\")","v":""}]
[null,null,null,null,null,null,null,{"$f":"IFERROR(INDEX(#REF!,MATCH(E192,#REF!,)),\"\")","v":""}]
[null,null,null,null,null,null,null,{"$f":"IFERROR(INDEX(#REF!,MATCH(E193,#REF!,)),\"\")","v":""}]
[null,null,null,null,null,null,null,{"$f":"IFERROR(INDEX(#REF!,MATCH(E194,#REF!,)),\"\")","v":""}]
[null,null,null,null,null,null,null,{"$f":"IFERROR(INDEX(#REF!,MATCH(E195,#REF!,)),\"\")","v":""}]
[null,null,null,null,null,null,null,{"$f":"IFERROR(INDEX(#REF!,MATCH(E196,#REF!,)),\"\")","v":""}]
[null,null,null,null,null,null,null,{"$f":"IFERROR(INDEX(#REF!,MATCH(E197,#REF!,)),\"\")","v":""}]
[null,null,null,null,null,null,null,{"$f":"IFERROR(INDEX(#REF!,MATCH(E198,#REF!,)),\"\")","v":""}]
[null,null,null,null,null,null,null,{"$f":"IFERROR(INDEX(#REF!,MATCH(E199,#REF!,)),\"\")","v":""}]
[null,null,null,null,null,null,null,{"$f":"IFERROR(INDEX(#REF!,MATCH(E200,#REF!,)),\"\")","v":""}]
{"$rows_left_out":300}