{"text_format":"1","workbook":"xlsx","n_sheets":2,"sheets":["в акт","акт"],"not_rendered":{"charts":0,"images":0,"macros":1,"external_links":0,"defined_names":0,"comments":0,"pivot_tables":0},"unopened":[],"bounds":{"document_bytes":16777216,"sheet_cells":100000,"rows_first":2000,"rows_last":500,"rows_between":2000,"halvings":0,"cell_chars":16384,"cell_head_chars":4096},"cells_cut":0,"cells_raw":0,"read":"whole","date_system":"1900"}

{"sheet":"в акт","index":0,"n_rows":7,"n_cols":11,"rows_kept":7,"cut":false,"hidden":false,"merged":[]}
[1,2,3,4,5,6,7,8,9,10,11]
["№","СП","должность","таб","ФИО","наименов СИЗ","дата ввода","срок продл","% износа","сцеп таб"]
[1,"ЖС Алши  ","ДЖС",24368,"Королева Н.Ю.","КОМПЛЕКТ ЛТИП А ","2021-04-26",12,15,{"$f":"CONCATENATE(\"таб\",\" \",D3)","v":"таб 24368"},12]
[2,"ЖС Арзя  ","ДЖС",24370,"Нурисламова З.Ф.","ЖИЛЕТ ","2021-10-29",6,20,{"$f":"CONCATENATE(\"таб\",\" \",D4)","v":"таб 24370"},6]
[3,"ЖС Арзя  ","НЖС",24438,"Тюкалова НН.С.","ЖИЛЕТ ","2020-04-30",6,25,{"$f":"CONCATENATE(\"таб\",\" \",D5)","v":"таб 24438"},24]
[4,"ЖС Арзь  ","ДЖС",24370,"Чуракова С.Н.","ЖИЛЕТ  ОС 58000000675 889976534","2021-04-26",6,20,{"$f":"CONCATENATE(\"таб\",\" \",D6)","v":"таб 24370"},12]
[4,"ЖС Арзь  ","ДЖС",24370,"Чуракова С.Н.","КОМПЛЕКТ ЛТИП А  ОС 5800000256 883347236","2021-04-26",12,15,{"$f":"CONCATENATE(\"таб\",\" \",D7)","v":"таб 24370"},12]

{"sheet":"акт","index":1,"n_rows":34,"n_cols":8,"rows_kept":34,"cut":false,"hidden":false,"merged":[[24,1,24,5],[24,6,24,7],[25,1,25,5],[25,6,25,7],[28,0,30,0],[28,1,30,1],[28,2,30,2],[28,3,28,4],[28,6,28,7],[29,3,29,4],[29,7,30,7],[14,2,14,4],[18,1,18,5],[18,6,18,7],[19,1,19,5],[19,6,19,7],[20,0,23,0],[20,1,20,5],[20,6,20,7],[21,1,21,5],[21,6,21,7],[22,1,22,5],[22,6,22,7],[23,1,23,5],[23,6,23,7],[13,2,13,6],[5,2,5,6],[7,3,7,7],[8,3,8,7],[11,2,11,6],[12,2,12,6]]}
[]
[]
[]
[null,null,"А К Т","№",4,"от","2022-04-28"]
[null,"освидетельствования средств индивидуальной защиты (СИЗ), сданных работником"]
[null,{"$f":"IF(E4=\"\",\"\",VLOOKUP(E4,'в акт'!A3:I8,5,FALSE))","v":"Чуракова С.Н."},{"$f":"IF(E4=\"\",\"\",VLOOKUP(E4,'в акт'!A3:I8,3,FALSE))","v":"ДЖС"},null,null,null,null,{"$f":"IF(E4=\"\",\"\",VLOOKUP(E4,'в акт'!A3:J8,10,FALSE))","v":"таб 24370"}]
[]
[1,"Структурное подразделение ",null,{"$f":"IF(E4=\"\",\"\",VLOOKUP(E4,'в акт'!A3:I8,2,FALSE))","v":"ЖС Арзь  "}]
[2,"Место составления акта : "]
[3,"Комиссия в составе:"]
[null,"председатель "]
[null,"члены Комиссии "]
[]
[]
[]
[]
[]
[4,"Результат наружного осмотра:"]
["№","Оцениваемая характеристика",null,null,null,null,"Результат оценки"]
[1]
[2]
[]
[]
[]
[3]
[4]
[]
[5,"Заключение Комиссии:"]
["№","Наименование СИЗ","Дата выдачи","Срок носки",null,"%","Заключение Комиссии"]
[null,null,null,"(месяц)",null,"износа","подлежит списанию;","Примечание"]
[null,null,null,"по нормам","факти-ческий",null,"срок носки продлен на ____ мес."]
[null,{"$f":"IFERROR(INDEX('в акт'!A:K,IFERROR(SMALL(IF(ROW('в акт'!E:E)*(B6&H6='в акт'!E:E&'в акт'!J:J)=0,\"\",ROW('в акт'!E:E)*(B6&H6='в акт'!E:E&'в акт'!J:J)),ROW(1:3)),\"\"),{6,7,11,11,9,8}),\"\")","v":"ЖИЛЕТ  ОС 58000000675 889976534"},"2021-04-26",12,12,20,6]
[null,"КОМПЛЕКТ ЛТИП А  ОС 5800000256 883347236","2021-04-26",12,12,15,12]
[null,"","","","","",""]