{"text_format":"1","workbook":"xlsx","n_sheets":3,"sheets":["Ведомость дефектов 1","Шаблон","Сальдо"],"not_rendered":{"charts":0,"images":2,"macros":1,"external_links":0,"defined_names":1,"comments":0,"pivot_tables":0},"unopened":[],"bounds":{"document_bytes":16777216,"sheet_cells":100000,"rows_first":2000,"rows_last":500,"rows_between":2000,"halvings":0,"cell_chars":16384,"cell_head_chars":4096},"cells_cut":0,"cells_raw":0,"read":"whole","date_system":"1900"}

{"sheet":"Ведомость дефектов 1","index":0,"n_rows":31,"n_cols":8,"rows_kept":31,"cut":false,"hidden":false,"merged":[[4,4,4,6],[0,1,0,2],[0,4,0,6],[1,4,1,6],[2,4,2,6],[3,4,3,6],[15,1,15,3],[5,1,5,5],[6,1,6,5],[7,1,7,5],[8,1,8,5],[9,4,10,4],[9,5,10,6],[10,1,10,3],[11,1,11,3],[11,5,11,6],[13,5,13,6],[14,1,14,3],[14,5,14,6],[20,0,20,2],[21,0,21,1],[21,4,21,5],[22,0,22,2],[23,0,23,1],[23,4,23,5],[29,4,29,5],[30,4,30,5],[24,0,24,1],[24,2,24,3],[25,4,25,5],[26,4,26,5],[27,4,27,5],[28,4,28,5]]}
[null,null,null,null,"УТВЕРЖДАЮ "]
[]
[]
[]
[]
[null,"Управление связи "]
[null,"( наименование филиала, на чьем балансе числятся основные средства, подлежащие ремонту )"]
[]
[null,"( наименование филиала - исполнителя ремонтных работ )"]
[null,null,null,null,"Номер документа","Дата составления"]
[null,"ВЕДОМОСТЬ ДЕФЕКТОВ И РАБОТ"]
[null,null,null,null,"6",{"$f":"$E$5","v":"00:00:00"}]
[]
[null,null,null,null,null,"Инвентарный  номер"]
[null,"Радиостанция носимая PW802 C(GP680)",null,null,null,{"$f":"VLOOKUP($B$15,Сальдо!B2:C96,2,A$1)","v":"350010001350"},{"$f":"VLOOKUP(#REF!,#REF!,2,E$1)","v":{"$error":"#REF!"}}]
[null,"наименование объекта основных средств"]
["№  п/п","Обнаруженные    дефекты","Наименование ремонтных работ","Наименование деталей, намеченых к замене","Количество","Ед. изм.","Примечание"]
[1,2,3,4,5,6,7]
[{"$f":"ROW()-18","v":1},"Потеря электрической емкости аккумуляторной батареи","Замена в связи с неисправностью","Батарея аккум.АТ 9008 д/радиостанц.",1,"ШТ"]
[]
["Председатель комиссии:"]
[null,null,{"$f":"VLOOKUP(E22,Сальдо!$F$2:$G$30,2,A$1)","v":{"$error":"#N/A"}},null,null,null,null,{"$f":"VLOOKUP(E22,Сальдо!$F$2:$H$30,3,A$1)","v":{"$error":"#N/A"}}]
["Заместитель председателя комиссии:"]
[null,null,{"$f":"VLOOKUP(E24,Сальдо!$F$2:$G$30,2,A$1)","v":{"$error":"#N/A"}},null,null,null,null,{"$f":"VLOOKUP(E24,Сальдо!$F$2:$H$30,3,A$1)","v":{"$error":"#N/A"}}]
["Члены комиссии:"]
[null,null,{"$f":"VLOOKUP(E26,Сальдо!$F$2:$G$30,2,A$1)","v":{"$error":"#N/A"}},null,null,null,null,{"$f":"VLOOKUP(E26,Сальдо!$F$2:$H$30,3,A$1)","v":{"$error":"#N/A"}}]
[null,null,{"$f":"VLOOKUP(E27,Сальдо!$F$2:$G$30,2,A$1)","v":{"$error":"#N/A"}},null,null,null,null,{"$f":"VLOOKUP(E27,Сальдо!$F$2:$H$30,3,A$1)","v":{"$error":"#N/A"}}]
[null,null,{"$f":"VLOOKUP(E28,Сальдо!$F$2:$G$30,2,A$1)","v":{"$error":"#N/A"}},null,null,null,null,{"$f":"VLOOKUP(E28,Сальдо!$F$2:$H$30,3,A$1)","v":{"$error":"#N/A"}}]
[null,null,{"$f":"VLOOKUP(E29,Сальдо!$F$2:$G$30,2,A$1)","v":{"$error":"#N/A"}},null,null,null,null,{"$f":"VLOOKUP(E29,Сальдо!$F$2:$H$30,3,A$1)","v":{"$error":"#N/A"}}]
[null,null,{"$f":"VLOOKUP(E30,Сальдо!$F$2:$G$30,2,A$1)","v":{"$error":"#N/A"}},null,null,null,null,{"$f":"VLOOKUP(E30,Сальдо!$F$2:$H$30,3,A$1)","v":{"$error":"#N/A"}}]
[null,null,{"$f":"VLOOKUP(E31,Сальдо!$F$2:$G$30,2,A$1)","v":{"$error":"#N/A"}},null,null,null,null,{"$f":"VLOOKUP(E31,Сальдо!$F$2:$H$30,3,A$1)","v":{"$error":"#N/A"}}]

{"sheet":"Шаблон","index":1,"n_rows":32,"n_cols":2,"rows_kept":32,"cut":false,"hidden":false,"merged":[]}
["Закладка","Текст закладки"]
["Акт обследования "]
["Должность"]
["ФамИО"]
["ДАТА1"]
["ДАТА2"]
["Приказ"]
["ФИОпред"]
["ФИОзам"]
["ФИОчлком"]
["ОС",{"$f":"INDIRECT(\"'Ведомость дефектов \"&COLUMN(A$1)&\"'!$B$15\")","v":"Радиостанция носимая PW802 C(GP680)"}]
["Инвномер",{"$f":"INDIRECT(\"'Ведомость дефектов \"&COLUMN(A$1)&\"'!$F$15\")","v":"350010001350"}]
["ОбъектОС",{"$f":"INDIRECT(\"'Ведомость дефектов \"&COLUMN(A$1)&\"'!$D$19\")","v":"Батарея аккум.АТ 9008 д/радиостанц."}]
["ОписаниеОС",{"$f":"VLOOKUP($B$12,Сальдо!$C$2:$D$96,2,$Q$58)","v":"Портативная р/станция Motorola GP-680, рабочий диапазон частот 300-350МГц, макс.вых.мощность 4Вт, напряжение питания 7,5 В, кол-во конвенциональных каналов 16. В комплектацию входит: антенна, аккумуляторная батарея, зарядное устройство, крепление на пояс."}]
["ХАРАКТ","При тестировании радиостанции выявлена низкая емкость АБ (остаточная емкость аккумуляторной батареи менее 30%)"]
["ВЫВОДЫ","Восстановление и дальнейшее использование АБ нецелесообразно, так как суммарная стоимость ремонта и замены элементов питания  выше стоимости объекта. Комиссия считает, что  данная АБ не пригодна к дальнейшей эксплуатации. Принято решение о проведении текущего ремонта объекта основных средств путем замены аккумуляторной батареи"]
["Долж1"]
["ФИО1"]
["Долж2"]
["ФИО2"]
["Долж3"]
["ФИО3"]
["Долж4"]
["ФИО4"]
["Долж5"]
["ФИО5"]
["Долж6"]
["ФИО6"]
["Долж7"]
["ФИО7"]
["Долж8"]
["ФИО8"]

{"sheet":"Сальдо","index":2,"n_rows":87,"n_cols":6,"rows_kept":87,"cut":false,"hidden":false,"merged":[]}
[null,"Название","Инв №","Краткая характеристика",null," Motorola GP140, 240, 280, 320, 328, 329, 338, 339, 340, 360, 380, 540, 580, 640, 680"]
[null,"Motorola GP-340  2ExicIIBT3X Конфигурация 2  11","350010002358","Портативная радиостанция Motorola GP-340 для использования в потенциально опасных зонах. Взрывозащищённое исполнение по классу 2ExicIIBT3X (1-5Вт). В составе: приемопередатчик, крепление на пояс H1N9714, антенна портативная РМАА4023, аккумулятор NiMH FM HNN4002 IMPRESS, одноместное настольное зарядное устройство IMPRESS PMLN5188A, шумоподавляющий микрофон с кнопокой PTT MDRMN4019.Диапазон 136-174 МГц, количество каналов 16, мощность передачи 1-4 Вт."]
[null,"Motorola GP-340  2ExicIIBT3X Конфигурация 2  12","350010002359","Портативная радиостанция Motorola GP-340 для использования в потенциально опасных зонах. Взрывозащищённое исполнение по классу 2ExicIIBT3X (1-5Вт). В составе: приемопередатчик, крепление на пояс H1N9714, антенна портативная РМАА4023, аккумулятор NiMH FM HNN4002 IMPRESS, одноместное настольное зарядное устройство IMPRESS PMLN5188A, шумоподавляющий микрофон с кнопокой PTT MDRMN4019.Диапазон 136-174 МГц, количество каналов 16, мощность передачи 1-4 Вт."]
[null,"Motorola GP-340  2ExicIIBT3X Конфигурация 2  13","350010002360","Портативная радиостанция Motorola GP-340 для использования в потенциально опасных зонах. Взрывозащищённое исполнение по классу 2ExicIIBT3X (1-5Вт). В составе: приемопередатчик, крепление на пояс H1N9714, антенна портативная РМАА4023, аккумулятор NiMH FM HNN4002 IMPRESS, одноместное настольное зарядное устройство IMPRESS PMLN5188A, шумоподавляющий микрофон с кнопокой PTT MDRMN4019.Диапазон 136-174 МГц, количество каналов 16, мощность передачи 1-4 Вт."]
[null,"Motorola GP-340  2ExicIIBT3X Конфигурация 2  14","350010002361","Портативная радиостанция Motorola GP-340 для использования в потенциально опасных зонах. Взрывозащищённое исполнение по классу 2ExicIIBT3X (1-5Вт). В составе: приемопередатчик, крепление на пояс H1N9714, антенна портативная РМАА4023, аккумулятор NiMH FM HNN4002 IMPRESS, одноместное настольное зарядное устройство IMPRESS PMLN5188A, шумоподавляющий микрофон с кнопокой PTT MDRMN4019.Диапазон 136-174 МГц, количество каналов 16, мощность передачи 1-4 Вт."]
[null,"Базовая радиостанция Айком IC-VR 8050","350000106200","Стационарная базовая станция. Полоса частот 150-174 Мгц. Номинальная мошность 50 Вт. Режим работы - дуплекс.Состав: Базовый приёмо -передающий блок, Антенна штыревая, антенный фидер"]
[null,"Базовая радиостанция Айком IC-VR8050","350000106180","Стационарная базовая станция. Полоса частот 150-174 Мгц. Номинальная мошность 50 Вт. Режим работы - дуплекс.Состав: Базовый приёмо -передающий блок, Антенна штыревая, антенный фидер"]
[null,"Базовая радиостанция Айком IC-VR8050","350000106210","Стационарная базовая станция. Полоса частот 150-174 Мгц. Номинальная мошность 50 Вт. Режим работы - дуплекс.Состав: Базовый приёмо -передающий блок, Антенна штыревая, антенный фидер"]
[null,"Базовая радиостанция Айком IC-VR8050","350000106220","Стационарная базовая станция. Полоса частот 150-174 Мгц. Номинальная мошность 50 Вт. Режим работы - дуплекс.Состав: Базовый приёмо -передающий блок, Антенна штыревая, антенный фидер"]
[null,"Базовая радиостанция Айком IC-VR8050","350000106230","Стационарная базовая станция. Полоса частот 150-174 Мгц. Номинальная мощность 50 Вт. Режим работы - дуплекс. Состав: базовый приёмо - передающий блок, антенна штыревая, антенный фидер, конвертер напряжения PS-66."]
[null,"Радиостанции мобильные FMP-3R-330","350000109200","Стационарная радиостанция. Диапазон частот 300-350Мгц. Состав: Антенныйфидер, антенна, переговорная консоль, громкоговоритель."]
[null,"Радиостанции мобильные FMP-3R-330","350000109290","Транкинговая стационарная р/ст,раб.диапаз.частот 300-306,336-342МГц. В комплекте внешний микрофон, антенна, антенный кабель, кабел ь питания."]
[null,"Радиостанции мобильные VMP-3R-330","350000101900","Мобильная радиостанция VMP-3R-330, рабочий диапазон частот 300-350 МГц ,максимальная мощность 10 Вт, напряжение питания 12 В, режи м работы - полудуплекс. В комплектации: антенна, скоба крепление р/с, тангента, крепёж для тангенты, выносной громкоговоритель, шн ур питания."]
[null,"Радиостанции мобильные VMP-3R-330","350000102020","Мобильная радиостанция VMP-3R-330, рабочий диапазон частот 300-350 МГц ,максимальная мощность 10 Вт, напряжение питания 12 В, режи м работы - полудуплекс. В комплектации: антенна, скоба крепление р/с, тангента, крепёж для тангенты, выносной громкоговоритель, шн ур питания."]
[null,"Радиостанции мобильные VMP-3R-330","350000102150","Мобильная радиостанция VMP-3R-330, рабочий диапазон частот 300-350 МГц ,максимальная мощность 10 Вт, напряжение питания 12 В, режи м работы - полудуплекс. В комплектации: антенна, скоба крепление р/с, тангента, крепёж для тангенты, выносной громкоговоритель, шн ур питания."]
[null,"Радиостанции мобильные VMP-3R-330","350000102160","Мобильная радиостанция VMP-3R-330, рабочий диапазон частот 300-350 МГц ,максимальная мощность 10 Вт, напряжение питания 12 В, режи м работы - полудуплекс. В комплектации: антенна, скоба крепление р/с, тангента, крепёж для тангенты, выносной громкоговоритель, шн ур питания."]
[null,"Радиостанции мобильные VMP-3R-330","350000103090","Мобильная радиостанция VMP-3R-330, рабочий диапазон частот 300-350 МГц ,максимальная мощность 10 Вт, напряжение питания 12 В, режи м работы - полудуплекс. В комплектации: антенна, скоба крепление р/с, тангента, крепёж для тангенты, выносной громкоговоритель, шн ур питания."]
[null,"Радиостанции мобильные VMP-3R-330","350000103100","Мобильная радиостанция VMP-3R-330, рабочий диапазон частот 300-350 МГц ,максимальная мощность 10 Вт, напряжение питания 12 В, режи м работы - полудуплекс. В комплектации: антенна, скоба крепление р/с, тангента, крепёж для тангенты, выносной громкоговоритель, шн ур питания."]
[null,"Радиостанции мобильные VMP-3R-330","350000103110","Мобильная радиостанция VMP-3R-330, рабочий диапазон частот 300-350 МГц ,максимальная мощность 10 Вт, напряжение питания 12 В, режи м работы - полудуплекс. В комплектации: антенна, скоба крепление р/с, тангента, крепёж для тангенты, выносной громкоговоритель, шн ур питания."]
[null,"Радиостанции мобильные VMP-3R-330","350000103120","Мобильная радиостанция VMP-3R-330, рабочий диапазон частот 300-350 МГц ,максимальная мощность 10 Вт, напряжение питания 12 В, режи м работы - полудуплекс. В комплектации: антенна, скоба крепление р/с, тангента, крепёж для тангенты, выносной громкоговоритель, шн ур питания."]
[null,"Радиостанции мобильные VMP-3R-330","350000103130","Мобильная радиостанция VMP-3R-330, рабочий диапазон частот 300-350 МГц ,максимальная мощность 10 Вт, напряжение питания 12 В, режи м работы - полудуплекс. В комплектации: антенна, скоба крепление р/с, тангента, крепёж для тангенты, выносной громкоговоритель, шн ур питания."]
[null,"Радиостанции мобильные VMP-3R-330","350000103140","Мобильная радиостанция VMP-3R-330, рабочий диапазон частот 300-350 МГц ,максимальная мощность 10 Вт, напряжение питания 12 В, режи м работы - полудуплекс. В комплектации: антенна, скоба крепление р/с, тангента, крепёж для тангенты, выносной громкоговоритель, шн ур питания."]
[null,"Радиостанции мобильные VMP-3R-330","350000103150","Мобильная радиостанция VMP-3R-330, рабочий диапазон частот 300-350 МГц ,максимальная мощность 10 Вт, напряжение питания 12 В, режи м работы - полудуплекс. В комплектации: антенна, скоба крепление р/с, тангента, крепёж для тангенты, выносной громкоговоритель, шн ур питания."]
[null,"Радиостанции мобильные VMP-3R-330","350000103170","Мобильная радиостанция VMP-3R-330, рабочий диапазон частот 300-350 МГц ,максимальная мощность 10 Вт, напряжение питания 12 В, режи м работы - полудуплекс. В комплектации: антенна, скоба крепление р/с, тангента, крепёж для тангенты, выносной громкоговоритель, шн ур питания."]
[null,"Радиостанции мобильные VMP-3R-330","350000103180","Мобильная радиостанция VMP-3R-330, рабочий диапазон частот 300-350 МГц ,максимальная мощность 10 Вт, напряжение питания 12 В, режи м работы - полудуплекс. В комплектации: антенна, скоба крепление р/с, тангента, крепёж для тангенты, выносной громкоговоритель, шн ур питания."]
[null,"Радиостанции мобильные VMP-3R-330","350000103190","Мобильная радиостанция VMP-3R-330, рабочий диапазон частот 300-350 МГц ,максимальная мощность 10 Вт, напряжение питания 12 В, режи м работы - полудуплекс. В комплектации: антенна, скоба крепление р/с, тангента, крепёж для тангенты, выносной громкоговоритель, шн ур питания."]
[null,"Радиостанции мобильные VMP-3R-330","350000103200","Мобильная радиостанция VMP-3R-330, рабочий диапазон частот 300-350 МГц ,максимальная мощность 10 Вт, напряжение питания 12 В, режи м работы - полудуплекс. В комплектации: антенна, скоба крепление р/с, тангента, крепёж для тангенты, выносной громкоговоритель, шн ур питания."]
[null,"Радиостанции мобильные VMP-3R-330","350000103210","Мобильная радиостанция VMP-3R-330, рабочий диапазон частот 300-350 МГц ,максимальная мощность 10 Вт, напряжение питания 12 В, режи м работы - полудуплекс. В комплектации: антенна, скоба крепление р/с, тангента, крепёж для тангенты, выносной громкоговоритель, шн ур питания."]
[null,"Радиостанции мобильные VMP-3R-330","350000103220","Мобильная радиостанция VMP-3R-330, рабочий диапазон частот 300-350 МГц ,максимальная мощность 10 Вт, напряжение питания 12 В, режи м работы - полудуплекс. В комплектации: антенна, скоба крепление р/с, тангента, крепёж для тангенты, выносной громкоговоритель, шн ур питания."]
[null,"Радиостанции мобильные VMP-3R-330","350000103240","Мобильная радиостанция VMP-3R-330, рабочий диапазон частот 300-350 МГц ,максимальная мощность 10 Вт, напряжение питания 12 В, режи м работы - полудуплекс. В комплектации: антенна, скоба крепление р/с, тангента, крепёж для тангенты, выносной громкоговоритель, шн ур питания."]
[null,"Радиостанции мобильные VMP-3R-330","350000103260","Мобильная радиостанция VMP-3R-330, рабочий диапазон частот 300-350 МГц ,максимальная мощность 10 Вт, напряжение питания 12 В, режи м работы - полудуплекс. В комплектации: антенна, скоба крепление р/с, тангента, крепёж для тангенты, выносной громкоговоритель, шн ур питания."]
[null,"Радиостанции мобильные VMP-3R-330","350000103390","Мобильная радиостанция VMP-3R-330, рабочий диапазон частот 300-350 МГц ,максимальная мощность 10 Вт, напряжение питания 12 В, режи м работы - полудуплекс. В комплектации: антенна, скоба крепление р/с, тангента, крепёж для тангенты, выносной громкоговоритель, шн ур питания."]
[null,"Радиостанции мобильные VMP-3R-330","350000108120","Мобильная радиостанция VMP-3R-330, рабочий диапазон частот 300-350 МГц ,максимальная мощность 10 Вт, напряжение питания 12 В, режи м работы - полудуплекс. В комплектации: антенна, скоба крепление р/с, тангента, крепёж для тангенты, выносной громкоговоритель, шн ур питания."]
[null,"Радиостанции мобильные VMP-3R-330","350000108130","Мобильная радиостанция VMP-3R-330, рабочий диапазон частот 300-350 МГц ,максимальная мощность 10 Вт, напряжение питания 12 В, режи м работы - полудуплекс. В комплектации: антенна, скоба крепление р/с, тангента, крепёж для тангенты, выносной громкоговоритель, шн ур питания."]
[null,"Радиостанции мобильные VMP-3R-330","350000108140","Мобильная радиостанция VMP-3R-330, рабочий диапазон частот 300-350 МГц ,максимальная мощность 10 Вт, напряжение питания 12 В, режи м работы - полудуплекс. В комплектации: антенна, скоба крепление р/с, тангента, крепёж для тангенты, выносной громкоговоритель, шн ур питания."]
[null,"Радиостанции мобильные VMP-3R-330","350000108150","Мобильная радиостанция VMP-3R-330, рабочий диапазон частот 300-350 МГц ,максимальная мощность 10 Вт, напряжение питания 12 В, режи м работы - полудуплекс. В комплектации: антенна, скоба крепление р/с, тангента, крепёж для тангенты, выносной громкоговоритель, шн ур питания."]
[null,"Радиостанции мобильные VMP-3R-330","350000108580","Мобильная радиостанция VMP-3R-330, рабочий диапазон частот 300-350 МГц ,максимальная мощность 10 Вт, напряжение питания 12 В, режи м работы - полудуплекс. В комплектации: антенна, скоба крепление р/с, тангента, крепёж для тангенты, выносной громкоговоритель, шн ур питания."]
[null,"Радиостанции стационарные FMP-3R-330","350000103450","Радиостанция, рабочий диапазон частот 300-306, 336-342МГц; максимальнаямощность 10 Вт, режим работы - симплекс.В составе: стационарная радиостанция, фидер, антенна направленная, тангента, блок питания"]
[null,"Радиостанции стационарные FMP-3R-330","350000103550","Стационарная радиостанция. Диапазон частот 300-350Мгц. Состав: Антенныйфидер, антенна, переговорная консоль, громкоговоритель."]
[null,"Радиостанции стационарные FMP-3R-330","350000103680","Стационарная радиостанция. Диапазон частот 300-350Мгц. Состав: Антенныйфидер, антенна, переговорная консоль, громкоговоритель."]
[null,"Радиостанции стационарные FMP-3R-330","350000103690","Стационарная радиостанция. Диапазон частот 300-350Мгц. Состав: Антенныйфидер, антенна, переговорная консоль, громкоговоритель."]
[null,"Радиостанции стационарные FMP-3R-330","350000103700","Стационарная радиостанция. Диапазон частот 300-350Мгц. Состав: Антенныйфидер, антенна, переговорная консоль, громкоговоритель."]
[null,"Радиостанции стационарные FMP-3R-330","350000103710","Стационарная радиостанция. Диапазон частот 300-350Мгц. Состав: Антенныйфидер, антенна, переговорная консоль, громкоговоритель."]
[null,"Радиостанции стационарные FMP-3R-330","350000103720","Стационарная радиостанция. Диапазон частот 300-350Мгц. Состав: Антенныйфидер, антенна, переговорная консоль, громкоговоритель."]
[null,"Радиостанции стационарные FMP-3R-330","350000103730","Стационарная радиостанция. Диапазон частот 300-350Мгц. Состав: Антенныйфидер, антенна, переговорная консоль, громкоговоритель."]
[null,"Радиостанции стационарные FMP-3R-330","350000103740","Стационарная радиостанция. Диапазон частот 300-350Мгц. Состав: Антенныйфидер, антенна, переговорная консоль, громкоговоритель."]
[null,"Радиостанции стационарные FMP-3R-330","350000107340","Радиостанция, рабочий диапазон частот 300-306, 336-342МГц; максимальнаямощность 10 Вт, режим работы - симплекс.В составе: стационарная радиостанция, фидер, антенна направленная, тангента, блок питания"]
[null,"Радиостанция CP180 MOTOROLA 146-174 MHZ","350010000387","Портативная радиостанция CP180 MOTOROLA. Диапазон частот 146-174 Мгц. Состав: радиостанция, антенна NAD6502A, аккумулятор NNTN48 51 NiMH, 1400mAh. Одноместное зарядное устройство."]
[null,"Радиостанция CP180 MOTOROLA 146-174 MHZ","350010000388","Портативная радиостанция CP180 MOTOROLA. Диапазон частот 146-174 Мгц. Состав: радиостанция, антенна NAD6502A, аккумулятор NNTN48 51 NiMH, 1400mAh. Одноместное зарядное устройство."]
[null,"Радиостанция CP180 MOTOROLA 146-174 MHZ","350010000389","Портативная радиостанция CP180 MOTOROLA. Диапазон частот 146-174 Мгц. Состав: радиостанция, антенна NAD6502A, аккумулятор NNTN48 51 NiMH, 1400mAh. Одноместное зарядное устройство."]
[null,"Радиостанция CP180 MOTOROLA 146-174 MHZ","350010000390","Портативная радиостанция CP180 MOTOROLA. Диапазон частот 146-174 Мгц. Состав: радиостанция, антенна NAD6502A, аккумулятор NNTN48 51 NiMH, 1400mAh. Одноместное зарядное устройство."]
[null,"Радиостанция CP180 MOTOROLA 146-174 MHZ","350010000391","Портативная радиостанция CP180 MOTOROLA. Диапазон частот 146-174 Мгц. Состав: радиостанция, антенна NAD6502A, аккумулятор NNTN48 51 NiMH, 1400mAh. Одноместное зарядное устройство."]
[null,"Радиостанция GM 360 VHF c антенной авт.AW-6","350000231010","Радиостанция мобильная. Диапазон частот 146-174 Мгц. Состав: Антенный фидер, антенна, переговорная консоль, громкоговоритель."]
[null,"Радиостанция GM 360 VHF c антенной авт.AW-6","350000231020","Радиостанция мобильная. Диапазон частот 146-174 Мгц. Состав: Антенный фидер, антенна, переговорная консоль, громкоговоритель."]
[null,"Радиостанция GM 360 VHF c антенной авт.AW-6","350000231030","Радиостанция мобильная. Диапазон частот 146-174 Мгц. Состав: Антенный фидер, антенна, переговорная консоль, громкоговоритель."]
[null,"Радиостанция возимая GM 360 (MW304FC)","350010001598","Радиостанция мобильная GM360. Диапазон частот 146-174 Мгц. Состав: Антенна на магнитной основе ANLIWH-14M, фидер, переговорная кон соль, громкоговоритель."]
[null,"Радиостанция возимая GM 360 (MW304FC)","350010001599","Радиостанция мобильная GM360. Диапазон частот 146-174 Мгц. Состав: Антенна на магнитной основе ANLIWH-14M, фидер, переговорная кон соль, громкоговоритель."]
[null,"Радиостанция возимая GM 360 (MW304FC)","350010001600","Радиостанция мобильная GM360. Диапазон частот 146-174 Мгц. Состав: Антенна на магнитной основе ANLIWH-14M, фидер, переговорная кон соль, громкоговоритель."]
[null,"Радиостанция возимая GM 360 (MW304FC)","350010001601","Радиостанция мобильная GM360. Диапазон частот 146-174 Мгц. Состав: Антенна на магнитной основе ANLIWH-14M, фидер, переговорная кон соль, громкоговоритель."]
[null,"Радиостанция носимая PW802 C(GP680)","350010001350","Портативная р/станция Motorola GP-680, рабочий диапазон частот 300-350МГц, макс.вых.мощность 4Вт, напряжение питания 7,5 В, кол-во конвенциональных каналов 16. В комплектацию входит: антенна, аккумуляторная батарея, зарядное устройство, крепление на пояс."]
{"$rows_left_out":27}