{"text_format":"1","workbook":"xlsx","n_sheets":5,"sheets":["Список","Перечень ТМЦ уч. св.№5","Сальдо","Нормы","Лист1"],"not_rendered":{"charts":0,"images":0,"macros":1,"external_links":1,"defined_names":0,"comments":0,"pivot_tables":0},"unopened":[],"bounds":{"document_bytes":16777216,"sheet_cells":100000,"rows_first":2000,"rows_last":500,"rows_between":2000,"halvings":0,"cell_chars":16384,"cell_head_chars":4096},"cells_cut":0,"cells_raw":0,"read":"whole","date_system":"1900"}

{"sheet":"Список","index":0,"n_rows":21,"n_cols":2,"rows_kept":21,"cut":false,"hidden":false,"merged":[]}
[null,"Список"]
["a","Перечень ТМЦ уч. св.№5"]
[null,"Сальдо"]
["a","Эталон"]
["a","Перечень"]
["a","Нормы"]
["a","Ведомость 1"]
["a","Ведомость 2"]
[null,"Ведомость 3"]
[null,"Ведомость 4"]
[null,"Ведомость 5"]
[null,"Ведомость 6"]
[null,"Ведомость 7"]
[null,"Ведомость 8"]
[null,"Ведомость 9"]
[null,"Ведомость 10"]
[null,"Ведомость 11"]
[null,"Ведомость 12"]
[null,"Ведомость 13"]
[null,"Ведомость 14"]
[null,"Ведомость 15"]

{"sheet":"Перечень ТМЦ уч. св.№5","index":1,"n_rows":20,"n_cols":12,"rows_kept":20,"cut":false,"hidden":false,"merged":[[5,10,6,10],[0,10,0,11],[1,0,1,3],[1,4,1,5],[1,10,1,11],[4,0,4,11]]}
[null,null,null,null,null,null,null,null,null,null,"Приложение 1"]
["Перечень ТМЦ, подлежащих списанию по участку  за",null,null,null,{"$f":"TODAY()","v":"2022-06-19"}]
[]
["Номенкла-турный №","Наименование ТМЦ","Партия","Счет Главной книги","МВП","№ заказа","№ документа","Ед. изм","Запас на конец периода","Стоимость запаса на конец периода","Причина списания ","Требуемые документы "]
["Участок связи № 5 (скл. К006)"]
[{"$f":"VLOOKUP(B6,CHOOSE({1,2},Сальдо!$B$3:$B$23,Сальдо!$A$3:$A$23),2,0)","v":"LOC100874474"},"Маска мед.Sense Professional однораз.N50",{"$f":"VLOOKUP(B6,Сальдо!$B$3:$K$23,2,$A$1)","v":"PN01360522"},{"$f":"VLOOKUP(B6,Сальдо!$B$3:$K$23,3,$A$1)","v":"1010100000"},null,null,null,{"$f":"VLOOKUP(B6,Сальдо!$B$3:$K$23,4,$A$1)","v":"ШТ"},{"$f":"VLOOKUP(B6,Сальдо!$B$3:$K$23,9,$A$1)","v":100},{"$f":"IFERROR(VLOOKUP(B6,Сальдо!$B$3:$K$23,10,$A$1), \" \")","v":290},"Использовано для предупреждения распространения коронавирусной инфекции COVID-19","Акт на списание ТМЦ"]
[{"$f":"VLOOKUP(B7,CHOOSE({1,2},Сальдо!$B$3:$B$23,Сальдо!$A$3:$A$23),2,0)","v":"LOC100859912"},"Средство дез.Армасепт гель 1000мл",{"$f":"VLOOKUP(B7,Сальдо!$B$3:$K$23,2,$A$1)","v":"PN01360134"},{"$f":"VLOOKUP(B7,Сальдо!$B$3:$K$23,3,$A$1)","v":"1010100000"},null,null,null,{"$f":"VLOOKUP(B7,Сальдо!$B$3:$K$23,4,$A$1)","v":"ШТ"},{"$f":"VLOOKUP(B7,Сальдо!$B$3:$K$23,9,$A$1)","v":2},{"$f":"IFERROR(VLOOKUP(B7,Сальдо!$B$3:$K$23,10,$A$1), \" \")","v":1497.74},null,"Ведомость МБ-7  Приложение 7.3.15"]
[{"$f":"VLOOKUP(B8,CHOOSE({1,2},Сальдо!$B$3:$B$23,Сальдо!$A$3:$A$23),2,0)","v":"LOC100787738"},"Мешок д/мусора Vclean 120л 10шт",{"$f":"VLOOKUP(B8,Сальдо!$B$3:$K$23,2,$A$1)","v":"PN01472758"},{"$f":"VLOOKUP(B8,Сальдо!$B$3:$K$23,3,$A$1)","v":"1010100000"},null,null,null,{"$f":"VLOOKUP(B8,Сальдо!$B$3:$K$23,4,$A$1)","v":"ШТ"},{"$f":"VLOOKUP(B8,Сальдо!$B$3:$K$23,9,$A$1)","v":2},{"$f":"IFERROR(VLOOKUP(B8,Сальдо!$B$3:$K$23,10,$A$1), \" \")","v":249},"Использовано в поцессе хозяйственной деятельности","Акт на списание ТМЦ"]
[{"$f":"VLOOKUP(B9,CHOOSE({1,2},Сальдо!$B$3:$B$23,Сальдо!$A$3:$A$23),2,0)","v":"LOC100790039"},"Средство Мистер Мускул д/мытья стек.",{"$f":"VLOOKUP(B9,Сальдо!$B$3:$K$23,2,$A$1)","v":"PN01467329"},{"$f":"VLOOKUP(B9,Сальдо!$B$3:$K$23,3,$A$1)","v":"1010100000"},null,null,null,{"$f":"VLOOKUP(B9,Сальдо!$B$3:$K$23,4,$A$1)","v":"Л"},{"$f":"VLOOKUP(B9,Сальдо!$B$3:$K$23,9,$A$1)","v":1},{"$f":"IFERROR(VLOOKUP(B9,Сальдо!$B$3:$K$23,10,$A$1), \" \")","v":471.79},"Использовано в поцессе хозяйственной деятельности","Акт на списание ТМЦ"]
[{"$f":"VLOOKUP(B10,CHOOSE({1,2},Сальдо!$B$3:$B$23,Сальдо!$A$3:$A$23),2,0)","v":"LOC100859912"},"Средство дез.Армасепт гель 1000мл",{"$f":"VLOOKUP(B10,Сальдо!$B$3:$K$23,2,$A$1)","v":"PN01360134"},{"$f":"VLOOKUP(B10,Сальдо!$B$3:$K$23,3,$A$1)","v":"1010100000"},null,null,null,{"$f":"VLOOKUP(B10,Сальдо!$B$3:$K$23,4,$A$1)","v":"ШТ"},{"$f":"VLOOKUP(B10,Сальдо!$B$3:$K$23,9,$A$1)","v":2},{"$f":"IFERROR(VLOOKUP(B10,Сальдо!$B$3:$K$23,10,$A$1), \" \")","v":1497.74},"Использовано в поцессе хозяйственной деятельности","Акт на списание ТМЦ"]
[{"$f":"VLOOKUP(B11,CHOOSE({1,2},Сальдо!$B$3:$B$23,Сальдо!$A$3:$A$23),2,0)","v":"LOC100874474"},"Маска мед.Sense Professional однораз.N50",{"$f":"VLOOKUP(B11,Сальдо!$B$3:$K$23,2,$A$1)","v":"PN01360522"},{"$f":"VLOOKUP(B11,Сальдо!$B$3:$K$23,3,$A$1)","v":"1010100000"},null,null,null,{"$f":"VLOOKUP(B11,Сальдо!$B$3:$K$23,4,$A$1)","v":"ШТ"},{"$f":"VLOOKUP(B11,Сальдо!$B$3:$K$23,9,$A$1)","v":100},{"$f":"IFERROR(VLOOKUP(B11,Сальдо!$B$3:$K$23,10,$A$1), \" \")","v":290},"Использовано в поцессе хозяйственной деятельности","Акт на списание ТМЦ"]
[{"$f":"VLOOKUP(B12,CHOOSE({1,2},Сальдо!$B$3:$B$23,Сальдо!$A$3:$A$23),2,0)","v":"LOC100955515"},"Порошок стир.Dosia Optima Альп.св.",{"$f":"VLOOKUP(B12,Сальдо!$B$3:$K$23,2,$A$1)","v":"PN01445930"},{"$f":"VLOOKUP(B12,Сальдо!$B$3:$K$23,3,$A$1)","v":"1010100000"},null,null,null,{"$f":"VLOOKUP(B12,Сальдо!$B$3:$K$23,4,$A$1)","v":"КГ"},{"$f":"VLOOKUP(B12,Сальдо!$B$3:$K$23,9,$A$1)","v":0},{"$f":"IFERROR(VLOOKUP(B12,Сальдо!$B$3:$K$23,10,$A$1), \" \")","v":0},"Смывающие и обезвреживающие средства","Ведомость выдачи"]
[{"$f":"VLOOKUP(B13,CHOOSE({1,2},Сальдо!$B$3:$B$23,Сальдо!$A$3:$A$23),2,0)","v":"LOC100961034"},"Мыло Ординарное Антибактериальное 100г",{"$f":"VLOOKUP(B13,Сальдо!$B$3:$K$23,2,$A$1)","v":"PN01474488"},{"$f":"VLOOKUP(B13,Сальдо!$B$3:$K$23,3,$A$1)","v":"1010100000"},null,null,null,{"$f":"VLOOKUP(B13,Сальдо!$B$3:$K$23,4,$A$1)","v":"КГ"},{"$f":"VLOOKUP(B13,Сальдо!$B$3:$K$23,9,$A$1)","v":1},{"$f":"IFERROR(VLOOKUP(B13,Сальдо!$B$3:$K$23,10,$A$1), \" \")","v":495.85},"Замена аккумуляторных батарей. Цифровая радиорелейная линия  Квадралинк  Уренгой- Cургут (с ОРС-1 по ПРС-15; ПРС-21/5) Инв.№ 071312","Ведомость дефектов"]
[{"$f":"VLOOKUP(B14,CHOOSE({1,2},Сальдо!$B$3:$B$23,Сальдо!$A$3:$A$23),2,0)","v":"LOC100713147"},"Батарея аккум.Штарк АГН 12-7",{"$f":"VLOOKUP(B14,Сальдо!$B$3:$K$23,2,$A$1)","v":"PN01505859"},{"$f":"VLOOKUP(B14,Сальдо!$B$3:$K$23,3,$A$1)","v":"1050000000"},null,null,null,{"$f":"VLOOKUP(B14,Сальдо!$B$3:$K$23,4,$A$1)","v":"ШТ"},{"$f":"VLOOKUP(B14,Сальдо!$B$3:$K$23,9,$A$1)","v":3},{"$f":"IFERROR(VLOOKUP(B14,Сальдо!$B$3:$K$23,10,$A$1), \" \")","v":12035.91},"Ввод в эксплуатацию","АКТ на принятие к забалансовому учет"]
[null,null,null,null,null,null,null,null,null," "]
[{"$f":"VLOOKUP(B16,CHOOSE({1,2},Сальдо!$B$24:$B$242,Сальдо!$A$24:$A$242),2,0)","v":"LOC100646231"},"Вкладыши п/шум.3М 1110 беруши (пара)",{"$f":"VLOOKUP(B16,Сальдо!$B$24:$K$242,2,$A$1)","v":"EX01082380"},{"$f":"VLOOKUP(B16,Сальдо!$B$24:$K$242,3,$A$1)","v":"Z030200000"},null,null,null,{"$f":"VLOOKUP(B16,Сальдо!$B$24:$K$242,4,$A$1)","v":"ШТ"},{"$f":"VLOOKUP(B16,Сальдо!$B$24:$K$242,9,$A$1)","v":3},{"$f":"IFERROR(VLOOKUP(B16,Сальдо!$B$24:$K$244,10,$A$1), \" \")","v":100.94999999999999},"Использовано в процессе хозяйственной деятельности","Ведомость МБ-7  Приложение 7.3.15"]
[{"$f":"VLOOKUP(B17,CHOOSE({1,2},Сальдо!$B$24:$B$242,Сальдо!$A$24:$A$242),2,0)","v":"LOC100646231"},"Вкладыши п/шум.3М 1110 беруши (пара)",{"$f":"VLOOKUP(B17,Сальдо!$B$24:$K$242,2,$A$1)","v":"EX01082380"},{"$f":"VLOOKUP(B17,Сальдо!$B$24:$K$242,3,$A$1)","v":"Z030200000"},null,null,null,{"$f":"VLOOKUP(B17,Сальдо!$B$24:$K$242,4,$A$1)","v":"ШТ"},{"$f":"VLOOKUP(B17,Сальдо!$B$24:$K$242,9,$A$1)","v":3},{"$f":"IFERROR(VLOOKUP(B17,Сальдо!$B$24:$K$244,10,$A$1), \" \")","v":100.94999999999999},"При опробовании отсутствует индикация дисплея","Извещение и непригодности к применению № И00082022ШК"]
[{"$f":"VLOOKUP(B18,CHOOSE({1,2},Сальдо!$B$24:$B$242,Сальдо!$A$24:$A$242),2,0)","v":"LOC100646231"},"Вкладыши п/шум.3М 1110 беруши (пара)",{"$f":"VLOOKUP(B18,Сальдо!$B$24:$K$242,2,$A$1)","v":"EX01082380"},{"$f":"VLOOKUP(B18,Сальдо!$B$24:$K$242,3,$A$1)","v":"Z030200000"},null,null,null,{"$f":"VLOOKUP(B18,Сальдо!$B$24:$K$242,4,$A$1)","v":"ШТ"},{"$f":"VLOOKUP(B18,Сальдо!$B$24:$K$242,9,$A$1)","v":3},{"$f":"IFERROR(VLOOKUP(B18,Сальдо!$B$24:$K$244,10,$A$1), \" \")","v":100.94999999999999}]
[{"$f":"VLOOKUP(B19,CHOOSE({1,2},Сальдо!$B$24:$B$242,Сальдо!$A$24:$A$242),2,0)","v":"LOC100646231"},"Вкладыши п/шум.3М 1110 беруши (пара)",{"$f":"VLOOKUP(B19,Сальдо!$B$24:$K$242,2,$A$1)","v":"EX01082380"},{"$f":"VLOOKUP(B19,Сальдо!$B$24:$K$242,3,$A$1)","v":"Z030200000"},null,null,null,{"$f":"VLOOKUP(B19,Сальдо!$B$24:$K$242,4,$A$1)","v":"ШТ"},{"$f":"VLOOKUP(B19,Сальдо!$B$24:$K$242,9,$A$1)","v":3},{"$f":"IFERROR(VLOOKUP(B19,Сальдо!$B$24:$K$244,10,$A$1), \" \")","v":100.94999999999999}]
[null,null,null,null,null,null,null,null,"Итого",{"$f":"SUM(J6:J19)","v":17231.830000000002}]

{"sheet":"Сальдо","index":2,"n_rows":242,"n_cols":11,"rows_kept":242,"cut":false,"hidden":false,"merged":[[22,0,22,10]]}
["Материал","Наименование","Партия","Счет","Един. изм.","Кол-во","Стоимость","Цена 1 изд.","Дата ввода в экспл.","Кол-во списания","Стоимость"]
[1,2,3,4,5,6,7,8,9,10,11]
["LOC100787738","Мешок д/мусора Vclean 120л 10шт","PN01472758","1010100000","ШТ",3,373.51,124.5,"2022-02-28",2,{"$f":"J3*H3","v":249}]
["LOC100790039","Средство Мистер Мускул д/мытья стек.","PN01467329","1010100000","Л",3,1415.35,471.79,"2022-02-15",1,471.79]
["LOC100807111","Мешок д/мусора Vclean 30л 30шт","PN01472756","1010100000","ШТ",8,301.33999999999997,37.67,"2022-02-28",2,75.34]
["LOC100859912","Средство дез.Армасепт гель 1000мл","PN01360134","1010100000","ШТ",6,4493.2299999999996,748.87,"2021-10-14",2,1497.74]
["LOC100874474","Маска мед.Sense Professional однораз.N50","PN01360522","1010100000","ШТ",870,2524.33,2.9,"2021-10-11",100,290]
["LOC100955515","Порошок стир.Dosia Optima Альп.св.","PN01445930","1010100000","КГ",6,689.25,114.88,"2021-12-30",0,0]
["LOC100959708","Средство Cif Active Lemon чист.крем","PN01467706","1010100000","Л",2,746.25,373.12,"2022-02-17",1,373.12]
["LOC100961034","Мыло Ординарное Антибактериальное 100г","PN01474488","1010100000","КГ",7.8,3867.64,495.85,"2022-02-28",1,495.85]
["LOC100962448","Средство Бирюса Алоэ 500мл гель д/посуды","PN01489771","1010100000","Л",3,633.04,211.01,"2022-03-31",1,211.01]
["LOC100962449","Средство Бирюса Крас.апельсин 500мл гель","PN01489767","1010100000","Л",3,632.29,210.76,"2022-03-31",0,0]
["LOC100863514","Хомут DKC 25210 3,6х290мм полиамид белый","PN01298650","1010100000","ШТ",178,528.75,2.97,"2021-08-03",0,{"$f":"J13*H13","v":0}]
["LOC100963123","Хомут DKC 25310 3,6х290мм Р6.6 черный","PN01483512","1010100000","ШТ",180,532.44000000000005,2.96,"2022-03-23",0,0]
["LOC100428259","Лента из.ПВХ 15х0,20 черная в/с","PN01363183","1010100000","КГ",1,299.92,299.92,"2021-10-19",0,{"$f":"J15*H15","v":0}]
["LOC100423023","Канистра МТ-031 алюм.20л","PN00834948","1040000000","ШТ",1,1668.46,1668.46,"2019-07-31",0,0]
["LOC100713147","Батарея аккум.Штарк АГН 12-7","PN01505859","1050000000","ШТ",3,12035.89,4011.97,"2022-04-27",3,12035.91]
["LOC100795070","Грунт-эмаль СпецПротект 109У RAL 1021","PN01397631","1080000000","КГ",14.5,10359.049999999999,714.42,"2021-12-06",0,0]
["LOC100859913","Средство о/комар.Рефтамид максимум 200мл","PN01532702","1090100000","ШТ",5,954.62,190.92,null,5,954.59999999999991]
["LOC100428678","Лом медный (кабель)","TA00028766","4150200000","Т",0.01,80.47,8047,"2021-09-30",0,0]
["LOC100428678","Лом медный (кабель)","TA00032369","4150200000","Т",3.0000000000000001E-3,18.5,6166.67,"2021-10-29",0,0]
["LOC100428678","Лом медный (кабель)","TA00045171","4150200000","Т",3.0000000000000001E-3,10.68,3560,"2021-12-30",0,0]
["Забаланс"]
["LOC100414682","Анализатор W&W Manufactur* Analyzer Ia","EXR0527987","Z030200000","ШТ",1,37005.910000000003,37005.910000000003,"2017-12-31",0,{"$f":"J24*H24","v":0}]
["LOC100414915","Аппарат телеф.Siemens Euroset 5010","EXR0527988","Z030200000","ШТ",5,1775.25,355.05,"2017-12-31",0,0]
["LOC100414916","Аппарат телеф.Siemens Euroset 5015","EXR0527989","Z030200000","ШТ",5,3477.44,695.49,"2017-12-31",0,0]
["LOC100414937","Аппарат телеф.Telta-M214 (Телта-М214)","EXR0527990","Z030200000","ШТ",5,8675.5300000000007,1735.11,"2017-12-31",0,0]
["LOC100414937","Аппарат телеф.Telta-M214 (Телта-М214)","EXR0528666","Z030200000","ШТ",10,17351.05,1735.11,"2017-12-31",0,0]
["LOC100415519","Блок пит.Sirus PS-1215U","EXR0527991","Z030200000","ШТ",1,8323.58,8323.58,"2017-12-31",0,0]
["LOC100415755","Бокорезы КВТ 180мм д/раб.под напр.1000В","EXR0527992","Z030200000","ШТ",2,1047.22,523.61,"2017-12-31",0,0]
["LOC100415755","Бокорезы КВТ 180мм д/раб.под напр.1000В","EXR0527993","Z030200000","ШТ",2,376.77,188.39,"2017-12-31",0,0]
["LOC100416152","Боты диэлектрические 42","ZPN0029371","Z030200000","ПАР",1,326.02999999999997,326.02999999999997,"2022-05-16",0,0]
["LOC100416429","Бур SDS+5 6х50х115 Bosch","EXR0527994","Z030200000","ШТ",1,80,80,"2017-12-31",0,0]
["LOC100416525","Бур-сверло SDS+ 8х50х115 Bosch","EXR0527995","Z030200000","ШТ",1,104,104,"2017-12-31",0,0]
["LOC100417311","Веревка Vento Static 10 vnt 50010 100м","EX00862770","Z030200000","ШТ",1,12701.83,12701.83,"2018-12-03",0,0]
["LOC100417311","Веревка Vento Static 10 vnt 50010 100м","EX00866608","Z030200000","ШТ",1,12701.83,12701.83,"2018-12-03",0,0]
["LOC100417996","Вольтметр В7-53/1","EXR0527997","Z030200000","ШТ",1,206.42,206.42,"2017-12-31",1,206.42]
["LOC100418316","Газоанализатор Сигнал-4Э СО+СН4","EXR0527998","Z030200000","ШТ",1,12047.37,12047.37,"2017-12-31",0,0]
["LOC100420273","Жгут мед.кровоостан.резин.типа Эсмарха","EX01223410","Z030200000","ШТ",1,61.36,61.36,"2020-12-31",0,0]
["LOC100420356","Жилет сигнальный 44-46/2","ZSZ0004741","Z030200000","ШТ",1,400.18,400.18,"2017-12-31",0,0]
["LOC100420358","Жилет сигнальный 48-50/2","ZSZ0004742","Z030200000","ШТ",1,414.65,414.65,"2017-12-31",3,1243.9499999999998]
["LOC100420359","Жилет сигнальный 48-50/3","ZSZ0004743","Z030200000","ШТ",1,220.51,220.51,"2017-12-31",0,0]
["LOC100420372","Жилет сигнальный 52-54/2","ZSZ0004744","Z030200000","ШТ",1,414.64,414.64,"2017-12-31",1,414.64]
["LOC100422159","Индикатор ИНО-500 напряжения-отвертк","EXR0528001","Z030200000","ШТ",5,146.22,29.24,"2017-12-31",0,0]
["LOC100422159","Индикатор ИНО-500 напряжения-отвертк","EXR0528002","Z030200000","ШТ",1,15.07,15.07,"2017-12-31",0,0]
["LOC100422159","Индикатор ИНО-500 напряжения-отвертк","EXR0528003","Z030200000","ШТ",3,1568.07,522.69000000000005,"2017-12-31",0,0]
["LOC100422167","Индикатор напряж.ПИН90-2М","EXR0528004","Z030200000","ШТ",1,87.59,87.59,"2017-12-31",0,0]
["LOC100422167","Индикатор напряж.ПИН90-2М","EXR0528005","Z030200000","ШТ",1,87.58,87.58,"2017-12-31",0,0]
["LOC100422815","Календарь настен.арт.7569","EX01355818","Z030200000","ШТ",3,708,236,"2021-12-30",0,0]
["LOC100422816","Календарь настольный 21,0х30 фото","EX01355819","Z030200000","ШТ",3,504,168,"2021-12-30",0,0]
["LOC100423210","Каска СОМЗ-55 Favorit Визион 78217 белая","ZSZ0004746","Z030200000","ШТ",3,471.5,157.16999999999999,"2017-12-31",0,0]
["LOC100423482","Кисть Fit 01310 N18 (60мм) круглая","EX01004849","Z030200000","ШТ",2,227.86,113.93,"2019-08-30",0,0]
["LOC100423557","Кисть КФ50 флейцевая","EXR0528007","Z030200000","ШТ",3,138,46,"2017-12-31",0,0]
["LOC100423561","Кисть КФК10 филеночная","EXR0528008","Z030200000","ШТ",1,8.3000000000000007,8.3000000000000007,"2017-12-31",0,0]
["LOC100423818","Клещи Hanlong HT-500 д/обжима RJ-12","EXR0528009","Z030200000","ШТ",1,971.62,971.62,"2017-12-31",0,0]
["LOC100424097","Ковер диэлектрический 1-700х700","EXR0528010","Z030200000","ШТ",2,413.48,206.74,"2017-12-31",0,0]
["LOC100424450","Коммутатор Cisco WS-C2960-24TT-L","EXR0528011","Z030200000","ШТ",1,28412.53,28412.53,"2017-12-31",0,0]
["LOC100424455","Коммутатор Eltex MES2308","EXR0528012","Z030200000","ШТ",1,14930.08,14930.08,"2017-12-31",0,0]
["LOC100424960","Компьютер Depo Neos 480SF i3_4350","ZIT0006153","Z030200000","ШТ",1,39374.51,39374.51,"2017-12-31",0,0]
["LOC100424961","Компьютер Depo Neos 480SF i3_6300","ZIT0006111","Z030200000","ШТ",1,21787.119999999999,21787.119999999999,"2017-12-31",0,0]
["LOC100424967","Компьютер HP ProDesk 600 G2 SFF T4J87EA","ZIT0006154","Z030200000","ШТ",1,39794.93,39794.93,"2017-12-31",0,0]
["LOC100427046","Кресло Chairman CH727 10-128 офисное","EX00790511","Z030200000","ШТ",1,7472.78,7472.78,"2018-10-11",0,0]
["LOC100427048","Кресло Chairman CH727 20-23 офисное","EX00850136","Z030200000","ШТ",1,3699.45,3699.45,"2018-11-20",0,0]
["LOC100427161","Кресло КТ2/118/3-С11 ткань","EXR0528013","Z030200000","ШТ",3,14.91,4.97,"2017-12-31",0,0]
["LOC100427167","Кресло КТ2/125-С8 конференц 3-мест.ткань","EXR0528609","Z030200000","ШТ",1,23.89,23.89,"2017-12-31",0,0]
["LOC100427210","Кресло КТ8/М-9/Т2 ткань","EXR0528014","Z030200000","ШТ",2,47.14,23.57,"2017-12-31",0,0]
["LOC100427548","Круглогубцы Зубр Эксперт 2201-8-16 160мм","EXR0528015","Z030200000","ШТ",2,290,145,"2017-12-31",0,0]
["LOC100428704","Лопата ЛКО арт.1с491 с черенком","EX00898495","Z030200000","ШТ",1,186.69,186.69,"2019-03-20",0,0]
["LOC100428792","Лоток канц.Стамм ЛТ203 Эксперт гориз.","EX01004878","Z030200000","ШТ",10,1321,132.1,"2019-08-30",0,0]
["LOC100429400","Маршрутизатор Eltex RG-34-Wac","EXR0528018","Z030200000","ШТ",1,3501.99,3501.99,"2017-12-31",0,0]
["LOC100429875","Медиаконвертер NSGate NFG-W02L/A","EX00855995","Z030200000","ШТ",1,2065.25,2065.25,"2018-12-27",0,0]
["LOC100429876","Медиаконвертер NSGate NFG-W02L/B","EX00855996","Z030200000","ШТ",1,2765.25,2765.25,"2018-12-27",0,0]
["LOC100429877","Медиаконвертер NSGate NF-S0M","EXR0527543","Z030200000","ШТ",2,5910,2955,"2017-12-31",0,0]
["LOC100429973","Метла п/этилен.Гардена с черенком","EX01106231","Z030200000","ШТ",2,160.72,80.36,"2020-02-28",0,0]
["LOC100430064","Метчик 2621-3053 М5х0,5 пр с удл.хвост.","EXR0528020","Z030200000","ШТ",1,135.16,135.16,"2017-12-31",0,0]
["LOC100430065","Метчик 2621-3057 М6х1,0 пр с удл.хвост.","EXR0528021","Z030200000","ШТ",1,76.83,76.83,"2017-12-31",0,0]
["LOC100430262","Модем Telindus 1421 SHDSL Router 177446","EXR0528023","Z030200000","ШТ",1,16392.84,16392.84,"2017-12-31",0,0]
["LOC100430263","Модем Telindus 1422 SHDSL Router 187874","EXR0528024","Z030200000","ШТ",1,16272,16272,"2017-12-31",0,0]
["LOC100430363","Молоток 7850-0116 0,2кг квадр.боек","EX01099006","Z030200000","ШТ",1,110.67,110.67,"2020-01-31",0,0]
["LOC100430410","Монитор HP EliteDisplay E190i 19\"","ZIT0006156","Z030200000","ШТ",1,15448.21,15448.21,"2017-12-31",0,0]
["LOC100430424","Монитор Iiyama XB2283HSU-B3 22\"","ZIT0006117","Z030200000","ШТ",1,9630.31,9630.31,"2017-12-31",0,0]
["LOC100430432","Монитор HP Z23n (M2J79A4) 23\"","ZIT0006157","Z030200000","ШТ",1,23104.639999999999,23104.639999999999,"2017-12-31",0,0]
["LOC100430553","Мультиметр Актаком АМ-1171","EX01017746","Z030200000","ШТ",1,22546.7,22546.7,"2019-09-30",0,0]
["LOC100430694","МФУ HP LJ Pro M225rdn (CF486A) ч/б А4","ZIT0006155","Z030200000","ШТ",1,17475.7,17475.7,"2017-12-31",0,0]
["LOC100430952","Набор бит Bosch 2.607.019.453 15шт","EXR0528026","Z030200000","ШТ",1,480.51,480.51,"2017-12-31",0,0]
["LOC100431186","Набор ключей Matrix 15242 6-32мм рожк.","EX00857208","Z030200000","ШТ",1,1219,1219,"2018-12-29",0,0]
["LOC100431214","Набор ключей НТК торцовых","EXR0528027","Z030200000","ШТ",1,764.98,764.98,"2017-12-31",0,0]
["LOC100431335","Набор отверток Wiha SoftFinish 320N K6","EXR0528028","Z030200000","ШТ",2,3954.53,1977.27,"2017-12-31",0,{"$f":"J88*H88","v":0}]
["LOC100431348","Набор отверток Сибртех 12936 7шт диэлек.","EX00857209","Z030200000","ШТ",3,1439.11,479.7,"2018-12-29",0,0]
["LOC100431465","Набор убор.Ленивка SV3033 щетк.совок","EX00849511","Z030200000","ШТ",2,1680.62,840.31,"2018-11-23",0,0]
["LOC100431576","Накомарник","ZSZ0004747","Z030200000","ШТ",4,850.94,212.74,"2017-12-31",0,0]
["LOC100431576","Накомарник","ZSZ0004748","Z030200000","ШТ",1,212.85,212.85,"2017-12-31",0,0]
["LOC100431719","Накопитель Flash 16Gb TS16GJF700 Transce","ZIT0006158","Z030200000","ШТ",1,351.69,351.69,"2017-12-31",0,0]
["LOC100432105","Наушники п/шум.ЕР-107","ZSZ0004749","Z030200000","ШТ",2,327.60000000000002,163.80000000000001,"2017-12-31",0,0]
["LOC100432109","Наушники п/шум.СОМЗ-5 Штурм 60105","EX01122275","Z030200000","ШТ",1,309,309,"2020-05-29",0,0]
["LOC100432334","Ножницы С235 лев.250мм д/резки метал.","EXR0528031","Z030200000","ШТ",1,123.18,123.18,"2017-12-31",0,0]
["LOC100432608","Огнетушитель ОП-2 порош.","EXR0528032","Z030200000","ШТ",3,845.91,281.97000000000003,"2017-12-31",0,0]
["LOC100432628","Огнетушитель ОП-5(з)-ABCE-01 4854-001-21","EXR0528034","Z030200000","ШТ",6,4566.25,761.04,"2017-12-31",0,0]
["LOC100432644","Огнетушитель ОУ-10 ГОСТ 51057-97","EXR0528035","Z030200000","ШТ",2,3977.32,1988.66,"2017-12-31",0,0]
["LOC100432645","Огнетушитель ОУ-2 ГОСТ 51057-01","EXR0528036","Z030200000","ШТ",6,3804.89,634.15,"2017-12-31",0,0]
["LOC100432648","Огнетушитель ОУ-3 ГОСТ 51057-01","EXR0528037","Z030200000","ШТ",2,1477.42,738.71,"2017-12-31",0,0]
["LOC100432648","Огнетушитель ОУ-3 ГОСТ 51057-01","EXR0528038","Z030200000","ШТ",2,1626.88,813.44,"2017-12-31",0,0]
["LOC100432652","Огнетушитель ОУ-5 ГОСТ 51057-9","EXR0528039","Z030200000","ШТ",2,3099.14,1549.57,"2017-12-31",0,0]
["LOC100432653","Огнетушитель ОУ-5/7.2/5 ГОСТ 51057-01","EXR0528040","Z030200000","ШТ",2,2870,1435,"2017-12-31",0,0]
["LOC100432653","Огнетушитель ОУ-5/7.2/5 ГОСТ 51057-01","EXR0528041","Z030200000","ШТ",1,1435.01,1435.01,"2017-12-31",0,0]
["LOC100433187","Очки защ.9350 035 Uvex Амиго","ZSZ0004750","Z030200000","ШТ",1,806.62,806.62,"2017-12-31",0,0]
["LOC100433506","Пассатижи КВТ 160мм изолированные","EXR0528043","Z030200000","ШТ",2,247.75,123.88,"2017-12-31",0,0]
["LOC100433954","Перчатки диэлектрич.","ZSZ0004756","Z030200000","ПАР",1,95.44,95.44,"2017-12-31",0,0]
["LOC100433954","Перчатки диэлектрич.","ZSZ0004757","Z030200000","ПАР",1,138.77000000000001,138.77000000000001,"2017-12-31",0,0]
["LOC100433954","Перчатки диэлектрич.","ZSZ0004758","Z030200000","ПАР",1,138.78,138.78,"2017-12-31",0,0]
["LOC100434095","Печь элект.отопит.ПЭТ-4 1,6кВт У3","EX01355820","Z030200000","ШТ",4,9200,2300,"2021-12-30",0,0]
["LOC100434444","Плащ м.рабочий прорез.52-54/4","ZSZ0004761","Z030200000","ШТ",1,657.6,657.6,"2017-12-31",0,0]
["LOC100434454","Плащ м.рабочий прорез.мод.Е-1 48-50/2","ZSZ0004762","Z030200000","ШТ",1,1268.3599999999999,1268.3599999999999,"2017-12-31",0,0]
["LOC100435422","Полотенце 0,45х0,85 ВМИ 502 вафельное","EX01285183","Z030200000","ШТ",3,390.24,130.08000000000001,"2021-07-30",0,0]
["LOC100435512","Полотно нож.руч.2800-0005 300х12,5х0,63","EXR0528045","Z030200000","ШТ",2,8,4,"2017-12-31",0,0]
["LOC100436840","Радиостанция GM360 VHF 136-174МГц авт.","EXR0528046","Z030200000","ШТ",1,17667.34,17667.34,"2017-12-31",0,0]
["LOC100436842","Радиостанция GM360 автомоб.с антен.","EXR0528047","Z030200000","КМП",3,53918.85,17972.95,"2017-12-31",0,0]
["LOC100436846","Радиостанция Motorola CM160 146-174МГц","EXR0535846","Z030200000","ШТ",1,22621.49,22621.49,"2017-12-31",0,0]
["LOC100436846","Радиостанция Motorola CM160 146-174МГц","EXR1062189","Z030200000","ШТ",2,15744,7872,null,0,0]
["LOC100436847","Радиостанция Motorola CP180 136-174МГц","EXR0528048","Z030200000","ШТ",2,24016.99,12008.5,"2017-12-31",0,0]
{"$rows_left_out":123}
{"sheet":"Нормы","index":3,"n_rows":7,"n_cols":2,"rows_kept":7,"cut":false,"hidden":false,"merged":[]}
[]
[]
[null,"a"]
[]
[]
[]
[null,"a"]

{"sheet":"Лист1","index":4,"n_rows":0,"n_cols":0,"rows_kept":0,"cut":false,"hidden":false,"merged":[]}