{"text_format":"1","workbook":"xlsx","n_sheets":5,"sheets":["Договора","Приложения","Справочники","Проверка","Согласование"],"not_rendered":{"charts":0,"images":0,"macros":1,"external_links":0,"defined_names":0,"comments":0,"pivot_tables":0},"unopened":[],"bounds":{"document_bytes":16777216,"sheet_cells":100000,"rows_first":2000,"rows_last":500,"rows_between":2000,"halvings":0,"cell_chars":16384,"cell_head_chars":4096},"cells_cut":0,"cells_raw":0,"read":"whole","date_system":"1900"}

{"sheet":"Договора","index":0,"n_rows":11,"n_cols":13,"rows_kept":11,"cut":false,"hidden":false,"merged":[]}
["№","№ договора","Компания","Дата начала договора","Дата окончания договора","ИНН","№ Согласования","Примечание","Адрес","Повтор","Смена Юр. Реквизитов/Пролонгация","Местоположение","Условия оплаты"]
[1,"1а","ООО  \"Первый\"","2022-01-01","до исполнения",1234567890,null,null,"Ленинский",{"$f":"IF(COUNTIF(B:B,B2)>1,\"Дубликат\",\"\")","v":""},null,"Архив",50]
[2,"2б","ООО \"Второй\"","2022-01-02","1год",1234567890,null,null,"Ленинский","",null,"Архив",60]
[3,"3в","ООО \"Третий\"","2022-01-03","31.12.2022/автопролонгация",1234567890,null,null,"Ленинский","",null,"Архив",70]
[4,"4г","ЗАО \"Четвертый\"","2022-01-04","31.12.2022/автопролонгация",1234567890,null,null,"Ленинский","",null,"Архив",50]
[5,"5д","ООО \"Пятый\"","2022-01-05","2022-12-31",1234567890,null,null,"Ленинский","",null,"Архив",50]
[6,"6е","ООО \"Шестой\"","2022-01-06","2022-12-31",1234567890,null,null,"Ленинский","",null,"Архив",50]
[7,"7ж","ОАО \"Седьмой\"","2022-01-07","31.12.2022/автопролонгация",1234567890,null,null,"Ленинский","",null,"Архив",60]
[8,"8з","ООО \"Восьмойт\"","2022-01-08","2022-12-31",1234567890,null,null,"Ленинский","",null,"Архив",70]
[9,"9и","ООО \"Девятый\"","2022-01-09","2022-12-31",1234567890,null,null,"Ленинский","",null,"Архив",30]
{"$rows_left_out":2}
{"sheet":"Приложения","index":1,"n_rows":24,"n_cols":12,"rows_kept":24,"cut":false,"hidden":false,"merged":[]}
["№","Вид документа","№ документа","Дата документа","№ договора","Компания","Дата начала договора","№ Согласование","Примечание","Кол-во дубликатов","Принял ФИО","Дата принятия"]
[1,"Ведомость исполнения","1","2011-08-01","1а",{"$f":"IF(E2=\"\",\"\",INDEX(Договора!$B$1:$D$2008,MATCH($E2,Договора!$B$1:$B$2008,0),MATCH(F$1,Договора!$B$1:$D$1,0)))","v":"ООО  \"Первый\""},{"$f":"IF(E2=\"\",\"\",INDEX(Договора!$B$1:$D$2008,MATCH($E2,Договора!$B$1:$B$2008,0),MATCH(G$1,Договора!$B$1:$D$1,0)))","v":"2022-01-01"},"0001107",null,{"$f":"IF(C2=\"\",\"\",IF(COUNTIFS(Приложения!$C$1:C1,Приложения!C2,Приложения!$D$1:D1,Приложения!D2,Приложения!$E$1:E1,Приложения!E2,Приложения!$F$1:F1,Приложения!F2,Приложения!$G$1:G1,Приложения!G2,Приложения!$B$1:B1,Приложения!B2)=0,\"Оригинал\",IF(COUNTIFS(Приложения!$C$1:C1,Приложения!C2,Приложения!$D$1:D1,Приложения!D2,Приложения!$E$1:E1,Приложения!E2,Приложения!$F$1:F1,Приложения!F2,Приложения!$G$1:G1,Приложения!G2,Приложения!$B$1:B1,Приложения!B2)=1,\"Дубликат\",\"Проверить\")))","v":"Оригинал"}]
[2,"Протокол согласования цены","к ви 1","2011-08-01","1а",{"$f":"IF(E3=\"\",\"\",INDEX(Договора!$B$1:$D$2008,MATCH($E3,Договора!$B$1:$B$2008,0),MATCH(F$1,Договора!$B$1:$D$1,0)))","v":"ООО  \"Первый\""},{"$f":"IF(E3=\"\",\"\",INDEX(Договора!$B$1:$D$2008,MATCH($E3,Договора!$B$1:$B$2008,0),MATCH(G$1,Договора!$B$1:$D$1,0)))","v":"2022-01-01"},"0001108",null,{"$f":"IF(C3=\"\",\"\",IF(COUNTIFS(Приложения!$C$1:C2,Приложения!C3,Приложения!$D$1:D2,Приложения!D3,Приложения!$E$1:E2,Приложения!E3,Приложения!$F$1:F2,Приложения!F3,Приложения!$G$1:G2,Приложения!G3,Приложения!$B$1:B2,Приложения!B3)=0,\"Оригинал\",IF(COUNTIFS(Приложения!$C$1:C2,Приложения!C3,Приложения!$D$1:D2,Приложения!D3,Приложения!$E$1:E2,Приложения!E3,Приложения!$F$1:F2,Приложения!F3,Приложения!$G$1:G2,Приложения!G3,Приложения!$B$1:B2,Приложения!B3)=1,\"Дубликат\",\"Проверить\")))","v":"Оригинал"}]
[3,"Спецификация","1","2011-08-04","3в",{"$f":"IF(E4=\"\",\"\",INDEX(Договора!$B$1:$D$2008,MATCH($E4,Договора!$B$1:$B$2008,0),MATCH(F$1,Договора!$B$1:$D$1,0)))","v":"ООО \"Третий\""},{"$f":"IF(E4=\"\",\"\",INDEX(Договора!$B$1:$D$2008,MATCH($E4,Договора!$B$1:$B$2008,0),MATCH(G$1,Договора!$B$1:$D$1,0)))","v":"2022-01-03"},"0001109",null,{"$f":"IF(C4=\"\",\"\",IF(COUNTIFS(Приложения!$C$1:C3,Приложения!C4,Приложения!$D$1:D3,Приложения!D4,Приложения!$E$1:E3,Приложения!E4,Приложения!$F$1:F3,Приложения!F4,Приложения!$G$1:G3,Приложения!G4,Приложения!$B$1:B3,Приложения!B4)=0,\"Оригинал\",IF(COUNTIFS(Приложения!$C$1:C3,Приложения!C4,Приложения!$D$1:D3,Приложения!D4,Приложения!$E$1:E3,Приложения!E4,Приложения!$F$1:F3,Приложения!F4,Приложения!$G$1:G3,Приложения!G4,Приложения!$B$1:B3,Приложения!B4)=1,\"Дубликат\",\"Проверить\")))","v":"Оригинал"}]
[4,"Заявка","1","2011-08-17","4г",{"$f":"IF(E5=\"\",\"\",INDEX(Договора!$B$1:$D$2008,MATCH($E5,Договора!$B$1:$B$2008,0),MATCH(F$1,Договора!$B$1:$D$1,0)))","v":"ЗАО \"Четвертый\""},{"$f":"IF(E5=\"\",\"\",INDEX(Договора!$B$1:$D$2008,MATCH($E5,Договора!$B$1:$B$2008,0),MATCH(G$1,Договора!$B$1:$D$1,0)))","v":"2022-01-04"},"0001110",null,{"$f":"IF(C5=\"\",\"\",IF(COUNTIFS(Приложения!$C$1:C4,Приложения!C5,Приложения!$D$1:D4,Приложения!D5,Приложения!$E$1:E4,Приложения!E5,Приложения!$F$1:F4,Приложения!F5,Приложения!$G$1:G4,Приложения!G5,Приложения!$B$1:B4,Приложения!B5)=0,\"Оригинал\",IF(COUNTIFS(Приложения!$C$1:C4,Приложения!C5,Приложения!$D$1:D4,Приложения!D5,Приложения!$E$1:E4,Приложения!E5,Приложения!$F$1:F4,Приложения!F5,Приложения!$G$1:G4,Приложения!G5,Приложения!$B$1:B4,Приложения!B5)=1,\"Дубликат\",\"Проверить\")))","v":"Оригинал"}]
[5,"Доп.соглашение","1","2011-08-17","5д",{"$f":"IF(E6=\"\",\"\",INDEX(Договора!$B$1:$D$2008,MATCH($E6,Договора!$B$1:$B$2008,0),MATCH(F$1,Договора!$B$1:$D$1,0)))","v":"ООО \"Пятый\""},{"$f":"IF(E6=\"\",\"\",INDEX(Договора!$B$1:$D$2008,MATCH($E6,Договора!$B$1:$B$2008,0),MATCH(G$1,Договора!$B$1:$D$1,0)))","v":"2022-01-05"},"0001111",null,{"$f":"IF(C6=\"\",\"\",IF(COUNTIFS(Приложения!$C$1:C5,Приложения!C6,Приложения!$D$1:D5,Приложения!D6,Приложения!$E$1:E5,Приложения!E6,Приложения!$F$1:F5,Приложения!F6,Приложения!$G$1:G5,Приложения!G6,Приложения!$B$1:B5,Приложения!B6)=0,\"Оригинал\",IF(COUNTIFS(Приложения!$C$1:C5,Приложения!C6,Приложения!$D$1:D5,Приложения!D6,Приложения!$E$1:E5,Приложения!E6,Приложения!$F$1:F5,Приложения!F6,Приложения!$G$1:G5,Приложения!G6,Приложения!$B$1:B5,Приложения!B6)=1,\"Дубликат\",\"Проверить\")))","v":"Оригинал"}]
[6,"Локальная смета","1","2011-08-18","6е",{"$f":"IF(E7=\"\",\"\",INDEX(Договора!$B$1:$D$2008,MATCH($E7,Договора!$B$1:$B$2008,0),MATCH(F$1,Договора!$B$1:$D$1,0)))","v":"ООО \"Шестой\""},{"$f":"IF(E7=\"\",\"\",INDEX(Договора!$B$1:$D$2008,MATCH($E7,Договора!$B$1:$B$2008,0),MATCH(G$1,Договора!$B$1:$D$1,0)))","v":"2022-01-06"},"0001112",null,{"$f":"IF(C7=\"\",\"\",IF(COUNTIFS(Приложения!$C$1:C6,Приложения!C7,Приложения!$D$1:D6,Приложения!D7,Приложения!$E$1:E6,Приложения!E7,Приложения!$F$1:F6,Приложения!F7,Приложения!$G$1:G6,Приложения!G7,Приложения!$B$1:B6,Приложения!B7)=0,\"Оригинал\",IF(COUNTIFS(Приложения!$C$1:C6,Приложения!C7,Приложения!$D$1:D6,Приложения!D7,Приложения!$E$1:E6,Приложения!E7,Приложения!$F$1:F6,Приложения!F7,Приложения!$G$1:G6,Приложения!G7,Приложения!$B$1:B6,Приложения!B7)=1,\"Дубликат\",\"Проверить\")))","v":"Оригинал"}]
[7,"Спецификация","2","2011-08-18","3в",{"$f":"IF(E8=\"\",\"\",INDEX(Договора!$B$1:$D$2008,MATCH($E8,Договора!$B$1:$B$2008,0),MATCH(F$1,Договора!$B$1:$D$1,0)))","v":"ООО \"Третий\""},{"$f":"IF(E8=\"\",\"\",INDEX(Договора!$B$1:$D$2008,MATCH($E8,Договора!$B$1:$B$2008,0),MATCH(G$1,Договора!$B$1:$D$1,0)))","v":"2022-01-03"},"0001113",null,{"$f":"IF(C8=\"\",\"\",IF(COUNTIFS(Приложения!$C$1:C7,Приложения!C8,Приложения!$D$1:D7,Приложения!D8,Приложения!$E$1:E7,Приложения!E8,Приложения!$F$1:F7,Приложения!F8,Приложения!$G$1:G7,Приложения!G8,Приложения!$B$1:B7,Приложения!B8)=0,\"Оригинал\",IF(COUNTIFS(Приложения!$C$1:C7,Приложения!C8,Приложения!$D$1:D7,Приложения!D8,Приложения!$E$1:E7,Приложения!E8,Приложения!$F$1:F7,Приложения!F8,Приложения!$G$1:G7,Приложения!G8,Приложения!$B$1:B7,Приложения!B8)=1,\"Дубликат\",\"Проверить\")))","v":"Оригинал"}]
[8,"Протокол согласования цены","к сп 2","2011-08-30","3в",{"$f":"IF(E9=\"\",\"\",INDEX(Договора!$B$1:$D$2008,MATCH($E9,Договора!$B$1:$B$2008,0),MATCH(F$1,Договора!$B$1:$D$1,0)))","v":"ООО \"Третий\""},{"$f":"IF(E9=\"\",\"\",INDEX(Договора!$B$1:$D$2008,MATCH($E9,Договора!$B$1:$B$2008,0),MATCH(G$1,Договора!$B$1:$D$1,0)))","v":"2022-01-03"},"0001114",null,{"$f":"IF(C9=\"\",\"\",IF(COUNTIFS(Приложения!$C$1:C8,Приложения!C9,Приложения!$D$1:D8,Приложения!D9,Приложения!$E$1:E8,Приложения!E9,Приложения!$F$1:F8,Приложения!F9,Приложения!$G$1:G8,Приложения!G9,Приложения!$B$1:B8,Приложения!B9)=0,\"Оригинал\",IF(COUNTIFS(Приложения!$C$1:C8,Приложения!C9,Приложения!$D$1:D8,Приложения!D9,Приложения!$E$1:E8,Приложения!E9,Приложения!$F$1:F8,Приложения!F9,Приложения!$G$1:G8,Приложения!G9,Приложения!$B$1:B8,Приложения!B9)=1,\"Дубликат\",\"Проверить\")))","v":"Оригинал"}]
[9,"Акт","1","2011-08-30","9и",{"$f":"IF(E10=\"\",\"\",INDEX(Договора!$B$1:$D$2008,MATCH($E10,Договора!$B$1:$B$2008,0),MATCH(F$1,Договора!$B$1:$D$1,0)))","v":"ООО \"Девятый\""},{"$f":"IF(E10=\"\",\"\",INDEX(Договора!$B$1:$D$2008,MATCH($E10,Договора!$B$1:$B$2008,0),MATCH(G$1,Договора!$B$1:$D$1,0)))","v":"2022-01-09"},"0001115",null,{"$f":"IF(C10=\"\",\"\",IF(COUNTIFS(Приложения!$C$1:C9,Приложения!C10,Приложения!$D$1:D9,Приложения!D10,Приложения!$E$1:E9,Приложения!E10,Приложения!$F$1:F9,Приложения!F10,Приложения!$G$1:G9,Приложения!G10,Приложения!$B$1:B9,Приложения!B10)=0,\"Оригинал\",IF(COUNTIFS(Приложения!$C$1:C9,Приложения!C10,Приложения!$D$1:D9,Приложения!D10,Приложения!$E$1:E9,Приложения!E10,Приложения!$F$1:F9,Приложения!F10,Приложения!$G$1:G9,Приложения!G10,Приложения!$B$1:B9,Приложения!B10)=1,\"Дубликат\",\"Проверить\")))","v":"Оригинал"}]
{"$rows_left_out":15}
{"sheet":"Справочники","index":2,"n_rows":32,"n_cols":1,"rows_kept":32,"cut":false,"hidden":true,"merged":[]}
["Вид документа"]
["Акт"]
["Акт выполненных работ"]
["Акт о исполнении договора"]
["Акт приема-передачи"]
["Акт сдачи-приемки"]
["Ведомость"]
["Ведомость исполнения"]
["Ведомость носителя электронного"]
["Выберите тип документа"]
{"$rows_left_out":23}
{"sheet":"Проверка","index":3,"n_rows":12,"n_cols":7,"rows_kept":12,"cut":false,"hidden":false,"merged":[[11,0,32,6],[2,4,2,5],[3,0,3,2],[4,0,4,2],[5,0,5,2],[6,0,6,2],[8,0,8,2],[3,3,3,5],[4,3,4,5],[5,3,5,5],[6,3,6,5],[7,3,7,5],[8,3,8,5],[7,0,7,2]]}
["Вид документа","№ Документа","Дата документа","№ Договора","№ Согласование","Cтатус","Примечание"]
[]
["Проверка",{"$f":"IF($B$2=\"\",\"Отсутвует номер документа\",IF(COUNTIFS(Приложения[Вид документа],Проверка!$A$2,Приложения[№ документа],Проверка!$B$2,Приложения[№ договора],Проверка!$D$2,Приложения[Компания],Проверка!$B$4)>0,\"Проверить Приложения\",IF(COUNTIFS(Согласование!$B$2:$B$21,Проверка!$A$2,Согласование!$C$2:$C$21,Проверка!$B$2,Согласование!$E$2:$E$21,Проверка!$D$2,Согласование!$F$2:$F$21,Проверка!$B$4)>0,\"Проверить Согласование\",\"Оригинал\")))","v":"Отсутвует номер документа"},null,{"$f":"IF($D$2=\"\",\"Отсутвует номер договора\",INDEX(Договора!$B$1:$L$2008,MATCH($D$2,Договора!$B$1:$B$2008,0),MATCH(\"Местоположение\",Договора!$B$1:$L$1,0)))","v":"Отсутвует номер договора"},{"$f":"IF($E$2=\"\",\"Отсутвует № Согласования\",IF(COUNTIF(Приложения[№ Согласование],Проверка!$E$2)>0,\"Проверить Приложения\",IF(COUNTIF(Договора[№ Согласования],Проверка!$E$2)>0,\"Проверить Договора\",IF(COUNTIF(Согласование!H:H,Проверка!$E$2)>0,\"Проверить Согласование\",\"Оригинал\"))))","v":"Отсутвует № Согласования"}]
["Компания",null,null,{"$f":"IF($D$2=\"\",\"\",INDEX(Договора!$B$1:$D$2008,MATCH($D$2,Договора!$B$1:$B$2008,0),MATCH(\"Компания\",Договора!$B$1:$D$1,0)))","v":""}]
["Дата начала договора",null,null,{"$f":"IF($D$2=\"\",\"\",INDEX(Договора!$B$1:$D$2008,MATCH($D$2,Договора!$B$1:$B$2008,0),MATCH(\"Дата начала договора\",Договора!$B$1:$D$1,0)))","v":""}]
["Дата окончания договора",null,null,{"$f":"IF($D$2=\"\",\"\",INDEX(Договора!$B$1:$L$2008,MATCH($D$2,Договора!$B$1:$B$2008,0),MATCH(\"Дата окончания договора\",Договора!$B$1:$L$1,0)))","v":""}]
["Адрес",null,null,{"$f":"IF($D$2=\"\",\"\",INDEX(Договора!$B$1:$L$2008,MATCH($D$2,Договора!$B$1:$B$2008,0),MATCH(\"Адрес\",Договора!$B$1:$L$1,0)))","v":""}]
["Смена Юр. Реквизитов/Пролонгация",null,null,{"$f":"IF($D$2=\"\",\"\",IF((INDEX(Договора!$B$1:$L$2008,MATCH($D$2,Договора!$B$1:$B$2008,0),MATCH(\"Смена Юр. Реквизитов/Пролонгация\",Договора!$B$1:$L$1,0)))=0,\"Не производилась\",INDEX(Договора!$B$1:$L$2008,MATCH($D$2,Договора!$B$1:$B$2008,0),MATCH(\"Смена Юр. Реквизитов/Пролонгация\",Договора!$B$1:$L$1,0))))","v":""}]
["Условия оплаты",null,null,{"$f":"IF($D$2=\"\",\"\",INDEX(Договора!$B$1:$M$2008,MATCH($D$2,Договора!$B$1:$B$2008,0),MATCH(\"Условия оплаты\",Договора!$B$1:$M$1,0)))","v":""}]
[]
{"$rows_left_out":3}
{"sheet":"Согласование","index":4,"n_rows":47,"n_cols":12,"rows_kept":47,"cut":false,"hidden":false,"merged":[]}
["№","Вид документа","№ документа","Дата документа","№ договора","Компания","Дата начала договора","Согласование №","Статус","Примечание","Проверка наличия документа","Проверка № согласования"]
[1,"Спецификация","185","2022-02-15","1а",{"$f":"IF(E2=\"\",\"\",INDEX(Договора!$B$1:$D$2008,MATCH($E2,Договора!$B$1:$B$2008,0),MATCH(F$1,Договора!$B$1:$D$1,0)))","v":"ООО  \"Первый\""},{"$f":"IF(E2=\"\",\"\",INDEX(Договора!$B$1:$D$2008,MATCH($E2,Договора!$B$1:$B$2008,0),MATCH(G$1,Договора!$B$1:$D$1,0)))","v":"2022-01-01"},"0001125","согласовано",null,{"$f":"IF(B2=\"\",\"\",IF(COUNTIFS(Приложения[Вид документа],Согласование!$B2,Приложения[№ документа],Согласование!$C2,Приложения[Дата документа],Согласование!$D2,Приложения[№ договора],Согласование!$E2,Приложения[Компания],Согласование!$F2,Приложения[Дата начала договора],Согласование!$G2)=1,\"Представлен\",IF(COUNTIFS(Приложения[Вид документа],Согласование!$B2,Приложения[№ документа],Согласование!$C2,Приложения[Дата документа],Согласование!$D2,Приложения[№ договора],Согласование!$E2,Приложения[Компания],Согласование!$F2,Приложения[Дата начала договора],Согласование!$G2)=0,\"В работе\",\"Проверить\")))","v":"В работе"},{"$f":"IF(B2=\"\",\"\",IF(COUNTIF(Приложения[№ Согласование],Согласование!$H2)=0,\"В работе\",IF(COUNTIF(Приложения[№ Согласование],Согласование!$H2)=1,\"Представлен\",\"Срочно проверить\")))","v":"Представлен"}]
[2,"Спецификация","18","2022-04-27","2б",{"$f":"IF(E3=\"\",\"\",INDEX(Договора!$B$1:$D$2008,MATCH($E3,Договора!$B$1:$B$2008,0),MATCH(F$1,Договора!$B$1:$D$1,0)))","v":"ООО \"Второй\""},{"$f":"IF(E3=\"\",\"\",INDEX(Договора!$B$1:$D$2008,MATCH($E3,Договора!$B$1:$B$2008,0),MATCH(G$1,Договора!$B$1:$D$1,0)))","v":"2022-01-02"},"0001126","согласовано",null,{"$f":"IF(B3=\"\",\"\",IF(COUNTIFS(Приложения[Вид документа],Согласование!$B3,Приложения[№ документа],Согласование!$C3,Приложения[Дата документа],Согласование!$D3,Приложения[№ договора],Согласование!$E3,Приложения[Компания],Согласование!$F3,Приложения[Дата начала договора],Согласование!$G3)=1,\"Представлен\",IF(COUNTIFS(Приложения[Вид документа],Согласование!$B3,Приложения[№ документа],Согласование!$C3,Приложения[Дата документа],Согласование!$D3,Приложения[№ договора],Согласование!$E3,Приложения[Компания],Согласование!$F3,Приложения[Дата начала договора],Согласование!$G3)=0,\"В работе\",\"Проверить\")))","v":"В работе"},{"$f":"IF(B3=\"\",\"\",IF(COUNTIF(Приложения[№ Согласование],Согласование!$H3)=0,\"В работе\",IF(COUNTIF(Приложения[№ Согласование],Согласование!$H3)=1,\"Представлен\",\"Срочно проверить\")))","v":"В работе"}]
[3,"Спецификация","62","2022-04-22","3в",{"$f":"IF(E4=\"\",\"\",INDEX(Договора!$B$1:$D$2008,MATCH($E4,Договора!$B$1:$B$2008,0),MATCH(F$1,Договора!$B$1:$D$1,0)))","v":"ООО \"Третий\""},{"$f":"IF(E4=\"\",\"\",INDEX(Договора!$B$1:$D$2008,MATCH($E4,Договора!$B$1:$B$2008,0),MATCH(G$1,Договора!$B$1:$D$1,0)))","v":"2022-01-03"},"0001127","согласовано",null,{"$f":"IF(B4=\"\",\"\",IF(COUNTIFS(Приложения[Вид документа],Согласование!$B4,Приложения[№ документа],Согласование!$C4,Приложения[Дата документа],Согласование!$D4,Приложения[№ договора],Согласование!$E4,Приложения[Компания],Согласование!$F4,Приложения[Дата начала договора],Согласование!$G4)=1,\"Представлен\",IF(COUNTIFS(Приложения[Вид документа],Согласование!$B4,Приложения[№ документа],Согласование!$C4,Приложения[Дата документа],Согласование!$D4,Приложения[№ договора],Согласование!$E4,Приложения[Компания],Согласование!$F4,Приложения[Дата начала договора],Согласование!$G4)=0,\"В работе\",\"Проверить\")))","v":"В работе"},{"$f":"IF(B4=\"\",\"\",IF(COUNTIF(Приложения[№ Согласование],Согласование!$H4)=0,\"В работе\",IF(COUNTIF(Приложения[№ Согласование],Согласование!$H4)=1,\"Представлен\",\"Срочно проверить\")))","v":"В работе"}]
[4,"Спецификация","22","2022-04-25","4г",{"$f":"IF(E5=\"\",\"\",INDEX(Договора!$B$1:$D$2008,MATCH($E5,Договора!$B$1:$B$2008,0),MATCH(F$1,Договора!$B$1:$D$1,0)))","v":"ЗАО \"Четвертый\""},{"$f":"IF(E5=\"\",\"\",INDEX(Договора!$B$1:$D$2008,MATCH($E5,Договора!$B$1:$B$2008,0),MATCH(G$1,Договора!$B$1:$D$1,0)))","v":"2022-01-04"},"0001128","согласовано",null,{"$f":"IF(B5=\"\",\"\",IF(COUNTIFS(Приложения[Вид документа],Согласование!$B5,Приложения[№ документа],Согласование!$C5,Приложения[Дата документа],Согласование!$D5,Приложения[№ договора],Согласование!$E5,Приложения[Компания],Согласование!$F5,Приложения[Дата начала договора],Согласование!$G5)=1,\"Представлен\",IF(COUNTIFS(Приложения[Вид документа],Согласование!$B5,Приложения[№ документа],Согласование!$C5,Приложения[Дата документа],Согласование!$D5,Приложения[№ договора],Согласование!$E5,Приложения[Компания],Согласование!$F5,Приложения[Дата начала договора],Согласование!$G5)=0,\"В работе\",\"Проверить\")))","v":"В работе"},{"$f":"IF(B5=\"\",\"\",IF(COUNTIF(Приложения[№ Согласование],Согласование!$H5)=0,\"В работе\",IF(COUNTIF(Приложения[№ Согласование],Согласование!$H5)=1,\"Представлен\",\"Срочно проверить\")))","v":"В работе"}]
[5,"Спецификация","24","2022-04-25","5д",{"$f":"IF(E6=\"\",\"\",INDEX(Договора!$B$1:$D$2008,MATCH($E6,Договора!$B$1:$B$2008,0),MATCH(F$1,Договора!$B$1:$D$1,0)))","v":"ООО \"Пятый\""},{"$f":"IF(E6=\"\",\"\",INDEX(Договора!$B$1:$D$2008,MATCH($E6,Договора!$B$1:$B$2008,0),MATCH(G$1,Договора!$B$1:$D$1,0)))","v":"2022-01-05"},"0001129","согласовано",null,{"$f":"IF(B6=\"\",\"\",IF(COUNTIFS(Приложения[Вид документа],Согласование!$B6,Приложения[№ документа],Согласование!$C6,Приложения[Дата документа],Согласование!$D6,Приложения[№ договора],Согласование!$E6,Приложения[Компания],Согласование!$F6,Приложения[Дата начала договора],Согласование!$G6)=1,\"Представлен\",IF(COUNTIFS(Приложения[Вид документа],Согласование!$B6,Приложения[№ документа],Согласование!$C6,Приложения[Дата документа],Согласование!$D6,Приложения[№ договора],Согласование!$E6,Приложения[Компания],Согласование!$F6,Приложения[Дата начала договора],Согласование!$G6)=0,\"В работе\",\"Проверить\")))","v":"В работе"},{"$f":"IF(B6=\"\",\"\",IF(COUNTIF(Приложения[№ Согласование],Согласование!$H6)=0,\"В работе\",IF(COUNTIF(Приложения[№ Согласование],Согласование!$H6)=1,\"Представлен\",\"Срочно проверить\")))","v":"В работе"}]
[6,"Ведомость исполнения","9","2022-04-26","6е",{"$f":"IF(E7=\"\",\"\",INDEX(Договора!$B$1:$D$2008,MATCH($E7,Договора!$B$1:$B$2008,0),MATCH(F$1,Договора!$B$1:$D$1,0)))","v":"ООО \"Шестой\""},{"$f":"IF(E7=\"\",\"\",INDEX(Договора!$B$1:$D$2008,MATCH($E7,Договора!$B$1:$B$2008,0),MATCH(G$1,Договора!$B$1:$D$1,0)))","v":"2022-01-06"},"0001130","согласовано",null,{"$f":"IF(B7=\"\",\"\",IF(COUNTIFS(Приложения[Вид документа],Согласование!$B7,Приложения[№ документа],Согласование!$C7,Приложения[Дата документа],Согласование!$D7,Приложения[№ договора],Согласование!$E7,Приложения[Компания],Согласование!$F7,Приложения[Дата начала договора],Согласование!$G7)=1,\"Представлен\",IF(COUNTIFS(Приложения[Вид документа],Согласование!$B7,Приложения[№ документа],Согласование!$C7,Приложения[Дата документа],Согласование!$D7,Приложения[№ договора],Согласование!$E7,Приложения[Компания],Согласование!$F7,Приложения[Дата начала договора],Согласование!$G7)=0,\"В работе\",\"Проверить\")))","v":"В работе"},{"$f":"IF(B7=\"\",\"\",IF(COUNTIF(Приложения[№ Согласование],Согласование!$H7)=0,\"В работе\",IF(COUNTIF(Приложения[№ Согласование],Согласование!$H7)=1,\"Представлен\",\"Срочно проверить\")))","v":"В работе"}]
[7,null,null,null,null,{"$f":"IF(E8=\"\",\"\",INDEX(Договора!$B$1:$D$2008,MATCH($E8,Договора!$B$1:$B$2008,0),MATCH(F$1,Договора!$B$1:$D$1,0)))","v":""},{"$f":"IF(E8=\"\",\"\",INDEX(Договора!$B$1:$D$2008,MATCH($E8,Договора!$B$1:$B$2008,0),MATCH(G$1,Договора!$B$1:$D$1,0)))","v":""},null,null,null,{"$f":"IF(B8=\"\",\"\",IF(COUNTIFS(Приложения[Вид документа],Согласование!$B8,Приложения[№ документа],Согласование!$C8,Приложения[Дата документа],Согласование!$D8,Приложения[№ договора],Согласование!$E8,Приложения[Компания],Согласование!$F8,Приложения[Дата начала договора],Согласование!$G8)=1,\"Представлен\",IF(COUNTIFS(Приложения[Вид документа],Согласование!$B8,Приложения[№ документа],Согласование!$C8,Приложения[Дата документа],Согласование!$D8,Приложения[№ договора],Согласование!$E8,Приложения[Компания],Согласование!$F8,Приложения[Дата начала договора],Согласование!$G8)=0,\"В работе\",\"Проверить\")))","v":""},{"$f":"IF(B8=\"\",\"\",IF(COUNTIF(Приложения[№ Согласование],Согласование!$H8)=0,\"В работе\",IF(COUNTIF(Приложения[№ Согласование],Согласование!$H8)=1,\"Представлен\",\"Срочно проверить\")))","v":""}]
[8,"Спецификация","3","2022-03-05","8з",{"$f":"IF(E9=\"\",\"\",INDEX(Договора!$B$1:$D$2008,MATCH($E9,Договора!$B$1:$B$2008,0),MATCH(F$1,Договора!$B$1:$D$1,0)))","v":"ООО \"Восьмойт\""},{"$f":"IF(E9=\"\",\"\",INDEX(Договора!$B$1:$D$2008,MATCH($E9,Договора!$B$1:$B$2008,0),MATCH(G$1,Договора!$B$1:$D$1,0)))","v":"2022-01-08"},"0001132","согласовано",null,{"$f":"IF(B9=\"\",\"\",IF(COUNTIFS(Приложения[Вид документа],Согласование!$B9,Приложения[№ документа],Согласование!$C9,Приложения[Дата документа],Согласование!$D9,Приложения[№ договора],Согласование!$E9,Приложения[Компания],Согласование!$F9,Приложения[Дата начала договора],Согласование!$G9)=1,\"Представлен\",IF(COUNTIFS(Приложения[Вид документа],Согласование!$B9,Приложения[№ документа],Согласование!$C9,Приложения[Дата документа],Согласование!$D9,Приложения[№ договора],Согласование!$E9,Приложения[Компания],Согласование!$F9,Приложения[Дата начала договора],Согласование!$G9)=0,\"В работе\",\"Проверить\")))","v":"В работе"},{"$f":"IF(B9=\"\",\"\",IF(COUNTIF(Приложения[№ Согласование],Согласование!$H9)=0,\"В работе\",IF(COUNTIF(Приложения[№ Согласование],Согласование!$H9)=1,\"Представлен\",\"Срочно проверить\")))","v":"В работе"}]
[9,"Спецификация","339","2022-02-17","9и",{"$f":"IF(E10=\"\",\"\",INDEX(Договора!$B$1:$D$2008,MATCH($E10,Договора!$B$1:$B$2008,0),MATCH(F$1,Договора!$B$1:$D$1,0)))","v":"ООО \"Девятый\""},{"$f":"IF(E10=\"\",\"\",INDEX(Договора!$B$1:$D$2008,MATCH($E10,Договора!$B$1:$B$2008,0),MATCH(G$1,Договора!$B$1:$D$1,0)))","v":"2022-01-09"},"0001133","Замечания","отсутствует документ",{"$f":"IF(B10=\"\",\"\",IF(COUNTIFS(Приложения[Вид документа],Согласование!$B10,Приложения[№ документа],Согласование!$C10,Приложения[Дата документа],Согласование!$D10,Приложения[№ договора],Согласование!$E10,Приложения[Компания],Согласование!$F10,Приложения[Дата начала договора],Согласование!$G10)=1,\"Представлен\",IF(COUNTIFS(Приложения[Вид документа],Согласование!$B10,Приложения[№ документа],Согласование!$C10,Приложения[Дата документа],Согласование!$D10,Приложения[№ договора],Согласование!$E10,Приложения[Компания],Согласование!$F10,Приложения[Дата начала договора],Согласование!$G10)=0,\"В работе\",\"Проверить\")))","v":"В работе"},{"$f":"IF(B10=\"\",\"\",IF(COUNTIF(Приложения[№ Согласование],Согласование!$H10)=0,\"В работе\",IF(COUNTIF(Приложения[№ Согласование],Согласование!$H10)=1,\"Представлен\",\"Срочно проверить\")))","v":"В работе"}]
{"$rows_left_out":37}