{"text_format":"1","workbook":"xlsx","n_sheets":3,"sheets":["2022","DBN","PD"],"not_rendered":{"charts":0,"images":0,"macros":1,"external_links":0,"defined_names":4,"comments":0,"pivot_tables":0},"unopened":[],"bounds":{"document_bytes":16777216,"sheet_cells":100000,"rows_first":2000,"rows_last":500,"rows_between":2000,"halvings":0,"cell_chars":16384,"cell_head_chars":4096},"cells_cut":0,"cells_raw":0,"read":"whole","date_system":"1900"}

{"sheet":"2022","index":0,"n_rows":69,"n_cols":11,"rows_kept":69,"cut":false,"hidden":false,"merged":[]}
["№ п/п","ФИО","Фамилия ИО (Eng)","ФИО (Eng)","Должность","№ \nDBN (ПУУМ)","№ \nPD (ОД)","DBN (ПУУМ)","PD (ОД)","Начало срока действия","Ставка"]
[{"$f":"SUBTOTAL(103,B$2:B2)","v":1},"Игольников Юрий Александрович",{"$f":"Translit('2022'!$B2)","v":"Igolnikov Yuriy Aleksandrovich"},{"$f":"IFERROR(MID('2022'!$C2,1,SEARCH(\" \",'2022'!$C2,1)+1-2)& \" \" &MID('2022'!$C2,SEARCH(\" \",'2022'!$C2,1)+1,1)& \".\" &MID('2022'!$C2,SEARCH(\" \",'2022'!$C2,SEARCH(\" \",'2022'!$C2,1)+1)+1,1)&\".\",\"\")","v":"Igolnikov Y.A."},"Менеджер проекта / Project Manager",30,null,{"$f":"IF(Таблица2[[#This Row],[№ \nDBN (ПУУМ)]]=\"\",\"\",HYPERLINK(\"#DBN!H1\",_xlfn.CONCAT(\"DBN_№\",Таблица2[[#This Row],[№ \nDBN (ПУУМ)]],\"_\",'2022'!$D2)))","v":"DBN_№30_Igolnikov Y.A."},{"$f":"IF(Таблица2[[#This Row],[№ \nPD (ОД)]]=\"\",\"\",HYPERLINK(\"#PD!H1\",_xlfn.CONCAT(\"PD_№\",'2022'!$G2,\"_\",'2022'!$D2)))","v":""},"2021-12-16",1405]
[{"$f":"SUBTOTAL(103,B$2:B3)","v":2},"Кочетков Михаил Витальевич",{"$f":"Translit('2022'!$B3)","v":"Kochetkov Mikhail Vitalevich"},{"$f":"IFERROR(MID('2022'!$C3,1,SEARCH(\" \",'2022'!$C3,1)+1-2)& \" \" &MID('2022'!$C3,SEARCH(\" \",'2022'!$C3,1)+1,1)& \".\" &MID('2022'!$C3,SEARCH(\" \",'2022'!$C3,SEARCH(\" \",'2022'!$C3,1)+1)+1,1)&\".\",\"\")","v":"Kochetkov M.V."},"Менеджер проекта / Project Manager",19,19,{"$f":"IF(Таблица2[[#This Row],[№ \nDBN (ПУУМ)]]=\"\",\"\",HYPERLINK(\"#DBN!H1\",_xlfn.CONCAT(\"DBN_№\",Таблица2[[#This Row],[№ \nDBN (ПУУМ)]],\"_\",'2022'!$D3)))","v":"DBN_№19_Kochetkov M.V."},{"$f":"IF(Таблица2[[#This Row],[№ \nPD (ОД)]]=\"\",\"\",HYPERLINK(\"#PD!H1\",_xlfn.CONCAT(\"PD_№\",'2022'!$G3,\"_\",'2022'!$D3)))","v":"PD_№19_Kochetkov M.V."},"2021-12-16",1405]
[{"$f":"SUBTOTAL(103,B$2:B4)","v":3},"Яшинский Сергей Алексеевич",{"$f":"Translit('2022'!$B4)","v":"Yashinskiy Sergey Alekseevich"},{"$f":"IFERROR(MID('2022'!$C4,1,SEARCH(\" \",'2022'!$C4,1)+1-2)& \" \" &MID('2022'!$C4,SEARCH(\" \",'2022'!$C4,1)+1,1)& \".\" &MID('2022'!$C4,SEARCH(\" \",'2022'!$C4,SEARCH(\" \",'2022'!$C4,1)+1)+1,1)&\".\",\"\")","v":"Yashinskiy S.A."},"Инспектор строительного контроля / Construction Supervision Inspector",22,22,{"$f":"IF(Таблица2[[#This Row],[№ \nDBN (ПУУМ)]]=\"\",\"\",HYPERLINK(\"#DBN!H1\",_xlfn.CONCAT(\"DBN_№\",Таблица2[[#This Row],[№ \nDBN (ПУУМ)]],\"_\",'2022'!$D4)))","v":"DBN_№22_Yashinskiy S.A."},{"$f":"IF(Таблица2[[#This Row],[№ \nPD (ОД)]]=\"\",\"\",HYPERLINK(\"#PD!H1\",_xlfn.CONCAT(\"PD_№\",'2022'!$G4,\"_\",'2022'!$D4)))","v":"PD_№22_Yashinskiy S.A."},"2022-02-17",1078]
[{"$f":"SUBTOTAL(103,B$2:B5)","v":4},"Иксаев Александр Юрьевич",{"$f":"Translit('2022'!$B5)","v":"Iksaev Aleksandr Yurevich"},{"$f":"IFERROR(MID('2022'!$C5,1,SEARCH(\" \",'2022'!$C5,1)+1-2)& \" \" &MID('2022'!$C5,SEARCH(\" \",'2022'!$C5,1)+1,1)& \".\" &MID('2022'!$C5,SEARCH(\" \",'2022'!$C5,SEARCH(\" \",'2022'!$C5,1)+1)+1,1)&\".\",\"\")","v":"Iksaev A.Y."},"Старший строительный инспектор / Senior construction inspector ",3,null,{"$f":"IF(Таблица2[[#This Row],[№ \nDBN (ПУУМ)]]=\"\",\"\",HYPERLINK(\"#DBN!H1\",_xlfn.CONCAT(\"DBN_№\",Таблица2[[#This Row],[№ \nDBN (ПУУМ)]],\"_\",'2022'!$D5)))","v":"DBN_№3_Iksaev A.Y."},{"$f":"IF(Таблица2[[#This Row],[№ \nPD (ОД)]]=\"\",\"\",HYPERLINK(\"#PD!H1\",_xlfn.CONCAT(\"PD_№\",'2022'!$G5,\"_\",'2022'!$D5)))","v":""},"2021-12-16",1229]
[{"$f":"SUBTOTAL(103,B$2:B6)","v":5},"Моташков Алексей Евгеньевич",{"$f":"Translit('2022'!$B6)","v":"Motashkov Aleksey Evgenevich"},{"$f":"IFERROR(MID('2022'!$C6,1,SEARCH(\" \",'2022'!$C6,1)+1-2)& \" \" &MID('2022'!$C6,SEARCH(\" \",'2022'!$C6,1)+1,1)& \".\" &MID('2022'!$C6,SEARCH(\" \",'2022'!$C6,SEARCH(\" \",'2022'!$C6,1)+1)+1,1)&\".\",\"\")","v":"Motashkov A.E."},"Старший строительный инспектор / Senior construction inspector ",29,null,{"$f":"IF(Таблица2[[#This Row],[№ \nDBN (ПУУМ)]]=\"\",\"\",HYPERLINK(\"#DBN!H1\",_xlfn.CONCAT(\"DBN_№\",Таблица2[[#This Row],[№ \nDBN (ПУУМ)]],\"_\",'2022'!$D6)))","v":"DBN_№29_Motashkov A.E."},{"$f":"IF(Таблица2[[#This Row],[№ \nPD (ОД)]]=\"\",\"\",HYPERLINK(\"#PD!H1\",_xlfn.CONCAT(\"PD_№\",'2022'!$G6,\"_\",'2022'!$D6)))","v":""},"2021-12-16",1229]
[{"$f":"SUBTOTAL(103,B$2:B7)","v":6},"Пугач Игорь Михайлович",{"$f":"Translit('2022'!$B7)","v":"Pugach Igor Mikhaylovich"},{"$f":"IFERROR(MID('2022'!$C7,1,SEARCH(\" \",'2022'!$C7,1)+1-2)& \" \" &MID('2022'!$C7,SEARCH(\" \",'2022'!$C7,1)+1,1)& \".\" &MID('2022'!$C7,SEARCH(\" \",'2022'!$C7,SEARCH(\" \",'2022'!$C7,1)+1)+1,1)&\".\",\"\")","v":"Pugach I.M."},"Старший строительный инспектор / Senior construction inspector ",41,40,{"$f":"IF(Таблица2[[#This Row],[№ \nDBN (ПУУМ)]]=\"\",\"\",HYPERLINK(\"#DBN!H1\",_xlfn.CONCAT(\"DBN_№\",Таблица2[[#This Row],[№ \nDBN (ПУУМ)]],\"_\",'2022'!$D7)))","v":"DBN_№41_Pugach I.M."},{"$f":"IF(Таблица2[[#This Row],[№ \nPD (ОД)]]=\"\",\"\",HYPERLINK(\"#PD!H1\",_xlfn.CONCAT(\"PD_№\",'2022'!$G7,\"_\",'2022'!$D7)))","v":"PD_№40_Pugach I.M."},"2022-05-25",1229]
[{"$f":"SUBTOTAL(103,B$2:B8)","v":7},"Ганжа Олег Владимирович",{"$f":"Translit('2022'!$B8)","v":"Ganzha Oleg Vladimirovich"},{"$f":"IFERROR(MID('2022'!$C8,1,SEARCH(\" \",'2022'!$C8,1)+1-2)& \" \" &MID('2022'!$C8,SEARCH(\" \",'2022'!$C8,1)+1,1)& \".\" &MID('2022'!$C8,SEARCH(\" \",'2022'!$C8,SEARCH(\" \",'2022'!$C8,1)+1)+1,1)&\".\",\"\")","v":"Ganzha O.V."},"Старший строительный инспектор / Senior construction inspector ",34,null,{"$f":"IF(Таблица2[[#This Row],[№ \nDBN (ПУУМ)]]=\"\",\"\",HYPERLINK(\"#DBN!H1\",_xlfn.CONCAT(\"DBN_№\",Таблица2[[#This Row],[№ \nDBN (ПУУМ)]],\"_\",'2022'!$D8)))","v":"DBN_№34_Ganzha O.V."},{"$f":"IF(Таблица2[[#This Row],[№ \nPD (ОД)]]=\"\",\"\",HYPERLINK(\"#PD!H1\",_xlfn.CONCAT(\"PD_№\",'2022'!$G8,\"_\",'2022'!$D8)))","v":""},"2021-12-16",1229]
[{"$f":"SUBTOTAL(103,B$2:B9)","v":8},"Моташков Алексей Евгеньевич",{"$f":"Translit('2022'!$B9)","v":"Motashkov Aleksey Evgenevich"},{"$f":"IFERROR(MID('2022'!$C9,1,SEARCH(\" \",'2022'!$C9,1)+1-2)& \" \" &MID('2022'!$C9,SEARCH(\" \",'2022'!$C9,1)+1,1)& \".\" &MID('2022'!$C9,SEARCH(\" \",'2022'!$C9,SEARCH(\" \",'2022'!$C9,1)+1)+1,1)&\".\",\"\")","v":"Motashkov A.E."},"Инспектор строительного контроля / Construction Supervision Inspector",69,34,{"$f":"IF(Таблица2[[#This Row],[№ \nDBN (ПУУМ)]]=\"\",\"\",HYPERLINK(\"#DBN!H1\",_xlfn.CONCAT(\"DBN_№\",Таблица2[[#This Row],[№ \nDBN (ПУУМ)]],\"_\",'2022'!$D9)))","v":"DBN_№69_Motashkov A.E."},{"$f":"IF(Таблица2[[#This Row],[№ \nPD (ОД)]]=\"\",\"\",HYPERLINK(\"#PD!H1\",_xlfn.CONCAT(\"PD_№\",'2022'!$G9,\"_\",'2022'!$D9)))","v":"PD_№34_Motashkov A.E."},"2021-12-16",1078]
[{"$f":"SUBTOTAL(103,B$2:B10)","v":9},"Почанин Андрей Юрьевич",{"$f":"Translit('2022'!$B10)","v":"Pochanin Andrey Yurevich"},{"$f":"IFERROR(MID('2022'!$C10,1,SEARCH(\" \",'2022'!$C10,1)+1-2)& \" \" &MID('2022'!$C10,SEARCH(\" \",'2022'!$C10,1)+1,1)& \".\" &MID('2022'!$C10,SEARCH(\" \",'2022'!$C10,SEARCH(\" \",'2022'!$C10,1)+1)+1,1)&\".\",\"\")","v":"Pochanin A.Y."},"Инспектор строительного контроля / Construction Supervision Inspector",106,68,{"$f":"IF(Таблица2[[#This Row],[№ \nDBN (ПУУМ)]]=\"\",\"\",HYPERLINK(\"#DBN!H1\",_xlfn.CONCAT(\"DBN_№\",Таблица2[[#This Row],[№ \nDBN (ПУУМ)]],\"_\",'2022'!$D10)))","v":"DBN_№106_Pochanin A.Y."},{"$f":"IF(Таблица2[[#This Row],[№ \nPD (ОД)]]=\"\",\"\",HYPERLINK(\"#PD!H1\",_xlfn.CONCAT(\"PD_№\",'2022'!$G10,\"_\",'2022'!$D10)))","v":"PD_№68_Pochanin A.Y."},"2021-12-16",1078]
[{"$f":"SUBTOTAL(103,B$2:B11)","v":10},"Шалагин Евгений Александрович",{"$f":"Translit('2022'!$B11)","v":"Shalagin Evgeniy Aleksandrovich"},{"$f":"IFERROR(MID('2022'!$C11,1,SEARCH(\" \",'2022'!$C11,1)+1-2)& \" \" &MID('2022'!$C11,SEARCH(\" \",'2022'!$C11,1)+1,1)& \".\" &MID('2022'!$C11,SEARCH(\" \",'2022'!$C11,SEARCH(\" \",'2022'!$C11,1)+1)+1,1)&\".\",\"\")","v":"Shalagin E.A."},"Инспектор строительного контроля / Construction Supervision Inspector",28,null,{"$f":"IF(Таблица2[[#This Row],[№ \nDBN (ПУУМ)]]=\"\",\"\",HYPERLINK(\"#DBN!H1\",_xlfn.CONCAT(\"DBN_№\",Таблица2[[#This Row],[№ \nDBN (ПУУМ)]],\"_\",'2022'!$D11)))","v":"DBN_№28_Shalagin E.A."},{"$f":"IF(Таблица2[[#This Row],[№ \nPD (ОД)]]=\"\",\"\",HYPERLINK(\"#PD!H1\",_xlfn.CONCAT(\"PD_№\",'2022'!$G11,\"_\",'2022'!$D11)))","v":""},"2021-12-16",1078]
[{"$f":"SUBTOTAL(103,B$2:B12)","v":11},"Шамро Алексей Владимирович",{"$f":"Translit('2022'!$B12)","v":"Shamro Aleksey Vladimirovich"},{"$f":"IFERROR(MID('2022'!$C12,1,SEARCH(\" \",'2022'!$C12,1)+1-2)& \" \" &MID('2022'!$C12,SEARCH(\" \",'2022'!$C12,1)+1,1)& \".\" &MID('2022'!$C12,SEARCH(\" \",'2022'!$C12,SEARCH(\" \",'2022'!$C12,1)+1)+1,1)&\".\",\"\")","v":"Shamro A.V."},"Инспектор строительного контроля / Construction Supervision Inspector",null,65,{"$f":"IF(Таблица2[[#This Row],[№ \nDBN (ПУУМ)]]=\"\",\"\",HYPERLINK(\"#DBN!H1\",_xlfn.CONCAT(\"DBN_№\",Таблица2[[#This Row],[№ \nDBN (ПУУМ)]],\"_\",'2022'!$D12)))","v":""},{"$f":"IF(Таблица2[[#This Row],[№ \nPD (ОД)]]=\"\",\"\",HYPERLINK(\"#PD!H1\",_xlfn.CONCAT(\"PD_№\",'2022'!$G12,\"_\",'2022'!$D12)))","v":"PD_№65_Shamro A.V."},"2021-12-16",1078]
[{"$f":"SUBTOTAL(103,B$2:B13)","v":12},"Шевченко Роман Александрович",{"$f":"Translit('2022'!$B13)","v":"Shevchenko Roman Aleksandrovich"},{"$f":"IFERROR(MID('2022'!$C13,1,SEARCH(\" \",'2022'!$C13,1)+1-2)& \" \" &MID('2022'!$C13,SEARCH(\" \",'2022'!$C13,1)+1,1)& \".\" &MID('2022'!$C13,SEARCH(\" \",'2022'!$C13,SEARCH(\" \",'2022'!$C13,1)+1)+1,1)&\".\",\"\")","v":"Shevchenko R.A."},"Инспектор строительного контроля / Construction Supervision Inspector",60,null,{"$f":"IF(Таблица2[[#This Row],[№ \nDBN (ПУУМ)]]=\"\",\"\",HYPERLINK(\"#DBN!H1\",_xlfn.CONCAT(\"DBN_№\",Таблица2[[#This Row],[№ \nDBN (ПУУМ)]],\"_\",'2022'!$D13)))","v":"DBN_№60_Shevchenko R.A."},{"$f":"IF(Таблица2[[#This Row],[№ \nPD (ОД)]]=\"\",\"\",HYPERLINK(\"#PD!H1\",_xlfn.CONCAT(\"PD_№\",'2022'!$G13,\"_\",'2022'!$D13)))","v":""},"2021-12-16",1078]
[{"$f":"SUBTOTAL(103,B$2:B14)","v":13},"Сидоров Евгений Базырович",{"$f":"Translit('2022'!$B14)","v":"Sidorov Evgeniy Bazyrovich"},{"$f":"IFERROR(MID('2022'!$C14,1,SEARCH(\" \",'2022'!$C14,1)+1-2)& \" \" &MID('2022'!$C14,SEARCH(\" \",'2022'!$C14,1)+1,1)& \".\" &MID('2022'!$C14,SEARCH(\" \",'2022'!$C14,SEARCH(\" \",'2022'!$C14,1)+1)+1,1)&\".\",\"\")","v":"Sidorov E.B."},"Инспектор строительного контроля / Construction Supervision Inspector",null,28,{"$f":"IF(Таблица2[[#This Row],[№ \nDBN (ПУУМ)]]=\"\",\"\",HYPERLINK(\"#DBN!H1\",_xlfn.CONCAT(\"DBN_№\",Таблица2[[#This Row],[№ \nDBN (ПУУМ)]],\"_\",'2022'!$D14)))","v":""},{"$f":"IF(Таблица2[[#This Row],[№ \nPD (ОД)]]=\"\",\"\",HYPERLINK(\"#PD!H1\",_xlfn.CONCAT(\"PD_№\",'2022'!$G14,\"_\",'2022'!$D14)))","v":"PD_№28_Sidorov E.B."},"2021-12-16",1078]
[{"$f":"SUBTOTAL(103,B$2:B15)","v":14},"Аглутдинов Сагит Габднурович",{"$f":"Translit('2022'!$B15)","v":"Aglutdinov Sagit Gabdnurovich"},{"$f":"IFERROR(MID('2022'!$C15,1,SEARCH(\" \",'2022'!$C15,1)+1-2)& \" \" &MID('2022'!$C15,SEARCH(\" \",'2022'!$C15,1)+1,1)& \".\" &MID('2022'!$C15,SEARCH(\" \",'2022'!$C15,SEARCH(\" \",'2022'!$C15,1)+1)+1,1)&\".\",\"\")","v":"Aglutdinov S.G."},"Инспектор строительного контроля / Construction Supervision Inspector",18,18,{"$f":"IF(Таблица2[[#This Row],[№ \nDBN (ПУУМ)]]=\"\",\"\",HYPERLINK(\"#DBN!H1\",_xlfn.CONCAT(\"DBN_№\",Таблица2[[#This Row],[№ \nDBN (ПУУМ)]],\"_\",'2022'!$D15)))","v":"DBN_№18_Aglutdinov S.G."},{"$f":"IF(Таблица2[[#This Row],[№ \nPD (ОД)]]=\"\",\"\",HYPERLINK(\"#PD!H1\",_xlfn.CONCAT(\"PD_№\",'2022'!$G15,\"_\",'2022'!$D15)))","v":"PD_№18_Aglutdinov S.G."},"2021-12-16",1078]
[{"$f":"SUBTOTAL(103,B$2:B16)","v":15},"Зильберман Олег Юрьевич",{"$f":"Translit('2022'!$B16)","v":"Zilberman Oleg Yurevich"},{"$f":"IFERROR(MID('2022'!$C16,1,SEARCH(\" \",'2022'!$C16,1)+1-2)& \" \" &MID('2022'!$C16,SEARCH(\" \",'2022'!$C16,1)+1,1)& \".\" &MID('2022'!$C16,SEARCH(\" \",'2022'!$C16,SEARCH(\" \",'2022'!$C16,1)+1)+1,1)&\".\",\"\")","v":"Zilberman O.Y."},"Инспектор строительного контроля / Construction Supervision Inspector",16,16,{"$f":"IF(Таблица2[[#This Row],[№ \nDBN (ПУУМ)]]=\"\",\"\",HYPERLINK(\"#DBN!H1\",_xlfn.CONCAT(\"DBN_№\",Таблица2[[#This Row],[№ \nDBN (ПУУМ)]],\"_\",'2022'!$D16)))","v":"DBN_№16_Zilberman O.Y."},{"$f":"IF(Таблица2[[#This Row],[№ \nPD (ОД)]]=\"\",\"\",HYPERLINK(\"#PD!H1\",_xlfn.CONCAT(\"PD_№\",'2022'!$G16,\"_\",'2022'!$D16)))","v":"PD_№16_Zilberman O.Y."},"2021-12-16",1078]
[{"$f":"SUBTOTAL(103,B$2:B17)","v":16},"Келлер Андрей Вольдемарович",{"$f":"Translit('2022'!$B17)","v":"Keller Andrey Voldemarovich"},{"$f":"IFERROR(MID('2022'!$C17,1,SEARCH(\" \",'2022'!$C17,1)+1-2)& \" \" &MID('2022'!$C17,SEARCH(\" \",'2022'!$C17,1)+1,1)& \".\" &MID('2022'!$C17,SEARCH(\" \",'2022'!$C17,SEARCH(\" \",'2022'!$C17,1)+1)+1,1)&\".\",\"\")","v":"Keller A.V."},"Инспектор строительного контроля / Construction Supervision Inspector",8,8,{"$f":"IF(Таблица2[[#This Row],[№ \nDBN (ПУУМ)]]=\"\",\"\",HYPERLINK(\"#DBN!H1\",_xlfn.CONCAT(\"DBN_№\",Таблица2[[#This Row],[№ \nDBN (ПУУМ)]],\"_\",'2022'!$D17)))","v":"DBN_№8_Keller A.V."},{"$f":"IF(Таблица2[[#This Row],[№ \nPD (ОД)]]=\"\",\"\",HYPERLINK(\"#PD!H1\",_xlfn.CONCAT(\"PD_№\",'2022'!$G17,\"_\",'2022'!$D17)))","v":"PD_№8_Keller A.V."},"2021-12-16",1078]
[{"$f":"SUBTOTAL(103,B$2:B18)","v":17},"Кочубей Константин Викторович",{"$f":"Translit('2022'!$B18)","v":"Kochubey Konstantin Viktorovich"},{"$f":"IFERROR(MID('2022'!$C18,1,SEARCH(\" \",'2022'!$C18,1)+1-2)& \" \" &MID('2022'!$C18,SEARCH(\" \",'2022'!$C18,1)+1,1)& \".\" &MID('2022'!$C18,SEARCH(\" \",'2022'!$C18,SEARCH(\" \",'2022'!$C18,1)+1)+1,1)&\".\",\"\")","v":"Kochubey K.V."},"Инспектор строительного контроля / Construction Supervision Inspector",25,25,{"$f":"IF(Таблица2[[#This Row],[№ \nDBN (ПУУМ)]]=\"\",\"\",HYPERLINK(\"#DBN!H1\",_xlfn.CONCAT(\"DBN_№\",Таблица2[[#This Row],[№ \nDBN (ПУУМ)]],\"_\",'2022'!$D18)))","v":"DBN_№25_Kochubey K.V."},{"$f":"IF(Таблица2[[#This Row],[№ \nPD (ОД)]]=\"\",\"\",HYPERLINK(\"#PD!H1\",_xlfn.CONCAT(\"PD_№\",'2022'!$G18,\"_\",'2022'!$D18)))","v":"PD_№25_Kochubey K.V."},"2021-12-16",1078]
[{"$f":"SUBTOTAL(103,B$2:B19)","v":18},"Крикунов Андрей Константинович",{"$f":"Translit('2022'!$B19)","v":"Krikunov Andrey Konstantinovich"},{"$f":"IFERROR(MID('2022'!$C19,1,SEARCH(\" \",'2022'!$C19,1)+1-2)& \" \" &MID('2022'!$C19,SEARCH(\" \",'2022'!$C19,1)+1,1)& \".\" &MID('2022'!$C19,SEARCH(\" \",'2022'!$C19,SEARCH(\" \",'2022'!$C19,1)+1)+1,1)&\".\",\"\")","v":"Krikunov A.K."},"Инспектор строительного контроля / Construction Supervision Inspector",9,9,{"$f":"IF(Таблица2[[#This Row],[№ \nDBN (ПУУМ)]]=\"\",\"\",HYPERLINK(\"#DBN!H1\",_xlfn.CONCAT(\"DBN_№\",Таблица2[[#This Row],[№ \nDBN (ПУУМ)]],\"_\",'2022'!$D19)))","v":"DBN_№9_Krikunov A.K."},{"$f":"IF(Таблица2[[#This Row],[№ \nPD (ОД)]]=\"\",\"\",HYPERLINK(\"#PD!H1\",_xlfn.CONCAT(\"PD_№\",'2022'!$G19,\"_\",'2022'!$D19)))","v":"PD_№9_Krikunov A.K."},"2021-12-16",1078]
[{"$f":"SUBTOTAL(103,B$2:B20)","v":19},"Маматов Константин Викторович",{"$f":"Translit('2022'!$B20)","v":"Mamatov Konstantin Viktorovich"},{"$f":"IFERROR(MID('2022'!$C20,1,SEARCH(\" \",'2022'!$C20,1)+1-2)& \" \" &MID('2022'!$C20,SEARCH(\" \",'2022'!$C20,1)+1,1)& \".\" &MID('2022'!$C20,SEARCH(\" \",'2022'!$C20,SEARCH(\" \",'2022'!$C20,1)+1)+1,1)&\".\",\"\")","v":"Mamatov K.V."},"Инспектор строительного контроля / Construction Supervision Inspector",17,17,{"$f":"IF(Таблица2[[#This Row],[№ \nDBN (ПУУМ)]]=\"\",\"\",HYPERLINK(\"#DBN!H1\",_xlfn.CONCAT(\"DBN_№\",Таблица2[[#This Row],[№ \nDBN (ПУУМ)]],\"_\",'2022'!$D20)))","v":"DBN_№17_Mamatov K.V."},{"$f":"IF(Таблица2[[#This Row],[№ \nPD (ОД)]]=\"\",\"\",HYPERLINK(\"#PD!H1\",_xlfn.CONCAT(\"PD_№\",'2022'!$G20,\"_\",'2022'!$D20)))","v":"PD_№17_Mamatov K.V."},"2021-12-16",1078]
[{"$f":"SUBTOTAL(103,B$2:B21)","v":20},"Мишустин Дмитрий Алексеевич",{"$f":"Translit('2022'!$B21)","v":"Mishustin Dmitriy Alekseevich"},{"$f":"IFERROR(MID('2022'!$C21,1,SEARCH(\" \",'2022'!$C21,1)+1-2)& \" \" &MID('2022'!$C21,SEARCH(\" \",'2022'!$C21,1)+1,1)& \".\" &MID('2022'!$C21,SEARCH(\" \",'2022'!$C21,SEARCH(\" \",'2022'!$C21,1)+1)+1,1)&\".\",\"\")","v":"Mishustin D.A."},"Инспектор строительного контроля / Construction Supervision Inspector",14,14,{"$f":"IF(Таблица2[[#This Row],[№ \nDBN (ПУУМ)]]=\"\",\"\",HYPERLINK(\"#DBN!H1\",_xlfn.CONCAT(\"DBN_№\",Таблица2[[#This Row],[№ \nDBN (ПУУМ)]],\"_\",'2022'!$D21)))","v":"DBN_№14_Mishustin D.A."},{"$f":"IF(Таблица2[[#This Row],[№ \nPD (ОД)]]=\"\",\"\",HYPERLINK(\"#PD!H1\",_xlfn.CONCAT(\"PD_№\",'2022'!$G21,\"_\",'2022'!$D21)))","v":"PD_№14_Mishustin D.A."},"2021-12-16",1078]
[{"$f":"SUBTOTAL(103,B$2:B22)","v":21},"Неволин Анатолий Иванович",{"$f":"Translit('2022'!$B22)","v":"Nevolin Anatoliy Ivanovich"},{"$f":"IFERROR(MID('2022'!$C22,1,SEARCH(\" \",'2022'!$C22,1)+1-2)& \" \" &MID('2022'!$C22,SEARCH(\" \",'2022'!$C22,1)+1,1)& \".\" &MID('2022'!$C22,SEARCH(\" \",'2022'!$C22,SEARCH(\" \",'2022'!$C22,1)+1)+1,1)&\".\",\"\")","v":"Nevolin A.I."},"Инспектор строительного контроля / Construction Supervision Inspector",7,7,{"$f":"IF(Таблица2[[#This Row],[№ \nDBN (ПУУМ)]]=\"\",\"\",HYPERLINK(\"#DBN!H1\",_xlfn.CONCAT(\"DBN_№\",Таблица2[[#This Row],[№ \nDBN (ПУУМ)]],\"_\",'2022'!$D22)))","v":"DBN_№7_Nevolin A.I."},{"$f":"IF(Таблица2[[#This Row],[№ \nPD (ОД)]]=\"\",\"\",HYPERLINK(\"#PD!H1\",_xlfn.CONCAT(\"PD_№\",'2022'!$G22,\"_\",'2022'!$D22)))","v":"PD_№7_Nevolin A.I."},"2021-12-16",1078]
[{"$f":"SUBTOTAL(103,B$2:B23)","v":22},"Паульский Олег Иосифович",{"$f":"Translit('2022'!$B23)","v":"Paulskiy Oleg Iosifovich"},{"$f":"IFERROR(MID('2022'!$C23,1,SEARCH(\" \",'2022'!$C23,1)+1-2)& \" \" &MID('2022'!$C23,SEARCH(\" \",'2022'!$C23,1)+1,1)& \".\" &MID('2022'!$C23,SEARCH(\" \",'2022'!$C23,SEARCH(\" \",'2022'!$C23,1)+1)+1,1)&\".\",\"\")","v":"Paulskiy O.I."},"Инспектор строительного контроля / Construction Supervision Inspector",21,21,{"$f":"IF(Таблица2[[#This Row],[№ \nDBN (ПУУМ)]]=\"\",\"\",HYPERLINK(\"#DBN!H1\",_xlfn.CONCAT(\"DBN_№\",Таблица2[[#This Row],[№ \nDBN (ПУУМ)]],\"_\",'2022'!$D23)))","v":"DBN_№21_Paulskiy O.I."},{"$f":"IF(Таблица2[[#This Row],[№ \nPD (ОД)]]=\"\",\"\",HYPERLINK(\"#PD!H1\",_xlfn.CONCAT(\"PD_№\",'2022'!$G23,\"_\",'2022'!$D23)))","v":"PD_№21_Paulskiy O.I."},"2021-12-16",1078]
[{"$f":"SUBTOTAL(103,B$2:B24)","v":23},"Пашкин Андрей Георгиевич",{"$f":"Translit('2022'!$B24)","v":"Pashkin Andrey Georgievich"},{"$f":"IFERROR(MID('2022'!$C24,1,SEARCH(\" \",'2022'!$C24,1)+1-2)& \" \" &MID('2022'!$C24,SEARCH(\" \",'2022'!$C24,1)+1,1)& \".\" &MID('2022'!$C24,SEARCH(\" \",'2022'!$C24,SEARCH(\" \",'2022'!$C24,1)+1)+1,1)&\".\",\"\")","v":"Pashkin A.G."},"Инспектор строительного контроля / Construction Supervision Inspector",24,24,{"$f":"IF(Таблица2[[#This Row],[№ \nDBN (ПУУМ)]]=\"\",\"\",HYPERLINK(\"#DBN!H1\",_xlfn.CONCAT(\"DBN_№\",Таблица2[[#This Row],[№ \nDBN (ПУУМ)]],\"_\",'2022'!$D24)))","v":"DBN_№24_Pashkin A.G."},{"$f":"IF(Таблица2[[#This Row],[№ \nPD (ОД)]]=\"\",\"\",HYPERLINK(\"#PD!H1\",_xlfn.CONCAT(\"PD_№\",'2022'!$G24,\"_\",'2022'!$D24)))","v":"PD_№24_Pashkin A.G."},"2021-12-16",1078]
[{"$f":"SUBTOTAL(103,B$2:B25)","v":24},"Сесигин Роман Викторович",{"$f":"Translit('2022'!$B25)","v":"Sesigin Roman Viktorovich"},{"$f":"IFERROR(MID('2022'!$C25,1,SEARCH(\" \",'2022'!$C25,1)+1-2)& \" \" &MID('2022'!$C25,SEARCH(\" \",'2022'!$C25,1)+1,1)& \".\" &MID('2022'!$C25,SEARCH(\" \",'2022'!$C25,SEARCH(\" \",'2022'!$C25,1)+1)+1,1)&\".\",\"\")","v":"Sesigin R.V."},"Инспектор строительного контроля / Construction Supervision Inspector",11,11,{"$f":"IF(Таблица2[[#This Row],[№ \nDBN (ПУУМ)]]=\"\",\"\",HYPERLINK(\"#DBN!H1\",_xlfn.CONCAT(\"DBN_№\",Таблица2[[#This Row],[№ \nDBN (ПУУМ)]],\"_\",'2022'!$D25)))","v":"DBN_№11_Sesigin R.V."},{"$f":"IF(Таблица2[[#This Row],[№ \nPD (ОД)]]=\"\",\"\",HYPERLINK(\"#PD!H1\",_xlfn.CONCAT(\"PD_№\",'2022'!$G25,\"_\",'2022'!$D25)))","v":"PD_№11_Sesigin R.V."},"2021-12-16",1078]
[{"$f":"SUBTOTAL(103,B$2:B26)","v":25},"Филиппов Василий Евгеньевич               ",{"$f":"Translit('2022'!$B26)","v":"Filippov Vasiliy Evgenevich               "},{"$f":"IFERROR(MID('2022'!$C26,1,SEARCH(\" \",'2022'!$C26,1)+1-2)& \" \" &MID('2022'!$C26,SEARCH(\" \",'2022'!$C26,1)+1,1)& \".\" &MID('2022'!$C26,SEARCH(\" \",'2022'!$C26,SEARCH(\" \",'2022'!$C26,1)+1)+1,1)&\".\",\"\")","v":"Filippov V.E."},"Инспектор строительного контроля / Construction Supervision Inspector",13,13,{"$f":"IF(Таблица2[[#This Row],[№ \nDBN (ПУУМ)]]=\"\",\"\",HYPERLINK(\"#DBN!H1\",_xlfn.CONCAT(\"DBN_№\",Таблица2[[#This Row],[№ \nDBN (ПУУМ)]],\"_\",'2022'!$D26)))","v":"DBN_№13_Filippov V.E."},{"$f":"IF(Таблица2[[#This Row],[№ \nPD (ОД)]]=\"\",\"\",HYPERLINK(\"#PD!H1\",_xlfn.CONCAT(\"PD_№\",'2022'!$G26,\"_\",'2022'!$D26)))","v":"PD_№13_Filippov V.E."},"2021-12-16",1078]
[{"$f":"SUBTOTAL(103,B$2:B27)","v":26},"Ерёменко Алексей Владимирович",{"$f":"Translit('2022'!$B27)","v":"Eremenko Aleksey Vladimirovich"},{"$f":"IFERROR(MID('2022'!$C27,1,SEARCH(\" \",'2022'!$C27,1)+1-2)& \" \" &MID('2022'!$C27,SEARCH(\" \",'2022'!$C27,1)+1,1)& \".\" &MID('2022'!$C27,SEARCH(\" \",'2022'!$C27,SEARCH(\" \",'2022'!$C27,1)+1)+1,1)&\".\",\"\")","v":"Eremenko A.V."},"Инспектор строительного контроля / Construction Supervision Inspector",36,5,{"$f":"IF(Таблица2[[#This Row],[№ \nDBN (ПУУМ)]]=\"\",\"\",HYPERLINK(\"#DBN!H1\",_xlfn.CONCAT(\"DBN_№\",Таблица2[[#This Row],[№ \nDBN (ПУУМ)]],\"_\",'2022'!$D27)))","v":"DBN_№36_Eremenko A.V."},{"$f":"IF(Таблица2[[#This Row],[№ \nPD (ОД)]]=\"\",\"\",HYPERLINK(\"#PD!H1\",_xlfn.CONCAT(\"PD_№\",'2022'!$G27,\"_\",'2022'!$D27)))","v":"PD_№5_Eremenko A.V."},"2021-12-16",1078]
[{"$f":"SUBTOTAL(103,B$2:B28)","v":27},"Малюгин Тарас Витальевич",{"$f":"Translit('2022'!$B28)","v":"Malyugin Taras Vitalevich"},{"$f":"IFERROR(MID('2022'!$C28,1,SEARCH(\" \",'2022'!$C28,1)+1-2)& \" \" &MID('2022'!$C28,SEARCH(\" \",'2022'!$C28,1)+1,1)& \".\" &MID('2022'!$C28,SEARCH(\" \",'2022'!$C28,SEARCH(\" \",'2022'!$C28,1)+1)+1,1)&\".\",\"\")","v":"Malyugin T.V."},"Инспектор строительного контроля / Construction Supervision Inspector",56,41,{"$f":"IF(Таблица2[[#This Row],[№ \nDBN (ПУУМ)]]=\"\",\"\",HYPERLINK(\"#DBN!H1\",_xlfn.CONCAT(\"DBN_№\",Таблица2[[#This Row],[№ \nDBN (ПУУМ)]],\"_\",'2022'!$D28)))","v":"DBN_№56_Malyugin T.V."},{"$f":"IF(Таблица2[[#This Row],[№ \nPD (ОД)]]=\"\",\"\",HYPERLINK(\"#PD!H1\",_xlfn.CONCAT(\"PD_№\",'2022'!$G28,\"_\",'2022'!$D28)))","v":"PD_№41_Malyugin T.V."},"2021-12-16",1078]
[{"$f":"SUBTOTAL(103,B$2:B29)","v":28},"Куницын Станислав Игоревич",{"$f":"Translit('2022'!$B29)","v":"Kunitsyn Stanislav Igorevich"},{"$f":"IFERROR(MID('2022'!$C29,1,SEARCH(\" \",'2022'!$C29,1)+1-2)& \" \" &MID('2022'!$C29,SEARCH(\" \",'2022'!$C29,1)+1,1)& \".\" &MID('2022'!$C29,SEARCH(\" \",'2022'!$C29,SEARCH(\" \",'2022'!$C29,1)+1)+1,1)&\".\",\"\")","v":"Kunitsyn S.I."},"Инспектор строительного контроля / Construction Supervision Inspector",4,60,{"$f":"IF(Таблица2[[#This Row],[№ \nDBN (ПУУМ)]]=\"\",\"\",HYPERLINK(\"#DBN!H1\",_xlfn.CONCAT(\"DBN_№\",Таблица2[[#This Row],[№ \nDBN (ПУУМ)]],\"_\",'2022'!$D29)))","v":"DBN_№4_Kunitsyn S.I."},{"$f":"IF(Таблица2[[#This Row],[№ \nPD (ОД)]]=\"\",\"\",HYPERLINK(\"#PD!H1\",_xlfn.CONCAT(\"PD_№\",'2022'!$G29,\"_\",'2022'!$D29)))","v":"PD_№60_Kunitsyn S.I."},"2021-12-16",1078]
[{"$f":"SUBTOTAL(103,B$2:B30)","v":29},"Смирнов Сергей Всеволодович",{"$f":"Translit('2022'!$B30)","v":"Smirnov Sergey Vsevolodovich"},{"$f":"IFERROR(MID('2022'!$C30,1,SEARCH(\" \",'2022'!$C30,1)+1-2)& \" \" &MID('2022'!$C30,SEARCH(\" \",'2022'!$C30,1)+1,1)& \".\" &MID('2022'!$C30,SEARCH(\" \",'2022'!$C30,SEARCH(\" \",'2022'!$C30,1)+1)+1,1)&\".\",\"\")","v":"Smirnov S.V."},"Инспектор строительного контроля / Construction Supervision Inspector",35,26,{"$f":"IF(Таблица2[[#This Row],[№ \nDBN (ПУУМ)]]=\"\",\"\",HYPERLINK(\"#DBN!H1\",_xlfn.CONCAT(\"DBN_№\",Таблица2[[#This Row],[№ \nDBN (ПУУМ)]],\"_\",'2022'!$D30)))","v":"DBN_№35_Smirnov S.V."},{"$f":"IF(Таблица2[[#This Row],[№ \nPD (ОД)]]=\"\",\"\",HYPERLINK(\"#PD!H1\",_xlfn.CONCAT(\"PD_№\",'2022'!$G30,\"_\",'2022'!$D30)))","v":"PD_№26_Smirnov S.V."},"2021-12-16",1078]
[{"$f":"SUBTOTAL(103,B$2:B31)","v":30},"Руднев Андрей Васильевич",{"$f":"Translit('2022'!$B31)","v":"Rudnev Andrey Vasilevich"},{"$f":"IFERROR(MID('2022'!$C31,1,SEARCH(\" \",'2022'!$C31,1)+1-2)& \" \" &MID('2022'!$C31,SEARCH(\" \",'2022'!$C31,1)+1,1)& \".\" &MID('2022'!$C31,SEARCH(\" \",'2022'!$C31,SEARCH(\" \",'2022'!$C31,1)+1)+1,1)&\".\",\"\")","v":"Rudnev A.V."},"Инспектор строительного контроля / Construction Supervision Inspector",59,31,{"$f":"IF(Таблица2[[#This Row],[№ \nDBN (ПУУМ)]]=\"\",\"\",HYPERLINK(\"#DBN!H1\",_xlfn.CONCAT(\"DBN_№\",Таблица2[[#This Row],[№ \nDBN (ПУУМ)]],\"_\",'2022'!$D31)))","v":"DBN_№59_Rudnev A.V."},{"$f":"IF(Таблица2[[#This Row],[№ \nPD (ОД)]]=\"\",\"\",HYPERLINK(\"#PD!H1\",_xlfn.CONCAT(\"PD_№\",'2022'!$G31,\"_\",'2022'!$D31)))","v":"PD_№31_Rudnev A.V."},"2021-12-16",1078]
[{"$f":"SUBTOTAL(103,B$2:B32)","v":31},"Погадаев Дмитрий Валерьевич",{"$f":"Translit('2022'!$B32)","v":"Pogadaev Dmitriy Valerevich"},{"$f":"IFERROR(MID('2022'!$C32,1,SEARCH(\" \",'2022'!$C32,1)+1-2)& \" \" &MID('2022'!$C32,SEARCH(\" \",'2022'!$C32,1)+1,1)& \".\" &MID('2022'!$C32,SEARCH(\" \",'2022'!$C32,SEARCH(\" \",'2022'!$C32,1)+1)+1,1)&\".\",\"\")","v":"Pogadaev D.V."},"Инспектор строительного контроля / Construction Supervision Inspector",61,32,{"$f":"IF(Таблица2[[#This Row],[№ \nDBN (ПУУМ)]]=\"\",\"\",HYPERLINK(\"#DBN!H1\",_xlfn.CONCAT(\"DBN_№\",Таблица2[[#This Row],[№ \nDBN (ПУУМ)]],\"_\",'2022'!$D32)))","v":"DBN_№61_Pogadaev D.V."},{"$f":"IF(Таблица2[[#This Row],[№ \nPD (ОД)]]=\"\",\"\",HYPERLINK(\"#PD!H1\",_xlfn.CONCAT(\"PD_№\",'2022'!$G32,\"_\",'2022'!$D32)))","v":"PD_№32_Pogadaev D.V."},"2021-12-16",1078]
[{"$f":"SUBTOTAL(103,B$2:B33)","v":32},"Ганиев Азамат Илдусович",{"$f":"Translit('2022'!$B33)","v":"Ganiev Azamat Ildusovich"},{"$f":"IFERROR(MID('2022'!$C33,1,SEARCH(\" \",'2022'!$C33,1)+1-2)& \" \" &MID('2022'!$C33,SEARCH(\" \",'2022'!$C33,1)+1,1)& \".\" &MID('2022'!$C33,SEARCH(\" \",'2022'!$C33,SEARCH(\" \",'2022'!$C33,1)+1)+1,1)&\".\",\"\")","v":"Ganiev A.I."},"Инспектор строительного контроля / Construction Supervision Inspector",20,20,{"$f":"IF(Таблица2[[#This Row],[№ \nDBN (ПУУМ)]]=\"\",\"\",HYPERLINK(\"#DBN!H1\",_xlfn.CONCAT(\"DBN_№\",Таблица2[[#This Row],[№ \nDBN (ПУУМ)]],\"_\",'2022'!$D33)))","v":"DBN_№20_Ganiev A.I."},{"$f":"IF(Таблица2[[#This Row],[№ \nPD (ОД)]]=\"\",\"\",HYPERLINK(\"#PD!H1\",_xlfn.CONCAT(\"PD_№\",'2022'!$G33,\"_\",'2022'!$D33)))","v":"PD_№20_Ganiev A.I."},"2021-12-16",1078]
[{"$f":"SUBTOTAL(103,B$2:B34)","v":33},"Патока Михаил Анатольевич",{"$f":"Translit('2022'!$B34)","v":"Patoka Mikhail Anatolevich"},{"$f":"IFERROR(MID('2022'!$C34,1,SEARCH(\" \",'2022'!$C34,1)+1-2)& \" \" &MID('2022'!$C34,SEARCH(\" \",'2022'!$C34,1)+1,1)& \".\" &MID('2022'!$C34,SEARCH(\" \",'2022'!$C34,SEARCH(\" \",'2022'!$C34,1)+1)+1,1)&\".\",\"\")","v":"Patoka M.A."},"Инспектор строительного контроля / Construction Supervision Inspector",31,6,{"$f":"IF(Таблица2[[#This Row],[№ \nDBN (ПУУМ)]]=\"\",\"\",HYPERLINK(\"#DBN!H1\",_xlfn.CONCAT(\"DBN_№\",Таблица2[[#This Row],[№ \nDBN (ПУУМ)]],\"_\",'2022'!$D34)))","v":"DBN_№31_Patoka M.A."},{"$f":"IF(Таблица2[[#This Row],[№ \nPD (ОД)]]=\"\",\"\",HYPERLINK(\"#PD!H1\",_xlfn.CONCAT(\"PD_№\",'2022'!$G34,\"_\",'2022'!$D34)))","v":"PD_№6_Patoka M.A."},"2021-12-16",1078]
[{"$f":"SUBTOTAL(103,B$2:B35)","v":34},"Авдеев Сергей Михайлович",{"$f":"Translit('2022'!$B35)","v":"Avdeev Sergey Mikhaylovich"},{"$f":"IFERROR(MID('2022'!$C35,1,SEARCH(\" \",'2022'!$C35,1)+1-2)& \" \" &MID('2022'!$C35,SEARCH(\" \",'2022'!$C35,1)+1,1)& \".\" &MID('2022'!$C35,SEARCH(\" \",'2022'!$C35,SEARCH(\" \",'2022'!$C35,1)+1)+1,1)&\".\",\"\")","v":"Avdeev S.M."},"Инспектор строительного контроля / Construction Supervision Inspector",null,null,{"$f":"IF(Таблица2[[#This Row],[№ \nDBN (ПУУМ)]]=\"\",\"\",HYPERLINK(\"#DBN!H1\",_xlfn.CONCAT(\"DBN_№\",Таблица2[[#This Row],[№ \nDBN (ПУУМ)]],\"_\",'2022'!$D35)))","v":""},{"$f":"IF(Таблица2[[#This Row],[№ \nPD (ОД)]]=\"\",\"\",HYPERLINK(\"#PD!H1\",_xlfn.CONCAT(\"PD_№\",'2022'!$G35,\"_\",'2022'!$D35)))","v":""},"2021-12-16",1078]
[{"$f":"SUBTOTAL(103,B$2:B36)","v":35},"Копылов Григорий Владимирович",{"$f":"Translit('2022'!$B36)","v":"Kopylov Grigoriy Vladimirovich"},{"$f":"IFERROR(MID('2022'!$C36,1,SEARCH(\" \",'2022'!$C36,1)+1-2)& \" \" &MID('2022'!$C36,SEARCH(\" \",'2022'!$C36,1)+1,1)& \".\" &MID('2022'!$C36,SEARCH(\" \",'2022'!$C36,SEARCH(\" \",'2022'!$C36,1)+1)+1,1)&\".\",\"\")","v":"Kopylov G.V."},"Инспектор строительного контроля / Construction Supervision Inspector",null,36,{"$f":"IF(Таблица2[[#This Row],[№ \nDBN (ПУУМ)]]=\"\",\"\",HYPERLINK(\"#DBN!H1\",_xlfn.CONCAT(\"DBN_№\",Таблица2[[#This Row],[№ \nDBN (ПУУМ)]],\"_\",'2022'!$D36)))","v":""},{"$f":"IF(Таблица2[[#This Row],[№ \nPD (ОД)]]=\"\",\"\",HYPERLINK(\"#PD!H1\",_xlfn.CONCAT(\"PD_№\",'2022'!$G36,\"_\",'2022'!$D36)))","v":"PD_№36_Kopylov G.V."},"2021-12-16",1078]
[{"$f":"SUBTOTAL(103,B$2:B37)","v":36},"Богородицкий Михаил Андреевич",{"$f":"Translit('2022'!$B37)","v":"Bogoroditskiy Mikhail Andreevich"},{"$f":"IFERROR(MID('2022'!$C37,1,SEARCH(\" \",'2022'!$C37,1)+1-2)& \" \" &MID('2022'!$C37,SEARCH(\" \",'2022'!$C37,1)+1,1)& \".\" &MID('2022'!$C37,SEARCH(\" \",'2022'!$C37,SEARCH(\" \",'2022'!$C37,1)+1)+1,1)&\".\",\"\")","v":"Bogoroditskiy M.A."},"Инспектор строительного контроля / Construction Supervision Inspector",77,39,{"$f":"IF(Таблица2[[#This Row],[№ \nDBN (ПУУМ)]]=\"\",\"\",HYPERLINK(\"#DBN!H1\",_xlfn.CONCAT(\"DBN_№\",Таблица2[[#This Row],[№ \nDBN (ПУУМ)]],\"_\",'2022'!$D37)))","v":"DBN_№77_Bogoroditskiy M.A."},{"$f":"IF(Таблица2[[#This Row],[№ \nPD (ОД)]]=\"\",\"\",HYPERLINK(\"#PD!H1\",_xlfn.CONCAT(\"PD_№\",'2022'!$G37,\"_\",'2022'!$D37)))","v":"PD_№39_Bogoroditskiy M.A."},"2021-12-16",1078]
[{"$f":"SUBTOTAL(103,B$2:B38)","v":37},"Власов Сергей Васильевич",{"$f":"Translit('2022'!$B38)","v":"Vlasov Sergey Vasilevich"},{"$f":"IFERROR(MID('2022'!$C38,1,SEARCH(\" \",'2022'!$C38,1)+1-2)& \" \" &MID('2022'!$C38,SEARCH(\" \",'2022'!$C38,1)+1,1)& \".\" &MID('2022'!$C38,SEARCH(\" \",'2022'!$C38,SEARCH(\" \",'2022'!$C38,1)+1)+1,1)&\".\",\"\")","v":"Vlasov S.V."},"Инспектор строительного контроля / Construction Supervision Inspector",86,51,{"$f":"IF(Таблица2[[#This Row],[№ \nDBN (ПУУМ)]]=\"\",\"\",HYPERLINK(\"#DBN!H1\",_xlfn.CONCAT(\"DBN_№\",Таблица2[[#This Row],[№ \nDBN (ПУУМ)]],\"_\",'2022'!$D38)))","v":"DBN_№86_Vlasov S.V."},{"$f":"IF(Таблица2[[#This Row],[№ \nPD (ОД)]]=\"\",\"\",HYPERLINK(\"#PD!H1\",_xlfn.CONCAT(\"PD_№\",'2022'!$G38,\"_\",'2022'!$D38)))","v":"PD_№51_Vlasov S.V."},"2021-12-16",1078]
[{"$f":"SUBTOTAL(103,B$2:B39)","v":38},"Кашникова Мария Юрьевна",{"$f":"Translit('2022'!$B39)","v":"Kashnikova Mariya Yurevna"},{"$f":"IFERROR(MID('2022'!$C39,1,SEARCH(\" \",'2022'!$C39,1)+1-2)& \" \" &MID('2022'!$C39,SEARCH(\" \",'2022'!$C39,1)+1,1)& \".\" &MID('2022'!$C39,SEARCH(\" \",'2022'!$C39,SEARCH(\" \",'2022'!$C39,1)+1)+1,1)&\".\",\"\")","v":"Kashnikova M.Y."},"Инспектор строительного контроля / Construction Supervision Inspector",85,50,{"$f":"IF(Таблица2[[#This Row],[№ \nDBN (ПУУМ)]]=\"\",\"\",HYPERLINK(\"#DBN!H1\",_xlfn.CONCAT(\"DBN_№\",Таблица2[[#This Row],[№ \nDBN (ПУУМ)]],\"_\",'2022'!$D39)))","v":"DBN_№85_Kashnikova M.Y."},{"$f":"IF(Таблица2[[#This Row],[№ \nPD (ОД)]]=\"\",\"\",HYPERLINK(\"#PD!H1\",_xlfn.CONCAT(\"PD_№\",'2022'!$G39,\"_\",'2022'!$D39)))","v":"PD_№50_Kashnikova M.Y."},"2021-12-16",1078]
[{"$f":"SUBTOTAL(103,B$2:B40)","v":39},"Панжин Алексей Фёдорович",{"$f":"Translit('2022'!$B40)","v":"Panzhin Aleksey Fedorovich"},{"$f":"IFERROR(MID('2022'!$C40,1,SEARCH(\" \",'2022'!$C40,1)+1-2)& \" \" &MID('2022'!$C40,SEARCH(\" \",'2022'!$C40,1)+1,1)& \".\" &MID('2022'!$C40,SEARCH(\" \",'2022'!$C40,SEARCH(\" \",'2022'!$C40,1)+1)+1,1)&\".\",\"\")","v":"Panzhin A.F."},"Инспектор строительного контроля / Construction Supervision Inspector",null,53,{"$f":"IF(Таблица2[[#This Row],[№ \nDBN (ПУУМ)]]=\"\",\"\",HYPERLINK(\"#DBN!H1\",_xlfn.CONCAT(\"DBN_№\",Таблица2[[#This Row],[№ \nDBN (ПУУМ)]],\"_\",'2022'!$D40)))","v":""},{"$f":"IF(Таблица2[[#This Row],[№ \nPD (ОД)]]=\"\",\"\",HYPERLINK(\"#PD!H1\",_xlfn.CONCAT(\"PD_№\",'2022'!$G40,\"_\",'2022'!$D40)))","v":"PD_№53_Panzhin A.F."},"2021-12-16",1078]
[{"$f":"SUBTOTAL(103,B$2:B41)","v":40},"Гадыльшин Тимур Айратович",{"$f":"Translit('2022'!$B41)","v":"Gadylshin Timur Ayratovich"},{"$f":"IFERROR(MID('2022'!$C41,1,SEARCH(\" \",'2022'!$C41,1)+1-2)& \" \" &MID('2022'!$C41,SEARCH(\" \",'2022'!$C41,1)+1,1)& \".\" &MID('2022'!$C41,SEARCH(\" \",'2022'!$C41,SEARCH(\" \",'2022'!$C41,1)+1)+1,1)&\".\",\"\")","v":"Gadylshin T.A."},"Инспектор строительного контроля / Construction Supervision Inspector",88,54,{"$f":"IF(Таблица2[[#This Row],[№ \nDBN (ПУУМ)]]=\"\",\"\",HYPERLINK(\"#DBN!H1\",_xlfn.CONCAT(\"DBN_№\",Таблица2[[#This Row],[№ \nDBN (ПУУМ)]],\"_\",'2022'!$D41)))","v":"DBN_№88_Gadylshin T.A."},{"$f":"IF(Таблица2[[#This Row],[№ \nPD (ОД)]]=\"\",\"\",HYPERLINK(\"#PD!H1\",_xlfn.CONCAT(\"PD_№\",'2022'!$G41,\"_\",'2022'!$D41)))","v":"PD_№54_Gadylshin T.A."},"2021-12-16",1078]
[{"$f":"SUBTOTAL(103,B$2:B42)","v":41},"Шеметов Сергей Николаевич",{"$f":"Translit('2022'!$B42)","v":"Shemetov Sergey Nikolaevich"},{"$f":"IFERROR(MID('2022'!$C42,1,SEARCH(\" \",'2022'!$C42,1)+1-2)& \" \" &MID('2022'!$C42,SEARCH(\" \",'2022'!$C42,1)+1,1)& \".\" &MID('2022'!$C42,SEARCH(\" \",'2022'!$C42,SEARCH(\" \",'2022'!$C42,1)+1)+1,1)&\".\",\"\")","v":"Shemetov S.N."},"Инспектор строительного контроля / Construction Supervision Inspector",91,55,{"$f":"IF(Таблица2[[#This Row],[№ \nDBN (ПУУМ)]]=\"\",\"\",HYPERLINK(\"#DBN!H1\",_xlfn.CONCAT(\"DBN_№\",Таблица2[[#This Row],[№ \nDBN (ПУУМ)]],\"_\",'2022'!$D42)))","v":"DBN_№91_Shemetov S.N."},{"$f":"IF(Таблица2[[#This Row],[№ \nPD (ОД)]]=\"\",\"\",HYPERLINK(\"#PD!H1\",_xlfn.CONCAT(\"PD_№\",'2022'!$G42,\"_\",'2022'!$D42)))","v":"PD_№55_Shemetov S.N."},"2021-12-16",1078]
[{"$f":"SUBTOTAL(103,B$2:B43)","v":42},"Власова Элина Евгеньевна",{"$f":"Translit('2022'!$B43)","v":"Vlasova Elina Evgenevna"},{"$f":"IFERROR(MID('2022'!$C43,1,SEARCH(\" \",'2022'!$C43,1)+1-2)& \" \" &MID('2022'!$C43,SEARCH(\" \",'2022'!$C43,1)+1,1)& \".\" &MID('2022'!$C43,SEARCH(\" \",'2022'!$C43,SEARCH(\" \",'2022'!$C43,1)+1)+1,1)&\".\",\"\")","v":"Vlasova E.E."},"Инспектор строительного контроля / Construction Supervision Inspector",96,59,{"$f":"IF(Таблица2[[#This Row],[№ \nDBN (ПУУМ)]]=\"\",\"\",HYPERLINK(\"#DBN!H1\",_xlfn.CONCAT(\"DBN_№\",Таблица2[[#This Row],[№ \nDBN (ПУУМ)]],\"_\",'2022'!$D43)))","v":"DBN_№96_Vlasova E.E."},{"$f":"IF(Таблица2[[#This Row],[№ \nPD (ОД)]]=\"\",\"\",HYPERLINK(\"#PD!H1\",_xlfn.CONCAT(\"PD_№\",'2022'!$G43,\"_\",'2022'!$D43)))","v":"PD_№59_Vlasova E.E."},"2021-12-16",1078]
[{"$f":"SUBTOTAL(103,B$2:B44)","v":43},"Иванов Дмитрий Константинович",{"$f":"Translit('2022'!$B44)","v":"Ivanov Dmitriy Konstantinovich"},{"$f":"IFERROR(MID('2022'!$C44,1,SEARCH(\" \",'2022'!$C44,1)+1-2)& \" \" &MID('2022'!$C44,SEARCH(\" \",'2022'!$C44,1)+1,1)& \".\" &MID('2022'!$C44,SEARCH(\" \",'2022'!$C44,SEARCH(\" \",'2022'!$C44,1)+1)+1,1)&\".\",\"\")","v":"Ivanov D.K."},"Инспектор строительного контроля / Construction Supervision Inspector",95,58,{"$f":"IF(Таблица2[[#This Row],[№ \nDBN (ПУУМ)]]=\"\",\"\",HYPERLINK(\"#DBN!H1\",_xlfn.CONCAT(\"DBN_№\",Таблица2[[#This Row],[№ \nDBN (ПУУМ)]],\"_\",'2022'!$D44)))","v":"DBN_№95_Ivanov D.K."},{"$f":"IF(Таблица2[[#This Row],[№ \nPD (ОД)]]=\"\",\"\",HYPERLINK(\"#PD!H1\",_xlfn.CONCAT(\"PD_№\",'2022'!$G44,\"_\",'2022'!$D44)))","v":"PD_№58_Ivanov D.K."},"2021-12-16",1078]
[{"$f":"SUBTOTAL(103,B$2:B45)","v":44},"Шишулькин Евгений Николаевич",{"$f":"Translit('2022'!$B45)","v":"Shishulkin Evgeniy Nikolaevich"},{"$f":"IFERROR(MID('2022'!$C45,1,SEARCH(\" \",'2022'!$C45,1)+1-2)& \" \" &MID('2022'!$C45,SEARCH(\" \",'2022'!$C45,1)+1,1)& \".\" &MID('2022'!$C45,SEARCH(\" \",'2022'!$C45,SEARCH(\" \",'2022'!$C45,1)+1)+1,1)&\".\",\"\")","v":"Shishulkin E.N."},"Инспектор строительного контроля / Construction Supervision Inspector",94,57,{"$f":"IF(Таблица2[[#This Row],[№ \nDBN (ПУУМ)]]=\"\",\"\",HYPERLINK(\"#DBN!H1\",_xlfn.CONCAT(\"DBN_№\",Таблица2[[#This Row],[№ \nDBN (ПУУМ)]],\"_\",'2022'!$D45)))","v":"DBN_№94_Shishulkin E.N."},{"$f":"IF(Таблица2[[#This Row],[№ \nPD (ОД)]]=\"\",\"\",HYPERLINK(\"#PD!H1\",_xlfn.CONCAT(\"PD_№\",'2022'!$G45,\"_\",'2022'!$D45)))","v":"PD_№57_Shishulkin E.N."},"2021-12-16",1078]
[{"$f":"SUBTOTAL(103,B$2:B46)","v":45},"Смолин Павел Сергеевич",{"$f":"Translit('2022'!$B46)","v":"Smolin Pavel Sergeevich"},{"$f":"IFERROR(MID('2022'!$C46,1,SEARCH(\" \",'2022'!$C46,1)+1-2)& \" \" &MID('2022'!$C46,SEARCH(\" \",'2022'!$C46,1)+1,1)& \".\" &MID('2022'!$C46,SEARCH(\" \",'2022'!$C46,SEARCH(\" \",'2022'!$C46,1)+1)+1,1)&\".\",\"\")","v":"Smolin P.S."},"Инспектор строительного контроля / Construction Supervision Inspector",99,62,{"$f":"IF(Таблица2[[#This Row],[№ \nDBN (ПУУМ)]]=\"\",\"\",HYPERLINK(\"#DBN!H1\",_xlfn.CONCAT(\"DBN_№\",Таблица2[[#This Row],[№ \nDBN (ПУУМ)]],\"_\",'2022'!$D46)))","v":"DBN_№99_Smolin P.S."},{"$f":"IF(Таблица2[[#This Row],[№ \nPD (ОД)]]=\"\",\"\",HYPERLINK(\"#PD!H1\",_xlfn.CONCAT(\"PD_№\",'2022'!$G46,\"_\",'2022'!$D46)))","v":"PD_№62_Smolin P.S."},"2021-12-16",1078]
[{"$f":"SUBTOTAL(103,B$2:B47)","v":46},"Чартаев Карим Гаджиевич",{"$f":"Translit('2022'!$B47)","v":"Chartaev Karim Gadzhievich"},{"$f":"IFERROR(MID('2022'!$C47,1,SEARCH(\" \",'2022'!$C47,1)+1-2)& \" \" &MID('2022'!$C47,SEARCH(\" \",'2022'!$C47,1)+1,1)& \".\" &MID('2022'!$C47,SEARCH(\" \",'2022'!$C47,SEARCH(\" \",'2022'!$C47,1)+1)+1,1)&\".\",\"\")","v":"Chartaev K.G."},"Инспектор строительного контроля / Construction Supervision Inspector",100,63,{"$f":"IF(Таблица2[[#This Row],[№ \nDBN (ПУУМ)]]=\"\",\"\",HYPERLINK(\"#DBN!H1\",_xlfn.CONCAT(\"DBN_№\",Таблица2[[#This Row],[№ \nDBN (ПУУМ)]],\"_\",'2022'!$D47)))","v":"DBN_№100_Chartaev K.G."},{"$f":"IF(Таблица2[[#This Row],[№ \nPD (ОД)]]=\"\",\"\",HYPERLINK(\"#PD!H1\",_xlfn.CONCAT(\"PD_№\",'2022'!$G47,\"_\",'2022'!$D47)))","v":"PD_№63_Chartaev K.G."},"2021-12-16",1078]
[{"$f":"SUBTOTAL(103,B$2:B48)","v":47},"Самсонов Игорь Васильевич",{"$f":"Translit('2022'!$B48)","v":"Samsonov Igor Vasilevich"},{"$f":"IFERROR(MID('2022'!$C48,1,SEARCH(\" \",'2022'!$C48,1)+1-2)& \" \" &MID('2022'!$C48,SEARCH(\" \",'2022'!$C48,1)+1,1)& \".\" &MID('2022'!$C48,SEARCH(\" \",'2022'!$C48,SEARCH(\" \",'2022'!$C48,1)+1)+1,1)&\".\",\"\")","v":"Samsonov I.V."},"Инспектор строительного контроля / Construction Supervision Inspector",101,64,{"$f":"IF(Таблица2[[#This Row],[№ \nDBN (ПУУМ)]]=\"\",\"\",HYPERLINK(\"#DBN!H1\",_xlfn.CONCAT(\"DBN_№\",Таблица2[[#This Row],[№ \nDBN (ПУУМ)]],\"_\",'2022'!$D48)))","v":"DBN_№101_Samsonov I.V."},{"$f":"IF(Таблица2[[#This Row],[№ \nPD (ОД)]]=\"\",\"\",HYPERLINK(\"#PD!H1\",_xlfn.CONCAT(\"PD_№\",'2022'!$G48,\"_\",'2022'!$D48)))","v":"PD_№64_Samsonov I.V."},"2021-12-16",1078]
[{"$f":"SUBTOTAL(103,B$2:B49)","v":48},"Сошников Алексей Александрович",{"$f":"Translit('2022'!$B49)","v":"Soshnikov Aleksey Aleksandrovich"},{"$f":"IFERROR(MID('2022'!$C49,1,SEARCH(\" \",'2022'!$C49,1)+1-2)& \" \" &MID('2022'!$C49,SEARCH(\" \",'2022'!$C49,1)+1,1)& \".\" &MID('2022'!$C49,SEARCH(\" \",'2022'!$C49,SEARCH(\" \",'2022'!$C49,1)+1)+1,1)&\".\",\"\")","v":"Soshnikov A.A."},"Инспектор строительного контроля / Construction Supervision Inspector",105,67,{"$f":"IF(Таблица2[[#This Row],[№ \nDBN (ПУУМ)]]=\"\",\"\",HYPERLINK(\"#DBN!H1\",_xlfn.CONCAT(\"DBN_№\",Таблица2[[#This Row],[№ \nDBN (ПУУМ)]],\"_\",'2022'!$D49)))","v":"DBN_№105_Soshnikov A.A."},{"$f":"IF(Таблица2[[#This Row],[№ \nPD (ОД)]]=\"\",\"\",HYPERLINK(\"#PD!H1\",_xlfn.CONCAT(\"PD_№\",'2022'!$G49,\"_\",'2022'!$D49)))","v":"PD_№67_Soshnikov A.A."},"2021-12-16",1078]
[{"$f":"SUBTOTAL(103,B$2:B50)","v":49},"Жихарев Сергей Александрович",{"$f":"Translit('2022'!$B50)","v":"Zhikharev Sergey Aleksandrovich"},{"$f":"IFERROR(MID('2022'!$C50,1,SEARCH(\" \",'2022'!$C50,1)+1-2)& \" \" &MID('2022'!$C50,SEARCH(\" \",'2022'!$C50,1)+1,1)& \".\" &MID('2022'!$C50,SEARCH(\" \",'2022'!$C50,SEARCH(\" \",'2022'!$C50,1)+1)+1,1)&\".\",\"\")","v":"Zhikharev S.A."},"Инспектор строительного контроля / Construction Supervision Inspector",108,70,{"$f":"IF(Таблица2[[#This Row],[№ \nDBN (ПУУМ)]]=\"\",\"\",HYPERLINK(\"#DBN!H1\",_xlfn.CONCAT(\"DBN_№\",Таблица2[[#This Row],[№ \nDBN (ПУУМ)]],\"_\",'2022'!$D50)))","v":"DBN_№108_Zhikharev S.A."},{"$f":"IF(Таблица2[[#This Row],[№ \nPD (ОД)]]=\"\",\"\",HYPERLINK(\"#PD!H1\",_xlfn.CONCAT(\"PD_№\",'2022'!$G50,\"_\",'2022'!$D50)))","v":"PD_№70_Zhikharev S.A."},"2021-12-16",1078]
[{"$f":"SUBTOTAL(103,B$2:B51)","v":50},"Манышев Роман Валентинович",{"$f":"Translit('2022'!$B51)","v":"Manyshev Roman Valentinovich"},{"$f":"IFERROR(MID('2022'!$C51,1,SEARCH(\" \",'2022'!$C51,1)+1-2)& \" \" &MID('2022'!$C51,SEARCH(\" \",'2022'!$C51,1)+1,1)& \".\" &MID('2022'!$C51,SEARCH(\" \",'2022'!$C51,SEARCH(\" \",'2022'!$C51,1)+1)+1,1)&\".\",\"\")","v":"Manyshev R.V."},"Инспектор строительного контроля / Construction Supervision Inspector",107,69,{"$f":"IF(Таблица2[[#This Row],[№ \nDBN (ПУУМ)]]=\"\",\"\",HYPERLINK(\"#DBN!H1\",_xlfn.CONCAT(\"DBN_№\",Таблица2[[#This Row],[№ \nDBN (ПУУМ)]],\"_\",'2022'!$D51)))","v":"DBN_№107_Manyshev R.V."},{"$f":"IF(Таблица2[[#This Row],[№ \nPD (ОД)]]=\"\",\"\",HYPERLINK(\"#PD!H1\",_xlfn.CONCAT(\"PD_№\",'2022'!$G51,\"_\",'2022'!$D51)))","v":"PD_№69_Manyshev R.V."},"2021-12-16",1078]
[{"$f":"SUBTOTAL(103,B$2:B52)","v":51},"Конищев Евгений Александрович",{"$f":"Translit('2022'!$B52)","v":"Konischev Evgeniy Aleksandrovich"},{"$f":"IFERROR(MID('2022'!$C52,1,SEARCH(\" \",'2022'!$C52,1)+1-2)& \" \" &MID('2022'!$C52,SEARCH(\" \",'2022'!$C52,1)+1,1)& \".\" &MID('2022'!$C52,SEARCH(\" \",'2022'!$C52,SEARCH(\" \",'2022'!$C52,1)+1)+1,1)&\".\",\"\")","v":"Konischev E.A."},"Инспектор строительного контроля / Construction Supervision Inspector",1,1,{"$f":"IF(Таблица2[[#This Row],[№ \nDBN (ПУУМ)]]=\"\",\"\",HYPERLINK(\"#DBN!H1\",_xlfn.CONCAT(\"DBN_№\",Таблица2[[#This Row],[№ \nDBN (ПУУМ)]],\"_\",'2022'!$D52)))","v":"DBN_№1_Konischev E.A."},{"$f":"IF(Таблица2[[#This Row],[№ \nPD (ОД)]]=\"\",\"\",HYPERLINK(\"#PD!H1\",_xlfn.CONCAT(\"PD_№\",'2022'!$G52,\"_\",'2022'!$D52)))","v":"PD_№1_Konischev E.A."},"2021-12-16",1078]
[{"$f":"SUBTOTAL(103,B$2:B53)","v":52},"Хасанов Рамиль Мансурович ",{"$f":"Translit('2022'!$B53)","v":"Hasanov Ramil Mansurovich "},{"$f":"IFERROR(MID('2022'!$C53,1,SEARCH(\" \",'2022'!$C53,1)+1-2)& \" \" &MID('2022'!$C53,SEARCH(\" \",'2022'!$C53,1)+1,1)& \".\" &MID('2022'!$C53,SEARCH(\" \",'2022'!$C53,SEARCH(\" \",'2022'!$C53,1)+1)+1,1)&\".\",\"\")","v":"Hasanov R.M."},"Инспектор строительного контроля / Construction Supervision Inspector",2,2,{"$f":"IF(Таблица2[[#This Row],[№ \nDBN (ПУУМ)]]=\"\",\"\",HYPERLINK(\"#DBN!H1\",_xlfn.CONCAT(\"DBN_№\",Таблица2[[#This Row],[№ \nDBN (ПУУМ)]],\"_\",'2022'!$D53)))","v":"DBN_№2_Hasanov R.M."},{"$f":"IF(Таблица2[[#This Row],[№ \nPD (ОД)]]=\"\",\"\",HYPERLINK(\"#PD!H1\",_xlfn.CONCAT(\"PD_№\",'2022'!$G53,\"_\",'2022'!$D53)))","v":"PD_№2_Hasanov R.M."},"2021-12-16",1078]
[{"$f":"SUBTOTAL(103,B$2:B54)","v":53},"Фишер Василий Борисович",{"$f":"Translit('2022'!$B54)","v":"Fisher Vasiliy Borisovich"},{"$f":"IFERROR(MID('2022'!$C54,1,SEARCH(\" \",'2022'!$C54,1)+1-2)& \" \" &MID('2022'!$C54,SEARCH(\" \",'2022'!$C54,1)+1,1)& \".\" &MID('2022'!$C54,SEARCH(\" \",'2022'!$C54,SEARCH(\" \",'2022'!$C54,1)+1)+1,1)&\".\",\"\")","v":"Fisher V.B."},"Инспектор строительного контроля / Construction Supervision Inspector",5,3,{"$f":"IF(Таблица2[[#This Row],[№ \nDBN (ПУУМ)]]=\"\",\"\",HYPERLINK(\"#DBN!H1\",_xlfn.CONCAT(\"DBN_№\",Таблица2[[#This Row],[№ \nDBN (ПУУМ)]],\"_\",'2022'!$D54)))","v":"DBN_№5_Fisher V.B."},{"$f":"IF(Таблица2[[#This Row],[№ \nPD (ОД)]]=\"\",\"\",HYPERLINK(\"#PD!H1\",_xlfn.CONCAT(\"PD_№\",'2022'!$G54,\"_\",'2022'!$D54)))","v":"PD_№3_Fisher V.B."},"2021-12-29",1078]
[{"$f":"SUBTOTAL(103,B$2:B55)","v":54},"Кулушев Заур Ахмеджанович",{"$f":"Translit('2022'!$B55)","v":"Kulushev Zaur Akhmedzhanovich"},{"$f":"IFERROR(MID('2022'!$C55,1,SEARCH(\" \",'2022'!$C55,1)+1-2)& \" \" &MID('2022'!$C55,SEARCH(\" \",'2022'!$C55,1)+1,1)& \".\" &MID('2022'!$C55,SEARCH(\" \",'2022'!$C55,SEARCH(\" \",'2022'!$C55,1)+1)+1,1)&\".\",\"\")","v":"Kulushev Z.A."},"Инспектор строительного контроля / Construction Supervision Inspector",15,4,{"$f":"IF(Таблица2[[#This Row],[№ \nDBN (ПУУМ)]]=\"\",\"\",HYPERLINK(\"#DBN!H1\",_xlfn.CONCAT(\"DBN_№\",Таблица2[[#This Row],[№ \nDBN (ПУУМ)]],\"_\",'2022'!$D55)))","v":"DBN_№15_Kulushev Z.A."},{"$f":"IF(Таблица2[[#This Row],[№ \nPD (ОД)]]=\"\",\"\",HYPERLINK(\"#PD!H1\",_xlfn.CONCAT(\"PD_№\",'2022'!$G55,\"_\",'2022'!$D55)))","v":"PD_№4_Kulushev Z.A."},"2022-01-28",1078]
[{"$f":"SUBTOTAL(103,B$2:B56)","v":55},"Халяпин Сергей Геннадьевич",{"$f":"Translit('2022'!$B56)","v":"Halyapin Sergey Gennadevich"},{"$f":"IFERROR(MID('2022'!$C56,1,SEARCH(\" \",'2022'!$C56,1)+1-2)& \" \" &MID('2022'!$C56,SEARCH(\" \",'2022'!$C56,1)+1,1)& \".\" &MID('2022'!$C56,SEARCH(\" \",'2022'!$C56,SEARCH(\" \",'2022'!$C56,1)+1)+1,1)&\".\",\"\")","v":"Halyapin S.G."},"Инспектор строительного контроля / Construction Supervision Inspector",23,23,{"$f":"IF(Таблица2[[#This Row],[№ \nDBN (ПУУМ)]]=\"\",\"\",HYPERLINK(\"#DBN!H1\",_xlfn.CONCAT(\"DBN_№\",Таблица2[[#This Row],[№ \nDBN (ПУУМ)]],\"_\",'2022'!$D56)))","v":"DBN_№23_Halyapin S.G."},{"$f":"IF(Таблица2[[#This Row],[№ \nPD (ОД)]]=\"\",\"\",HYPERLINK(\"#PD!H1\",_xlfn.CONCAT(\"PD_№\",'2022'!$G56,\"_\",'2022'!$D56)))","v":"PD_№23_Halyapin S.G."},"2022-02-17",1078]
[{"$f":"SUBTOTAL(103,B$2:B57)","v":56},"Салахова Карина Рузилевна",{"$f":"Translit('2022'!$B57)","v":"Salakhova Karina Ruzilevna"},{"$f":"IFERROR(MID('2022'!$C57,1,SEARCH(\" \",'2022'!$C57,1)+1-2)& \" \" &MID('2022'!$C57,SEARCH(\" \",'2022'!$C57,1)+1,1)& \".\" &MID('2022'!$C57,SEARCH(\" \",'2022'!$C57,SEARCH(\" \",'2022'!$C57,1)+1)+1,1)&\".\",\"\")","v":"Salakhova K.R."},"Инспектор строительного контроля / Construction Supervision Inspector",26,12,{"$f":"IF(Таблица2[[#This Row],[№ \nDBN (ПУУМ)]]=\"\",\"\",HYPERLINK(\"#DBN!H1\",_xlfn.CONCAT(\"DBN_№\",Таблица2[[#This Row],[№ \nDBN (ПУУМ)]],\"_\",'2022'!$D57)))","v":"DBN_№26_Salakhova K.R."},{"$f":"IF(Таблица2[[#This Row],[№ \nPD (ОД)]]=\"\",\"\",HYPERLINK(\"#PD!H1\",_xlfn.CONCAT(\"PD_№\",'2022'!$G57,\"_\",'2022'!$D57)))","v":"PD_№12_Salakhova K.R."},"2022-02-18",1078]
[{"$f":"SUBTOTAL(103,B$2:B58)","v":57},"Савдиеров Юрий Александрович",{"$f":"Translit('2022'!$B58)","v":"Savdierov Yuriy Aleksandrovich"},{"$f":"IFERROR(MID('2022'!$C58,1,SEARCH(\" \",'2022'!$C58,1)+1-2)& \" \" &MID('2022'!$C58,SEARCH(\" \",'2022'!$C58,1)+1,1)& \".\" &MID('2022'!$C58,SEARCH(\" \",'2022'!$C58,SEARCH(\" \",'2022'!$C58,1)+1)+1,1)&\".\",\"\")","v":"Savdierov Y.A."},"Инспектор строительного контроля / Construction Supervision Inspector",27,15,{"$f":"IF(Таблица2[[#This Row],[№ \nDBN (ПУУМ)]]=\"\",\"\",HYPERLINK(\"#DBN!H1\",_xlfn.CONCAT(\"DBN_№\",Таблица2[[#This Row],[№ \nDBN (ПУУМ)]],\"_\",'2022'!$D58)))","v":"DBN_№27_Savdierov Y.A."},{"$f":"IF(Таблица2[[#This Row],[№ \nPD (ОД)]]=\"\",\"\",HYPERLINK(\"#PD!H1\",_xlfn.CONCAT(\"PD_№\",'2022'!$G58,\"_\",'2022'!$D58)))","v":"PD_№15_Savdierov Y.A."},"2022-02-28",1078]
[{"$f":"SUBTOTAL(103,B$2:B59)","v":58},"Гречущев Максим Владимирович",{"$f":"Translit('2022'!$B59)","v":"Grechuschev Maksim Vladimirovich"},{"$f":"IFERROR(MID('2022'!$C59,1,SEARCH(\" \",'2022'!$C59,1)+1-2)& \" \" &MID('2022'!$C59,SEARCH(\" \",'2022'!$C59,1)+1,1)& \".\" &MID('2022'!$C59,SEARCH(\" \",'2022'!$C59,SEARCH(\" \",'2022'!$C59,1)+1)+1,1)&\".\",\"\")","v":"Grechuschev M.V."},"Инспектор строительного контроля / Construction Supervision Inspector",28,27,{"$f":"IF(Таблица2[[#This Row],[№ \nDBN (ПУУМ)]]=\"\",\"\",HYPERLINK(\"#DBN!H1\",_xlfn.CONCAT(\"DBN_№\",Таблица2[[#This Row],[№ \nDBN (ПУУМ)]],\"_\",'2022'!$D59)))","v":"DBN_№28_Grechuschev M.V."},{"$f":"IF(Таблица2[[#This Row],[№ \nPD (ОД)]]=\"\",\"\",HYPERLINK(\"#PD!H1\",_xlfn.CONCAT(\"PD_№\",'2022'!$G59,\"_\",'2022'!$D59)))","v":"PD_№27_Grechuschev M.V."},"2022-03-14",1078]
[{"$f":"SUBTOTAL(103,B$2:B60)","v":59},"Груздов Денис Александрович",{"$f":"Translit('2022'!$B60)","v":"Gruzdov Denis Aleksandrovich"},{"$f":"IFERROR(MID('2022'!$C60,1,SEARCH(\" \",'2022'!$C60,1)+1-2)& \" \" &MID('2022'!$C60,SEARCH(\" \",'2022'!$C60,1)+1,1)& \".\" &MID('2022'!$C60,SEARCH(\" \",'2022'!$C60,SEARCH(\" \",'2022'!$C60,1)+1)+1,1)&\".\",\"\")","v":"Gruzdov D.A."},"Инспектор строительного контроля / Construction Supervision Inspector",32,29,{"$f":"IF(Таблица2[[#This Row],[№ \nDBN (ПУУМ)]]=\"\",\"\",HYPERLINK(\"#DBN!H1\",_xlfn.CONCAT(\"DBN_№\",Таблица2[[#This Row],[№ \nDBN (ПУУМ)]],\"_\",'2022'!$D60)))","v":"DBN_№32_Gruzdov D.A."},{"$f":"IF(Таблица2[[#This Row],[№ \nPD (ОД)]]=\"\",\"\",HYPERLINK(\"#PD!H1\",_xlfn.CONCAT(\"PD_№\",'2022'!$G60,\"_\",'2022'!$D60)))","v":"PD_№29_Gruzdov D.A."},"2022-03-22",1078]
[{"$f":"SUBTOTAL(103,B$2:B61)","v":60},"Колесников Владимир Михайлович",{"$f":"Translit('2022'!$B61)","v":"Kolesnikov Vladimir Mikhaylovich"},{"$f":"IFERROR(MID('2022'!$C61,1,SEARCH(\" \",'2022'!$C61,1)+1-2)& \" \" &MID('2022'!$C61,SEARCH(\" \",'2022'!$C61,1)+1,1)& \".\" &MID('2022'!$C61,SEARCH(\" \",'2022'!$C61,SEARCH(\" \",'2022'!$C61,1)+1)+1,1)&\".\",\"\")","v":"Kolesnikov V.M."},"Инспектор строительного контроля / Construction Supervision Inspector",38,35,{"$f":"IF(Таблица2[[#This Row],[№ \nDBN (ПУУМ)]]=\"\",\"\",HYPERLINK(\"#DBN!H1\",_xlfn.CONCAT(\"DBN_№\",Таблица2[[#This Row],[№ \nDBN (ПУУМ)]],\"_\",'2022'!$D61)))","v":"DBN_№38_Kolesnikov V.M."},{"$f":"IF(Таблица2[[#This Row],[№ \nPD (ОД)]]=\"\",\"\",HYPERLINK(\"#PD!H1\",_xlfn.CONCAT(\"PD_№\",'2022'!$G61,\"_\",'2022'!$D61)))","v":"PD_№35_Kolesnikov V.M."},"2022-03-22",1078]
[{"$f":"SUBTOTAL(103,B$2:B62)","v":61},"Иванов Иван Иванович",{"$f":"Translit('2022'!$B62)","v":"Ivanov Ivan Ivanovich"},{"$f":"IFERROR(MID('2022'!$C62,1,SEARCH(\" \",'2022'!$C62,1)+1-2)& \" \" &MID('2022'!$C62,SEARCH(\" \",'2022'!$C62,1)+1,1)& \".\" &MID('2022'!$C62,SEARCH(\" \",'2022'!$C62,SEARCH(\" \",'2022'!$C62,1)+1)+1,1)&\".\",\"\")","v":"Ivanov I.I."},"Инспектор строительного контроля / Construction Supervision Inspector",666,666,{"$f":"IF(Таблица2[[#This Row],[№ \nDBN (ПУУМ)]]=\"\",\"\",HYPERLINK(\"#DBN!H1\",_xlfn.CONCAT(\"DBN_№\",Таблица2[[#This Row],[№ \nDBN (ПУУМ)]],\"_\",'2022'!$D62)))","v":"DBN_№666_Ivanov I.I."},{"$f":"IF(Таблица2[[#This Row],[№ \nPD (ОД)]]=\"\",\"\",HYPERLINK(\"#PD!H1\",_xlfn.CONCAT(\"PD_№\",'2022'!$G62,\"_\",'2022'!$D62)))","v":"PD_№666_Ivanov I.I."},"2022-06-22",66666]
[{"$f":"SUBTOTAL(103,B$2:B63)","v":62},"Красноперов Константин Юрьевич",{"$f":"Translit('2022'!$B63)","v":"Krasnoperov Konstantin Yurevich"},{"$f":"IFERROR(MID('2022'!$C63,1,SEARCH(\" \",'2022'!$C63,1)+1-2)& \" \" &MID('2022'!$C63,SEARCH(\" \",'2022'!$C63,1)+1,1)& \".\" &MID('2022'!$C63,SEARCH(\" \",'2022'!$C63,SEARCH(\" \",'2022'!$C63,1)+1)+1,1)&\".\",\"\")","v":"Krasnoperov K.Y."},"Инспектор строительного контроля / Construction Supervision Inspector",33,30,{"$f":"IF(Таблица2[[#This Row],[№ \nDBN (ПУУМ)]]=\"\",\"\",HYPERLINK(\"#DBN!H1\",_xlfn.CONCAT(\"DBN_№\",Таблица2[[#This Row],[№ \nDBN (ПУУМ)]],\"_\",'2022'!$D63)))","v":"DBN_№33_Krasnoperov K.Y."},{"$f":"IF(Таблица2[[#This Row],[№ \nPD (ОД)]]=\"\",\"\",HYPERLINK(\"#PD!H1\",_xlfn.CONCAT(\"PD_№\",'2022'!$G63,\"_\",'2022'!$D63)))","v":"PD_№30_Krasnoperov K.Y."},"2022-03-22",1078]
[{"$f":"SUBTOTAL(103,B$2:B64)","v":63},"Черемискин Сергей Анатольевич",{"$f":"Translit('2022'!$B64)","v":"Cheremiskin Sergey Anatolevich"},{"$f":"IFERROR(MID('2022'!$C64,1,SEARCH(\" \",'2022'!$C64,1)+1-2)& \" \" &MID('2022'!$C64,SEARCH(\" \",'2022'!$C64,1)+1,1)& \".\" &MID('2022'!$C64,SEARCH(\" \",'2022'!$C64,SEARCH(\" \",'2022'!$C64,1)+1)+1,1)&\".\",\"\")","v":"Cheremiskin S.A."},"Инспектор строительного контроля / Construction Supervision Inspector",37,33,{"$f":"IF(Таблица2[[#This Row],[№ \nDBN (ПУУМ)]]=\"\",\"\",HYPERLINK(\"#DBN!H1\",_xlfn.CONCAT(\"DBN_№\",Таблица2[[#This Row],[№ \nDBN (ПУУМ)]],\"_\",'2022'!$D64)))","v":"DBN_№37_Cheremiskin S.A."},{"$f":"IF(Таблица2[[#This Row],[№ \nPD (ОД)]]=\"\",\"\",HYPERLINK(\"#PD!H1\",_xlfn.CONCAT(\"PD_№\",'2022'!$G64,\"_\",'2022'!$D64)))","v":"PD_№33_Cheremiskin S.A."},"2022-03-28",1078]
[{"$f":"SUBTOTAL(103,B$2:B65)","v":64},"Миляев Диян Анатольевич",{"$f":"Translit('2022'!$B65)","v":"Milyaev Diyan Anatolevich"},{"$f":"IFERROR(MID('2022'!$C65,1,SEARCH(\" \",'2022'!$C65,1)+1-2)& \" \" &MID('2022'!$C65,SEARCH(\" \",'2022'!$C65,1)+1,1)& \".\" &MID('2022'!$C65,SEARCH(\" \",'2022'!$C65,SEARCH(\" \",'2022'!$C65,1)+1)+1,1)&\".\",\"\")","v":"Milyaev D.A."},"Инспектор строительного контроля / Construction Supervision Inspector",40,38,{"$f":"IF(Таблица2[[#This Row],[№ \nDBN (ПУУМ)]]=\"\",\"\",HYPERLINK(\"#DBN!H1\",_xlfn.CONCAT(\"DBN_№\",Таблица2[[#This Row],[№ \nDBN (ПУУМ)]],\"_\",'2022'!$D65)))","v":"DBN_№40_Milyaev D.A."},{"$f":"IF(Таблица2[[#This Row],[№ \nPD (ОД)]]=\"\",\"\",HYPERLINK(\"#PD!H1\",_xlfn.CONCAT(\"PD_№\",'2022'!$G65,\"_\",'2022'!$D65)))","v":"PD_№38_Milyaev D.A."},"2022-04-07",1078]
[{"$f":"SUBTOTAL(103,B$2:B66)","v":65},"Пинаев Михаил Николаевич",{"$f":"Translit('2022'!$B66)","v":"Pinaev Mikhail Nikolaevich"},{"$f":"IFERROR(MID('2022'!$C66,1,SEARCH(\" \",'2022'!$C66,1)+1-2)& \" \" &MID('2022'!$C66,SEARCH(\" \",'2022'!$C66,1)+1,1)& \".\" &MID('2022'!$C66,SEARCH(\" \",'2022'!$C66,SEARCH(\" \",'2022'!$C66,1)+1)+1,1)&\".\",\"\")","v":"Pinaev M.N."},"Инспектор строительного контроля / Construction Supervision Inspector",39,37,{"$f":"IF(Таблица2[[#This Row],[№ \nDBN (ПУУМ)]]=\"\",\"\",HYPERLINK(\"#DBN!H1\",_xlfn.CONCAT(\"DBN_№\",Таблица2[[#This Row],[№ \nDBN (ПУУМ)]],\"_\",'2022'!$D66)))","v":"DBN_№39_Pinaev M.N."},{"$f":"IF(Таблица2[[#This Row],[№ \nPD (ОД)]]=\"\",\"\",HYPERLINK(\"#PD!H1\",_xlfn.CONCAT(\"PD_№\",'2022'!$G66,\"_\",'2022'!$D66)))","v":"PD_№37_Pinaev M.N."},"2022-04-07",1078]
[{"$f":"SUBTOTAL(103,B$2:B67)","v":66},"Пугач Игорь Михайлович",{"$f":"Translit('2022'!$B67)","v":"Pugach Igor Mikhaylovich"},{"$f":"IFERROR(MID('2022'!$C67,1,SEARCH(\" \",'2022'!$C67,1)+1-2)& \" \" &MID('2022'!$C67,SEARCH(\" \",'2022'!$C67,1)+1,1)& \".\" &MID('2022'!$C67,SEARCH(\" \",'2022'!$C67,SEARCH(\" \",'2022'!$C67,1)+1)+1,1)&\".\",\"\")","v":"Pugach I.M."},"Инспектор строительного контроля / Construction Supervision Inspector",10,10,{"$f":"IF(Таблица2[[#This Row],[№ \nDBN (ПУУМ)]]=\"\",\"\",HYPERLINK(\"#DBN!H1\",_xlfn.CONCAT(\"DBN_№\",Таблица2[[#This Row],[№ \nDBN (ПУУМ)]],\"_\",'2022'!$D67)))","v":"DBN_№10_Pugach I.M."},{"$f":"IF(Таблица2[[#This Row],[№ \nPD (ОД)]]=\"\",\"\",HYPERLINK(\"#PD!H1\",_xlfn.CONCAT(\"PD_№\",'2022'!$G67,\"_\",'2022'!$D67)))","v":"PD_№10_Pugach I.M."},"2021-12-16",1078]
[{"$f":"SUBTOTAL(103,B$2:B68)","v":67},"Прихунов Игорь Владимирович",{"$f":"Translit('2022'!$B68)","v":"Prikhunov Igor Vladimirovich"},{"$f":"IFERROR(MID('2022'!$C68,1,SEARCH(\" \",'2022'!$C68,1)+1-2)& \" \" &MID('2022'!$C68,SEARCH(\" \",'2022'!$C68,1)+1,1)& \".\" &MID('2022'!$C68,SEARCH(\" \",'2022'!$C68,SEARCH(\" \",'2022'!$C68,1)+1)+1,1)&\".\",\"\")","v":"Prikhunov I.V."},"Инспектор строительного контроля / Construction Supervision Inspector",42,42,{"$f":"IF(Таблица2[[#This Row],[№ \nDBN (ПУУМ)]]=\"\",\"\",HYPERLINK(\"#DBN!H1\",_xlfn.CONCAT(\"DBN_№\",Таблица2[[#This Row],[№ \nDBN (ПУУМ)]],\"_\",'2022'!$D68)))","v":"DBN_№42_Prikhunov I.V."},{"$f":"IF(Таблица2[[#This Row],[№ \nPD (ОД)]]=\"\",\"\",HYPERLINK(\"#PD!H1\",_xlfn.CONCAT(\"PD_№\",'2022'!$G68,\"_\",'2022'!$D68)))","v":"PD_№42_Prikhunov I.V."},"2022-06-01",1078]
[{"$f":"SUBTOTAL(103,B$2:B69)","v":68},"Чопоров Александр Игоревич",{"$f":"Translit('2022'!$B69)","v":"Choporov Aleksandr Igorevich"},{"$f":"IFERROR(MID('2022'!$C69,1,SEARCH(\" \",'2022'!$C69,1)+1-2)& \" \" &MID('2022'!$C69,SEARCH(\" \",'2022'!$C69,1)+1,1)& \".\" &MID('2022'!$C69,SEARCH(\" \",'2022'!$C69,SEARCH(\" \",'2022'!$C69,1)+1)+1,1)&\".\",\"\")","v":"Choporov A.I."},"Инспектор строительного контроля / Construction Supervision Inspector",43,43,{"$f":"IF(Таблица2[[#This Row],[№ \nDBN (ПУУМ)]]=\"\",\"\",HYPERLINK(\"#DBN!H1\",_xlfn.CONCAT(\"DBN_№\",Таблица2[[#This Row],[№ \nDBN (ПУУМ)]],\"_\",'2022'!$D69)))","v":"DBN_№43_Choporov A.I."},{"$f":"IF(Таблица2[[#This Row],[№ \nPD (ОД)]]=\"\",\"\",HYPERLINK(\"#PD!H1\",_xlfn.CONCAT(\"PD_№\",'2022'!$G69,\"_\",'2022'!$D69)))","v":"PD_№43_Choporov A.I."},"2022-06-02",1078]

{"sheet":"DBN","index":1,"n_rows":26,"n_cols":10,"rows_kept":26,"cut":false,"hidden":false,"merged":[[6,0,6,10],[1,0,1,10],[3,0,3,10],[4,0,4,10],[5,0,5,10],[13,0,13,4],[13,5,13,6],[13,9,13,10],[7,0,7,10],[8,0,8,4],[8,5,8,10],[9,0,9,4],[9,5,9,10],[10,0,10,4],[10,5,10,10],[11,0,11,4],[11,5,11,7],[11,8,11,10],[12,0,12,4],[12,5,12,10],[14,0,14,4],[14,5,14,10],[15,0,15,4],[15,5,15,10],[15,11,17,11],[16,1,16,3],[16,5,16,7],[16,8,16,9],[17,1,17,3],[17,5,17,7],[17,8,17,9],[18,1,18,3],[18,5,18,7],[18,8,18,9],[19,0,19,4],[19,5,19,7],[19,8,19,9],[20,0,20,4],[20,5,20,10],[22,5,22,10],[24,5,24,7],[25,5,25,7]]}
[null,null,null,null,null,null,null,"DBN_№18_Aglutdinov S.G."]
["Конфиденциальная информация (C2) / Confidential information (C2)"]
[]
["ФОРМА УТВЕРЖДЕНИЯ ПЕРСОНАЛА (ФУП)"]
[{"$f":"_xlfn.CONCAT(\"№ \",INDEX('2022'!$F$2:$F$69,MATCH(DBN!H1,'2022'!$I$2:$I$69,0)),\" к Договору оказания услуг № R-DBN-20-0013 от 30.04.2020\")","v":{"$error":"#N/A"}}]
["PERSONNEL AUTHORIZATION FORM (PAF)"]
[{"$f":"_xlfn.CONCAT(\"№ \",INDEX('2022'!$F$2:$F$69,MATCH(DBN!H1,'2022'!$I$2:$I$69,0)),\" to Service Agreement № R-DBN-20-0013 от 30.04.2020\")","v":{"$error":"#N/A"}}]
[]
["ФИО кандидата полностью",null,null,null,null,{"$f":"INDEX('2022'!B2:B144,MATCH(DBN!H1,'2022'!$I$2:$I$144,0))","v":{"$error":"#N/A"}}]
["/ Full Name of Candidate:",null,null,null,null,{"$f":"_xlfn.CONCAT(\"/ \",INDEX('2022'!C2:C69,MATCH(DBN!H1,'2022'!$I$2:$I$144,0)))","v":{"$error":"#N/A"}}]
["Категория специалиста\n/ Job Category according to the Agreement:",null,null,null,null,"Инспектор строительного контроля / Construction Supervision Inspector"]
["Резюме прилагается\n/ CV attached:",null,null,null,null,"R  Yes/Да",null,null,"☐  No/Нет"]
["Ставка специалиста в час согласно Договору\n/ Specialist hourly rate according to the Agreement:",null,null,null,null,{"$f":"_xlfn.CONCAT(TEXT(INDEX('2022'!K2:K69,MATCH(DBN!H1,'2022'!$I$2:$I$69,0)),\"00,00\"),\" ₱\")","v":{"$error":"#N/A"}}]
["Согласованный срок действия\n/ Approved validity period:",null,null,null,null,"From: / С ",null,{"$f":"INDEX('2022'!$J$2:$J$69,MATCH(DBN!H1,'2022'!$I$2:$I$69,0))","v":{"$error":"#N/A"}},"Till: / До ","2022-12-31"]
[]
["Уполномоченный Представитель Исполнителя / \nContractor Authorized Representative",null,null,null,null,"Уполномоченный Представитель Компании / \nCompany Authorized Representative"]
["Подпись / Signature:",null,null,null,null,"Подпись / Signature:"]
["ФИО / Name:",null,null,null,null,"ФИО / Name:"]
["Должность / Title:",null,null,null,null,"Должность / Title:"]
[null,null,null,null,null,"Дата / Date:"]
[]
[]
[null,null,null,null,null,"Виза Ответственного Компании за организацию СК /  \nSign-off by Company’s Responsible Person for CS"]
[]
[null,null,null,null,null,"Подпись / Signature"]
[null,null,null,null,null,"ФИО / Name"]

{"sheet":"PD","index":2,"n_rows":26,"n_cols":10,"rows_kept":26,"cut":false,"hidden":false,"merged":[[24,5,24,7],[25,5,25,7],[20,5,20,10],[15,11,17,11],[17,5,17,7],[18,5,18,7],[15,5,15,10],[22,5,22,10],[20,0,20,4],[1,0,1,10],[3,0,3,10],[4,0,4,10],[5,0,5,10],[6,0,6,10],[10,0,10,4],[7,0,7,10],[15,0,15,4],[13,9,13,10],[8,0,8,4],[9,0,9,4],[14,0,14,4],[13,0,13,4],[12,0,12,4],[11,0,11,4],[8,5,8,10],[9,5,9,10],[10,5,10,10],[19,5,19,7],[19,8,19,9],[11,5,11,7],[11,8,11,10],[13,5,13,6],[14,5,14,10],[12,5,12,10],[19,0,19,4],[16,1,16,3],[17,1,17,3],[18,1,18,3],[16,8,16,9],[17,8,17,9],[18,8,18,9],[16,5,16,7]]}
[null,null,null,null,null,null,null,"PD_№21_Paulskiy O.I."]
["Конфиденциальная информация (C2) / Confidential information (C2)"]
[]
["ФОРМА УТВЕРЖДЕНИЯ ПЕРСОНАЛА (ФУП)"]
[{"$f":"_xlfn.CONCAT(\"№ \",INDEX('2022'!G2:G69,MATCH(PD!H1,'2022'!$I$2:$I$69,0)),\" к Договору оказания услуг № R-PD-20-0035 от 02.07.2020\")","v":"№ 21 к Договору оказания услуг № R-PD-20-0035 от 02.07.2020"}]
["PERSONNEL AUTHORIZATION FORM (PAF)"]
[{"$f":"_xlfn.CONCAT(\"№ \",INDEX('2022'!G2:G69,MATCH(PD!H1,'2022'!$I$2:$I$69,0)),\" to Service Agreement № R-PD-20-0035 от 02.07.2020\")","v":"№ 21 to Service Agreement № R-PD-20-0035 от 02.07.2020"}]
[]
["ФИО кандидата полностью",null,null,null,null,{"$f":"INDEX('2022'!B2:B144,MATCH(PD!H1,'2022'!$I$2:$I$144,0))","v":"Паульский Олег Иосифович"}]
["/ Full Name of Candidate:",null,null,null,null,{"$f":"_xlfn.CONCAT(\"/ \",INDEX('2022'!C2:C69,MATCH(PD!H1,'2022'!$I$2:$I$144,0)))","v":"/ Paulskiy Oleg Iosifovich"}]
["Категория специалиста\n/ Job Category according to the Agreement:",null,null,null,null,"Инспектор строительного контроля / Construction Supervision Inspector"]
["Резюме прилагается\n/ CV attached:",null,null,null,null,"R  Yes/Да",null,null,"☐  No/Нет"]
["Ставка специалиста в час согласно Договору\n/ Specialist hourly rate according to the Agreement:",null,null,null,null,{"$f":"_xlfn.CONCAT(TEXT(INDEX('2022'!K2:K69,MATCH(PD!H1,'2022'!$I$2:$I$69,0)),\"00,00\"),\" ₱\")","v":"1078,00 ₱"}]
["Согласованный срок действия\n/ Approved validity period:",null,null,null,null,"From: / С ",null,{"$f":"INDEX('2022'!$J$2:$J$69,MATCH(PD!H1,'2022'!$I$2:$I$69,0))","v":"2021-12-16"},"Till: / До ","2022-12-31"]
[]
["Уполномоченный Представитель Исполнителя / \nContractor Authorized Representative",null,null,null,null,"Уполномоченный Представитель Компании / \nCompany Authorized Representative"]
["Подпись / Signature:",null,null,null,null,"Подпись / Signature:"]
["ФИО / Name:",null,null,null,null,"ФИО / Name:"]
["Должность / Title:",null,null,null,null,"Должность / Title:"]
[null,null,null,null,null,"Дата / Date:"]
[]
[]
[null,null,null,null,null,"Виза Ответственного Компании за организацию СК /  \nSign-off by Company’s Responsible Person for CS"]
[]
[null,null,null,null,null,"Подпись / Signature"]
[null,null,null,null,null,"ФИО / Name"]