{"text_format":"1","workbook":"xlsx","n_sheets":3,"sheets":["2022","DBN","PD"],"not_rendered":{"charts":0,"images":0,"macros":1,"external_links":0,"defined_names":4,"comments":0,"pivot_tables":0},"unopened":[],"bounds":{"document_bytes":16777216,"sheet_cells":100000,"rows_first":2000,"rows_last":500,"rows_between":2000,"halvings":0,"cell_chars":16384,"cell_head_chars":4096},"cells_cut":0,"cells_raw":0,"read":"whole","date_system":"1900"}

{"sheet":"2022","index":0,"n_rows":69,"n_cols":11,"rows_kept":69,"cut":false,"hidden":false,"merged":[]}
["№ п/п","ФИО","Фамилия ИО (Eng)","ФИО (Eng)","Должность","№ \nDBN (ПУУМ)","№ \nPD (ОД)","DBN (ПУУМ)","PD (ОД)","Начало срока действия","Ставка"]
[{"$f":"SUBTOTAL(103,B$2:B2)","v":1},"Игольников Юрий Александрович",{"$f":"Translit('2022'!$B2)","v":"Igolnikov Yuriy Aleksandrovich"},{"$f":"IFERROR(MID('2022'!$C2,1,SEARCH(\" \",'2022'!$C2,1)+1-2)& \" \" &MID('2022'!$C2,SEARCH(\" \",'2022'!$C2,1)+1,1)& \".\" &MID('2022'!$C2,SEARCH(\" \",'2022'!$C2,SEARCH(\" \",'2022'!$C2,1)+1)+1,1)&\".\",\"\")","v":"Igolnikov Y.A."},"Менеджер проекта / Project Manager",30,null,{"$f":"IF(Таблица2[[#This Row],[№ \nDBN (ПУУМ)]]=\"\",\"\",HYPERLINK(\"#DBN!H1\",_xlfn.CONCAT(\"DBN_№\",Таблица2[[#This Row],[№ \nDBN (ПУУМ)]],\"_\",'2022'!$D2)))","v":"DBN_№30_Igolnikov Y.A."},{"$f":"IF(Таблица2[[#This Row],[№ \nPD (ОД)]]=\"\",\"\",HYPERLINK(\"#PD!H1\",_xlfn.CONCAT(\"PD_№\",'2022'!$G2,\"_\",'2022'!$D2)))","v":""},"2021-12-16",1405]
[{"$f":"SUBTOTAL(103,B$2:B3)","v":2},"Кочетков Михаил Витальевич",{"$f":"Translit('2022'!$B3)","v":"Kochetkov Mikhail Vitalevich"},{"$f":"IFERROR(MID('2022'!$C3,1,SEARCH(\" \",'2022'!$C3,1)+1-2)& \" \" &MID('2022'!$C3,SEARCH(\" \",'2022'!$C3,1)+1,1)& \".\" &MID('2022'!$C3,SEARCH(\" \",'2022'!$C3,SEARCH(\" \",'2022'!$C3,1)+1)+1,1)&\".\",\"\")","v":"Kochetkov M.V."},"Менеджер проекта / Project Manager",19,19,{"$f":"IF(Таблица2[[#This Row],[№ \nDBN (ПУУМ)]]=\"\",\"\",HYPERLINK(\"#DBN!H1\",_xlfn.CONCAT(\"DBN_№\",Таблица2[[#This Row],[№ \nDBN (ПУУМ)]],\"_\",'2022'!$D3)))","v":"DBN_№19_Kochetkov M.V."},{"$f":"IF(Таблица2[[#This Row],[№ \nPD (ОД)]]=\"\",\"\",HYPERLINK(\"#PD!H1\",_xlfn.CONCAT(\"PD_№\",'2022'!$G3,\"_\",'2022'!$D3)))","v":"PD_№19_Kochetkov M.V."},"2021-12-16",1405]
[{"$f":"SUBTOTAL(103,B$2:B4)","v":3},"Яшинский Сергей Алексеевич",{"$f":"Translit('2022'!$B4)","v":"Yashinskiy Sergey Alekseevich"},{"$f":"IFERROR(MID('2022'!$C4,1,SEARCH(\" \",'2022'!$C4,1)+1-2)& \" \" &MID('2022'!$C4,SEARCH(\" \",'2022'!$C4,1)+1,1)& \".\" &MID('2022'!$C4,SEARCH(\" \",'2022'!$C4,SEARCH(\" \",'2022'!$C4,1)+1)+1,1)&\".\",\"\")","v":"Yashinskiy S.A."},"Инспектор строительного контроля / Construction Supervision Inspector",22,22,{"$f":"IF(Таблица2[[#This Row],[№ \nDBN (ПУУМ)]]=\"\",\"\",HYPERLINK(\"#DBN!H1\",_xlfn.CONCAT(\"DBN_№\",Таблица2[[#This Row],[№ \nDBN (ПУУМ)]],\"_\",'2022'!$D4)))","v":"DBN_№22_Yashinskiy S.A."},{"$f":"IF(Таблица2[[#This Row],[№ \nPD (ОД)]]=\"\",\"\",HYPERLINK(\"#PD!H1\",_xlfn.CONCAT(\"PD_№\",'2022'!$G4,\"_\",'2022'!$D4)))","v":"PD_№22_Yashinskiy S.A."},"2022-02-17",1078]
[{"$f":"SUBTOTAL(103,B$2:B5)","v":4},"Иксаев Александр Юрьевич",{"$f":"Translit('2022'!$B5)","v":"Iksaev Aleksandr Yurevich"},{"$f":"IFERROR(MID('2022'!$C5,1,SEARCH(\" \",'2022'!$C5,1)+1-2)& \" \" &MID('2022'!$C5,SEARCH(\" \",'2022'!$C5,1)+1,1)& \".\" &MID('2022'!$C5,SEARCH(\" \",'2022'!$C5,SEARCH(\" \",'2022'!$C5,1)+1)+1,1)&\".\",\"\")","v":"Iksaev A.Y."},"Старший строительный инспектор / Senior construction inspector ",3,null,{"$f":"IF(Таблица2[[#This Row],[№ \nDBN (ПУУМ)]]=\"\",\"\",HYPERLINK(\"#DBN!H1\",_xlfn.CONCAT(\"DBN_№\",Таблица2[[#This Row],[№ \nDBN (ПУУМ)]],\"_\",'2022'!$D5)))","v":"DBN_№3_Iksaev A.Y."},{"$f":"IF(Таблица2[[#This Row],[№ \nPD (ОД)]]=\"\",\"\",HYPERLINK(\"#PD!H1\",_xlfn.CONCAT(\"PD_№\",'2022'!$G5,\"_\",'2022'!$D5)))","v":""},"2021-12-16",1229]
[{"$f":"SUBTOTAL(103,B$2:B6)","v":5},"Моташков Алексей Евгеньевич",{"$f":"Translit('2022'!$B6)","v":"Motashkov Aleksey Evgenevich"},{"$f":"IFERROR(MID('2022'!$C6,1,SEARCH(\" \",'2022'!$C6,1)+1-2)& \" \" &MID('2022'!$C6,SEARCH(\" \",'2022'!$C6,1)+1,1)& \".\" &MID('2022'!$C6,SEARCH(\" \",'2022'!$C6,SEARCH(\" \",'2022'!$C6,1)+1)+1,1)&\".\",\"\")","v":"Motashkov A.E."},"Старший строительный инспектор / Senior construction inspector ",29,null,{"$f":"IF(Таблица2[[#This Row],[№ \nDBN (ПУУМ)]]=\"\",\"\",HYPERLINK(\"#DBN!H1\",_xlfn.CONCAT(\"DBN_№\",Таблица2[[#This Row],[№ \nDBN (ПУУМ)]],\"_\",'2022'!$D6)))","v":"DBN_№29_Motashkov A.E."},{"$f":"IF(Таблица2[[#This Row],[№ \nPD (ОД)]]=\"\",\"\",HYPERLINK(\"#PD!H1\",_xlfn.CONCAT(\"PD_№\",'2022'!$G6,\"_\",'2022'!$D6)))","v":""},"2021-12-16",1229]
[{"$f":"SUBTOTAL(103,B$2:B7)","v":6},"Пугач Игорь Михайлович",{"$f":"Translit('2022'!$B7)","v":"Pugach Igor Mikhaylovich"},{"$f":"IFERROR(MID('2022'!$C7,1,SEARCH(\" \",'2022'!$C7,1)+1-2)& \" \" &MID('2022'!$C7,SEARCH(\" \",'2022'!$C7,1)+1,1)& \".\" &MID('2022'!$C7,SEARCH(\" \",'2022'!$C7,SEARCH(\" \",'2022'!$C7,1)+1)+1,1)&\".\",\"\")","v":"Pugach I.M."},"Старший строительный инспектор / Senior construction inspector ",41,40,{"$f":"IF(Таблица2[[#This Row],[№ \nDBN (ПУУМ)]]=\"\",\"\",HYPERLINK(\"#DBN!H1\",_xlfn.CONCAT(\"DBN_№\",Таблица2[[#This Row],[№ \nDBN (ПУУМ)]],\"_\",'2022'!$D7)))","v":"DBN_№41_Pugach I.M."},{"$f":"IF(Таблица2[[#This Row],[№ \nPD (ОД)]]=\"\",\"\",HYPERLINK(\"#PD!H1\",_xlfn.CONCAT(\"PD_№\",'2022'!$G7,\"_\",'2022'!$D7)))","v":"PD_№40_Pugach I.M."},"2022-05-25",1229]
[{"$f":"SUBTOTAL(103,B$2:B8)","v":7},"Ганжа Олег Владимирович",{"$f":"Translit('2022'!$B8)","v":"Ganzha Oleg Vladimirovich"},{"$f":"IFERROR(MID('2022'!$C8,1,SEARCH(\" \",'2022'!$C8,1)+1-2)& \" \" &MID('2022'!$C8,SEARCH(\" \",'2022'!$C8,1)+1,1)& \".\" &MID('2022'!$C8,SEARCH(\" \",'2022'!$C8,SEARCH(\" \",'2022'!$C8,1)+1)+1,1)&\".\",\"\")","v":"Ganzha O.V."},"Старший строительный инспектор / Senior construction inspector ",34,null,{"$f":"IF(Таблица2[[#This Row],[№ \nDBN (ПУУМ)]]=\"\",\"\",HYPERLINK(\"#DBN!H1\",_xlfn.CONCAT(\"DBN_№\",Таблица2[[#This Row],[№ \nDBN (ПУУМ)]],\"_\",'2022'!$D8)))","v":"DBN_№34_Ganzha O.V."},{"$f":"IF(Таблица2[[#This Row],[№ \nPD (ОД)]]=\"\",\"\",HYPERLINK(\"#PD!H1\",_xlfn.CONCAT(\"PD_№\",'2022'!$G8,\"_\",'2022'!$D8)))","v":""},"2021-12-16",1229]
[{"$f":"SUBTOTAL(103,B$2:B9)","v":8},"Моташков Алексей Евгеньевич",{"$f":"Translit('2022'!$B9)","v":"Motashkov Aleksey Evgenevich"},{"$f":"IFERROR(MID('2022'!$C9,1,SEARCH(\" \",'2022'!$C9,1)+1-2)& \" \" &MID('2022'!$C9,SEARCH(\" \",'2022'!$C9,1)+1,1)& \".\" &MID('2022'!$C9,SEARCH(\" \",'2022'!$C9,SEARCH(\" \",'2022'!$C9,1)+1)+1,1)&\".\",\"\")","v":"Motashkov A.E."},"Инспектор строительного контроля / Construction Supervision Inspector",69,34,{"$f":"IF(Таблица2[[#This Row],[№ \nDBN (ПУУМ)]]=\"\",\"\",HYPERLINK(\"#DBN!H1\",_xlfn.CONCAT(\"DBN_№\",Таблица2[[#This Row],[№ \nDBN (ПУУМ)]],\"_\",'2022'!$D9)))","v":"DBN_№69_Motashkov A.E."},{"$f":"IF(Таблица2[[#This Row],[№ \nPD (ОД)]]=\"\",\"\",HYPERLINK(\"#PD!H1\",_xlfn.CONCAT(\"PD_№\",'2022'!$G9,\"_\",'2022'!$D9)))","v":"PD_№34_Motashkov A.E."},"2021-12-16",1078]
[{"$f":"SUBTOTAL(103,B$2:B10)","v":9},"Почанин Андрей Юрьевич",{"$f":"Translit('2022'!$B10)","v":"Pochanin Andrey Yurevich"},{"$f":"IFERROR(MID('2022'!$C10,1,SEARCH(\" \",'2022'!$C10,1)+1-2)& \" \" &MID('2022'!$C10,SEARCH(\" \",'2022'!$C10,1)+1,1)& \".\" &MID('2022'!$C10,SEARCH(\" \",'2022'!$C10,SEARCH(\" \",'2022'!$C10,1)+1)+1,1)&\".\",\"\")","v":"Pochanin A.Y."},"Инспектор строительного контроля / Construction Supervision Inspector",106,68,{"$f":"IF(Таблица2[[#This Row],[№ \nDBN (ПУУМ)]]=\"\",\"\",HYPERLINK(\"#DBN!H1\",_xlfn.CONCAT(\"DBN_№\",Таблица2[[#This Row],[№ \nDBN (ПУУМ)]],\"_\",'2022'!$D10)))","v":"DBN_№106_Pochanin A.Y."},{"$f":"IF(Таблица2[[#This Row],[№ \nPD (ОД)]]=\"\",\"\",HYPERLINK(\"#PD!H1\",_xlfn.CONCAT(\"PD_№\",'2022'!$G10,\"_\",'2022'!$D10)))","v":"PD_№68_Pochanin A.Y."},"2021-12-16",1078]
[{"$f":"SUBTOTAL(103,B$2:B11)","v":10},"Шалагин Евгений Александрович",{"$f":"Translit('2022'!$B11)","v":"Shalagin Evgeniy Aleksandrovich"},{"$f":"IFERROR(MID('2022'!$C11,1,SEARCH(\" \",'2022'!$C11,1)+1-2)& \" \" &MID('2022'!$C11,SEARCH(\" \",'2022'!$C11,1)+1,1)& \".\" &MID('2022'!$C11,SEARCH(\" \",'2022'!$C11,SEARCH(\" \",'2022'!$C11,1)+1)+1,1)&\".\",\"\")","v":"Shalagin E.A."},"Инспектор строительного контроля / Construction Supervision Inspector",28,null,{"$f":"IF(Таблица2[[#This Row],[№ \nDBN (ПУУМ)]]=\"\",\"\",HYPERLINK(\"#DBN!H1\",_xlfn.CONCAT(\"DBN_№\",Таблица2[[#This Row],[№ \nDBN (ПУУМ)]],\"_\",'2022'!$D11)))","v":"DBN_№28_Shalagin E.A."},{"$f":"IF(Таблица2[[#This Row],[№ \nPD (ОД)]]=\"\",\"\",HYPERLINK(\"#PD!H1\",_xlfn.CONCAT(\"PD_№\",'2022'!$G11,\"_\",'2022'!$D11)))","v":""},"2021-12-16",1078]
[{"$f":"SUBTOTAL(103,B$2:B12)","v":11},"Шамро Алексей Владимирович",{"$f":"Translit('2022'!$B12)","v":"Shamro Aleksey Vladimirovich"},{"$f":"IFERROR(MID('2022'!$C12,1,SEARCH(\" \",'2022'!$C12,1)+1-2)& \" \" &MID('2022'!$C12,SEARCH(\" \",'2022'!$C12,1)+1,1)& \".\" &MID('2022'!$C12,SEARCH(\" \",'2022'!$C12,SEARCH(\" \",'2022'!$C12,1)+1)+1,1)&\".\",\"\")","v":"Shamro A.V."},"Инспектор строительного контроля / Construction Supervision Inspector",null,65,{"$f":"IF(Таблица2[[#This Row],[№ \nDBN (ПУУМ)]]=\"\",\"\",HYPERLINK(\"#DBN!H1\",_xlfn.CONCAT(\"DBN_№\",Таблица2[[#This Row],[№ \nDBN (ПУУМ)]],\"_\",'2022'!$D12)))","v":""},{"$f":"IF(Таблица2[[#This Row],[№ \nPD (ОД)]]=\"\",\"\",HYPERLINK(\"#PD!H1\",_xlfn.CONCAT(\"PD_№\",'2022'!$G12,\"_\",'2022'!$D12)))","v":"PD_№65_Shamro A.V."},"2021-12-16",1078]
[{"$f":"SUBTOTAL(103,B$2:B13)","v":12},"Шевченко Роман Александрович",{"$f":"Translit('2022'!$B13)","v":"Shevchenko Roman Aleksandrovich"},{"$f":"IFERROR(MID('2022'!$C13,1,SEARCH(\" \",'2022'!$C13,1)+1-2)& \" \" &MID('2022'!$C13,SEARCH(\" \",'2022'!$C13,1)+1,1)& \".\" &MID('2022'!$C13,SEARCH(\" \",'2022'!$C13,SEARCH(\" \",'2022'!$C13,1)+1)+1,1)&\".\",\"\")","v":"Shevchenko R.A."},"Инспектор строительного контроля / Construction Supervision Inspector",60,null,{"$f":"IF(Таблица2[[#This Row],[№ \nDBN (ПУУМ)]]=\"\",\"\",HYPERLINK(\"#DBN!H1\",_xlfn.CONCAT(\"DBN_№\",Таблица2[[#This Row],[№ \nDBN (ПУУМ)]],\"_\",'2022'!$D13)))","v":"DBN_№60_Shevchenko R.A."},{"$f":"IF(Таблица2[[#This Row],[№ \nPD (ОД)]]=\"\",\"\",HYPERLINK(\"#PD!H1\",_xlfn.CONCAT(\"PD_№\",'2022'!$G13,\"_\",'2022'!$D13)))","v":""},"2021-12-16",1078]
[{"$f":"SUBTOTAL(103,B$2:B14)","v":13},"Сидоров Евгений Базырович",{"$f":"Translit('2022'!$B14)","v":"Sidorov Evgeniy Bazyrovich"},{"$f":"IFERROR(MID('2022'!$C14,1,SEARCH(\" \",'2022'!$C14,1)+1-2)& \" \" &MID('2022'!$C14,SEARCH(\" \",'2022'!$C14,1)+1,1)& \".\" &MID('2022'!$C14,SEARCH(\" \",'2022'!$C14,SEARCH(\" \",'2022'!$C14,1)+1)+1,1)&\".\",\"\")","v":"Sidorov E.B."},"Инспектор строительного контроля / Construction Supervision Inspector",null,28,{"$f":"IF(Таблица2[[#This Row],[№ \nDBN (ПУУМ)]]=\"\",\"\",HYPERLINK(\"#DBN!H1\",_xlfn.CONCAT(\"DBN_№\",Таблица2[[#This Row],[№ \nDBN (ПУУМ)]],\"_\",'2022'!$D14)))","v":""},{"$f":"IF(Таблица2[[#This Row],[№ \nPD (ОД)]]=\"\",\"\",HYPERLINK(\"#PD!H1\",_xlfn.CONCAT(\"PD_№\",'2022'!$G14,\"_\",'2022'!$D14)))","v":"PD_№28_Sidorov E.B."},"2021-12-16",1078]
[{"$f":"SUBTOTAL(103,B$2:B15)","v":14},"Аглутдинов Сагит Габднурович",{"$f":"Translit('2022'!$B15)","v":"Aglutdinov Sagit Gabdnurovich"},{"$f":"IFERROR(MID('2022'!$C15,1,SEARCH(\" \",'2022'!$C15,1)+1-2)& \" \" &MID('2022'!$C15,SEARCH(\" \",'2022'!$C15,1)+1,1)& \".\" &MID('2022'!$C15,SEARCH(\" \",'2022'!$C15,SEARCH(\" \",'2022'!$C15,1)+1)+1,1)&\".\",\"\")","v":"Aglutdinov S.G."},"Инспектор строительного контроля / Construction Supervision Inspector",18,18,{"$f":"IF(Таблица2[[#This Row],[№ \nDBN (ПУУМ)]]=\"\",\"\",HYPERLINK(\"#DBN!H1\",_xlfn.CONCAT(\"DBN_№\",Таблица2[[#This Row],[№ \nDBN (ПУУМ)]],\"_\",'2022'!$D15)))","v":"DBN_№18_Aglutdinov S.G."},{"$f":"IF(Таблица2[[#This Row],[№ \nPD (ОД)]]=\"\",\"\",HYPERLINK(\"#PD!H1\",_xlfn.CONCAT(\"PD_№\",'2022'!$G15,\"_\",'2022'!$D15)))","v":"PD_№18_Aglutdinov S.G."},"2021-12-16",1078]
[{"$f":"SUBTOTAL(103,B$2:B16)","v":15},"Зильберман Олег Юрьевич",{"$f":"Translit('2022'!$B16)","v":"Zilberman Oleg Yurevich"},{"$f":"IFERROR(MID('2022'!$C16,1,SEARCH(\" \",'2022'!$C16,1)+1-2)& \" \" &MID('2022'!$C16,SEARCH(\" \",'2022'!$C16,1)+1,1)& \".\" &MID('2022'!$C16,SEARCH(\" \",'2022'!$C16,SEARCH(\" \",'2022'!$C16,1)+1)+1,1)&\".\",\"\")","v":"Zilberman O.Y."},"Инспектор строительного контроля / Construction Supervision Inspector",16,16,{"$f":"IF(Таблица2[[#This Row],[№ \nDBN (ПУУМ)]]=\"\",\"\",HYPERLINK(\"#DBN!H1\",_xlfn.CONCAT(\"DBN_№\",Таблица2[[#This Row],[№ \nDBN (ПУУМ)]],\"_\",'2022'!$D16)))","v":"DBN_№16_Zilberman O.Y."},{"$f":"IF(Таблица2[[#This Row],[№ \nPD (ОД)]]=\"\",\"\",HYPERLINK(\"#PD!H1\",_xlfn.CONCAT(\"PD_№\",'2022'!$G16,\"_\",'2022'!$D16)))","v":"PD_№16_Zilberman O.Y."},"2021-12-16",1078]
[{"$f":"SUBTOTAL(103,B$2:B17)","v":16},"Келлер Андрей Вольдемарович",{"$f":"Translit('2022'!$B17)","v":"Keller Andrey Voldemarovich"},{"$f":"IFERROR(MID('2022'!$C17,1,SEARCH(\" \",'2022'!$C17,1)+1-2)& \" \" &MID('2022'!$C17,SEARCH(\" \",'2022'!$C17,1)+1,1)& \".\" &MID('2022'!$C17,SEARCH(\" \",'2022'!$C17,SEARCH(\" \",'2022'!$C17,1)+1)+1,1)&\".\",\"\")","v":"Keller A.V."},"Инспектор строительного контроля / Construction Supervision Inspector",8,8,{"$f":"IF(Таблица2[[#This Row],[№ \nDBN (ПУУМ)]]=\"\",\"\",HYPERLINK(\"#DBN!H1\",_xlfn.CONCAT(\"DBN_№\",Таблица2[[#This Row],[№ \nDBN (ПУУМ)]],\"_\",'2022'!$D17)))","v":"DBN_№8_Keller A.V."},{"$f":"IF(Таблица2[[#This Row],[№ \nPD (ОД)]]=\"\",\"\",HYPERLINK(\"#PD!H1\",_xlfn.CONCAT(\"PD_№\",'2022'!$G17,\"_\",'2022'!$D17)))","v":"PD_№8_Keller A.V."},"2021-12-16",1078]
[{"$f":"SUBTOTAL(103,B$2:B18)","v":17},"Кочубей Константин Викторович",{"$f":"Translit('2022'!$B18)","v":"Kochubey Konstantin Viktorovich"},{"$f":"IFERROR(MID('2022'!$C18,1,SEARCH(\" \",'2022'!$C18,1)+1-2)& \" \" &MID('2022'!$C18,SEARCH(\" \",'2022'!$C18,1)+1,1)& \".\" &MID('2022'!$C18,SEARCH(\" \",'2022'!$C18,SEARCH(\" \",'2022'!$C18,1)+1)+1,1)&\".\",\"\")","v":"Kochubey K.V."},"Инспектор строительного контроля / Construction Supervision Inspector",25,25,{"$f":"IF(Таблица2[[#This Row],[№ \nDBN (ПУУМ)]]=\"\",\"\",HYPERLINK(\"#DBN!H1\",_xlfn.CONCAT(\"DBN_№\",Таблица2[[#This Row],[№ \nDBN (ПУУМ)]],\"_\",'2022'!$D18)))","v":"DBN_№25_Kochubey K.V."},{"$f":"IF(Таблица2[[#This Row],[№ \nPD (ОД)]]=\"\",\"\",HYPERLINK(\"#PD!H1\",_xlfn.CONCAT(\"PD_№\",'2022'!$G18,\"_\",'2022'!$D18)))","v":"PD_№25_Kochubey K.V."},"2021-12-16",1078]
[{"$f":"SUBTOTAL(103,B$2:B19)","v":18},"Крикунов Андрей Константинович",{"$f":"Translit('2022'!$B19)","v":"Krikunov Andrey Konstantinovich"},{"$f":"IFERROR(MID('2022'!$C19,1,SEARCH(\" \",'2022'!$C19,1)+1-2)& \" \" &MID('2022'!$C19,SEARCH(\" \",'2022'!$C19,1)+1,1)& \".\" &MID('2022'!$C19,SEARCH(\" \",'2022'!$C19,SEARCH(\" \",'2022'!$C19,1)+1)+1,1)&\".\",\"\")","v":"Krikunov A.K."},"Инспектор строительного контроля / Construction Supervision Inspector",9,9,{"$f":"IF(Таблица2[[#This Row],[№ \nDBN (ПУУМ)]]=\"\",\"\",HYPERLINK(\"#DBN!H1\",_xlfn.CONCAT(\"DBN_№\",Таблица2[[#This Row],[№ \nDBN (ПУУМ)]],\"_\",'2022'!$D19)))","v":"DBN_№9_Krikunov A.K."},{"$f":"IF(Таблица2[[#This Row],[№ \nPD (ОД)]]=\"\",\"\",HYPERLINK(\"#PD!H1\",_xlfn.CONCAT(\"PD_№\",'2022'!$G19,\"_\",'2022'!$D19)))","v":"PD_№9_Krikunov A.K."},"2021-12-16",1078]
[{"$f":"SUBTOTAL(103,B$2:B20)","v":19},"Маматов Константин Викторович",{"$f":"Translit('2022'!$B20)","v":"Mamatov Konstantin Viktorovich"},{"$f":"IFERROR(MID('2022'!$C20,1,SEARCH(\" \",'2022'!$C20,1)+1-2)& \" \" &MID('2022'!$C20,SEARCH(\" \",'2022'!$C20,1)+1,1)& \".\" &MID('2022'!$C20,SEARCH(\" \",'2022'!$C20,SEARCH(\" \",'2022'!$C20,1)+1)+1,1)&\".\",\"\")","v":"Mamatov K.V."},"Инспектор строительного контроля / Construction Supervision Inspector",17,17,{"$f":"IF(Таблица2[[#This Row],[№ \nDBN (ПУУМ)]]=\"\",\"\",HYPERLINK(\"#DBN!H1\",_xlfn.CONCAT(\"DBN_№\",Таблица2[[#This Row],[№ \nDBN (ПУУМ)]],\"_\",'2022'!$D20)))","v":"DBN_№17_Mamatov K.V."},{"$f":"IF(Таблица2[[#This Row],[№ \nPD (ОД)]]=\"\",\"\",HYPERLINK(\"#PD!H1\",_xlfn.CONCAT(\"PD_№\",'2022'!$G20,\"_\",'2022'!$D20)))","v":"PD_№17_Mamatov K.V."},"2021-12-16",1078]
{"$rows_left_out":50}
{"sheet":"DBN","index":1,"n_rows":26,"n_cols":10,"rows_kept":26,"cut":false,"hidden":false,"merged":[[6,0,6,10],[1,0,1,10],[3,0,3,10],[4,0,4,10],[5,0,5,10],[13,0,13,4],[13,5,13,6],[13,9,13,10],[7,0,7,10],[8,0,8,4],[8,5,8,10],[9,0,9,4],[9,5,9,10],[10,0,10,4],[10,5,10,10],[11,0,11,4],[11,5,11,7],[11,8,11,10],[12,0,12,4],[12,5,12,10],[14,0,14,4],[14,5,14,10],[15,0,15,4],[15,5,15,10],[15,11,17,11],[16,1,16,3],[16,5,16,7],[16,8,16,9],[17,1,17,3],[17,5,17,7],[17,8,17,9],[18,1,18,3],[18,5,18,7],[18,8,18,9],[19,0,19,4],[19,5,19,7],[19,8,19,9],[20,0,20,4],[20,5,20,10],[22,5,22,10],[24,5,24,7],[25,5,25,7]]}
[null,null,null,null,null,null,null,"DBN_№18_Aglutdinov S.G."]
["Конфиденциальная информация (C2) / Confidential information (C2)"]
[]
["ФОРМА УТВЕРЖДЕНИЯ ПЕРСОНАЛА (ФУП)"]
[{"$f":"_xlfn.CONCAT(\"№ \",INDEX('2022'!$F$2:$F$69,MATCH(DBN!H1,'2022'!$I$2:$I$69,0)),\" к Договору оказания услуг № R-DBN-20-0013 от 30.04.2020\")","v":{"$error":"#N/A"}}]
["PERSONNEL AUTHORIZATION FORM (PAF)"]
[{"$f":"_xlfn.CONCAT(\"№ \",INDEX('2022'!$F$2:$F$69,MATCH(DBN!H1,'2022'!$I$2:$I$69,0)),\" to Service Agreement № R-DBN-20-0013 от 30.04.2020\")","v":{"$error":"#N/A"}}]
[]
["ФИО кандидата полностью",null,null,null,null,{"$f":"INDEX('2022'!B2:B144,MATCH(DBN!H1,'2022'!$I$2:$I$144,0))","v":{"$error":"#N/A"}}]
["/ Full Name of Candidate:",null,null,null,null,{"$f":"_xlfn.CONCAT(\"/ \",INDEX('2022'!C2:C69,MATCH(DBN!H1,'2022'!$I$2:$I$144,0)))","v":{"$error":"#N/A"}}]
["Категория специалиста\n/ Job Category according to the Agreement:",null,null,null,null,"Инспектор строительного контроля / Construction Supervision Inspector"]
["Резюме прилагается\n/ CV attached:",null,null,null,null,"R  Yes/Да",null,null,"☐  No/Нет"]
["Ставка специалиста в час согласно Договору\n/ Specialist hourly rate according to the Agreement:",null,null,null,null,{"$f":"_xlfn.CONCAT(TEXT(INDEX('2022'!K2:K69,MATCH(DBN!H1,'2022'!$I$2:$I$69,0)),\"00,00\"),\" ₱\")","v":{"$error":"#N/A"}}]
["Согласованный срок действия\n/ Approved validity period:",null,null,null,null,"From: / С ",null,{"$f":"INDEX('2022'!$J$2:$J$69,MATCH(DBN!H1,'2022'!$I$2:$I$69,0))","v":{"$error":"#N/A"}},"Till: / До ","2022-12-31"]
[]
["Уполномоченный Представитель Исполнителя / \nContractor Authorized Representative",null,null,null,null,"Уполномоченный Представитель Компании / \nCompany Authorized Representative"]
["Подпись / Signature:",null,null,null,null,"Подпись / Signature:"]
["ФИО / Name:",null,null,null,null,"ФИО / Name:"]
["Должность / Title:",null,null,null,null,"Должность / Title:"]
[null,null,null,null,null,"Дата / Date:"]
{"$rows_left_out":7}
{"sheet":"PD","index":2,"n_rows":26,"n_cols":10,"rows_kept":26,"cut":false,"hidden":false,"merged":[[24,5,24,7],[25,5,25,7],[20,5,20,10],[15,11,17,11],[17,5,17,7],[18,5,18,7],[15,5,15,10],[22,5,22,10],[20,0,20,4],[1,0,1,10],[3,0,3,10],[4,0,4,10],[5,0,5,10],[6,0,6,10],[10,0,10,4],[7,0,7,10],[15,0,15,4],[13,9,13,10],[8,0,8,4],[9,0,9,4],[14,0,14,4],[13,0,13,4],[12,0,12,4],[11,0,11,4],[8,5,8,10],[9,5,9,10],[10,5,10,10],[19,5,19,7],[19,8,19,9],[11,5,11,7],[11,8,11,10],[13,5,13,6],[14,5,14,10],[12,5,12,10],[19,0,19,4],[16,1,16,3],[17,1,17,3],[18,1,18,3],[16,8,16,9],[17,8,17,9],[18,8,18,9],[16,5,16,7]]}
[null,null,null,null,null,null,null,"PD_№21_Paulskiy O.I."]
["Конфиденциальная информация (C2) / Confidential information (C2)"]
[]
["ФОРМА УТВЕРЖДЕНИЯ ПЕРСОНАЛА (ФУП)"]
[{"$f":"_xlfn.CONCAT(\"№ \",INDEX('2022'!G2:G69,MATCH(PD!H1,'2022'!$I$2:$I$69,0)),\" к Договору оказания услуг № R-PD-20-0035 от 02.07.2020\")","v":"№ 21 к Договору оказания услуг № R-PD-20-0035 от 02.07.2020"}]
["PERSONNEL AUTHORIZATION FORM (PAF)"]
[{"$f":"_xlfn.CONCAT(\"№ \",INDEX('2022'!G2:G69,MATCH(PD!H1,'2022'!$I$2:$I$69,0)),\" to Service Agreement № R-PD-20-0035 от 02.07.2020\")","v":"№ 21 to Service Agreement № R-PD-20-0035 от 02.07.2020"}]
[]
["ФИО кандидата полностью",null,null,null,null,{"$f":"INDEX('2022'!B2:B144,MATCH(PD!H1,'2022'!$I$2:$I$144,0))","v":"Паульский Олег Иосифович"}]
["/ Full Name of Candidate:",null,null,null,null,{"$f":"_xlfn.CONCAT(\"/ \",INDEX('2022'!C2:C69,MATCH(PD!H1,'2022'!$I$2:$I$144,0)))","v":"/ Paulskiy Oleg Iosifovich"}]
["Категория специалиста\n/ Job Category according to the Agreement:",null,null,null,null,"Инспектор строительного контроля / Construction Supervision Inspector"]
["Резюме прилагается\n/ CV attached:",null,null,null,null,"R  Yes/Да",null,null,"☐  No/Нет"]
["Ставка специалиста в час согласно Договору\n/ Specialist hourly rate according to the Agreement:",null,null,null,null,{"$f":"_xlfn.CONCAT(TEXT(INDEX('2022'!K2:K69,MATCH(PD!H1,'2022'!$I$2:$I$69,0)),\"00,00\"),\" ₱\")","v":"1078,00 ₱"}]
["Согласованный срок действия\n/ Approved validity period:",null,null,null,null,"From: / С ",null,{"$f":"INDEX('2022'!$J$2:$J$69,MATCH(PD!H1,'2022'!$I$2:$I$69,0))","v":"2021-12-16"},"Till: / До ","2022-12-31"]
[]
["Уполномоченный Представитель Исполнителя / \nContractor Authorized Representative",null,null,null,null,"Уполномоченный Представитель Компании / \nCompany Authorized Representative"]
["Подпись / Signature:",null,null,null,null,"Подпись / Signature:"]
["ФИО / Name:",null,null,null,null,"ФИО / Name:"]
["Должность / Title:",null,null,null,null,"Должность / Title:"]
[null,null,null,null,null,"Дата / Date:"]
{"$rows_left_out":6}