{"text_format":"1","workbook":"xlsx","n_sheets":4,"sheets":["Состав блюд","Движение продуктов","Прих.накладная","Выгрузка из прих.накл."],"not_rendered":{"charts":0,"images":0,"macros":1,"external_links":0,"defined_names":6,"comments":0,"pivot_tables":0},"unopened":[],"bounds":{"document_bytes":16777216,"sheet_cells":100000,"rows_first":2000,"rows_last":500,"rows_between":2000,"halvings":0,"cell_chars":16384,"cell_head_chars":4096},"cells_cut":0,"cells_raw":0,"read":"whole","date_system":"1900"}

{"sheet":"Состав блюд","index":0,"n_rows":32,"n_cols":1,"rows_kept":32,"cut":false,"hidden":false,"merged":[]}
[]
[]
["Наименование продукта"]
["Говядина"]
["Гречка"]
["Какао в порошке"]
["Капуста"]
["Картофель"]
["Колбаса \"Докторская\""]
["Курица"]
["Лавровый лист"]
["Лук"]
["Майонез"]
["Масло растительное"]
["Масло сливочное"]
["Морковь"]
["Огурец свежий"]
["Перец сладкий"]
["Помидоры"]
["Рис"]
["Сахар"]
["Свекла"]
["Свинина"]
["Соль"]
["Сухари панировочные"]
["Сыр"]
["Томатная паста"]
["Уксус 9%-ный"]
["Чай"]
["Яйца куриные"]
["Арбуз"]
["Горох"]

{"sheet":"Движение продуктов","index":1,"n_rows":1086,"n_cols":5,"rows_kept":1086,"cut":false,"hidden":false,"merged":[]}
["Наименование продукта","Нач.остаток, кг","Приход, кг"]
[{"$f":"'Состав блюд'!A4","v":"Говядина"},1,{"$f":"SUM(IF(MOD(ROW('Выгрузка из прих.накл.'!$E$2:$E$19),2)=0,'Выгрузка из прих.накл.'!$E$2:$E$19))","v":15},null,"СУММ(ЕСЛИ(ОСТАТ(СТРОКА('Выгрузка из прих.накл.'!$E$2:$E$19);2)=0;'Выгрузка из прих.накл.'!$E$2:$E$19))"]
[{"$f":"'Состав блюд'!A5","v":"Гречка"},1,{"$f":"SUM(IF(MOD(ROW('Выгрузка из прих.накл.'!$F$2:$F$19),2)=0,'Выгрузка из прих.накл.'!$F$2:$F$19))","v":63}]
[{"$f":"'Состав блюд'!A6","v":"Какао в порошке"},1,{"$f":"SUM(IF(MOD(ROW('Выгрузка из прих.накл.'!$G$2:$G$19),2)=0,'Выгрузка из прих.накл.'!$G$2:$G$19))","v":10}]
[{"$f":"'Состав блюд'!A7","v":"Капуста"},1,{"$f":"SUM(IF(MOD(ROW('Выгрузка из прих.накл.'!$H$2:$H$19),2)=0,'Выгрузка из прих.накл.'!$H$2:$H$19))","v":5}]
[{"$f":"'Состав блюд'!A8","v":"Картофель"},1,{"$f":"SUM(IF(MOD(ROW('Выгрузка из прих.накл.'!$I$2:$I$19),2)=0,'Выгрузка из прих.накл.'!$I$2:$I$19))","v":0}]
[{"$f":"'Состав блюд'!A9","v":"Колбаса \"Докторская\""},1,{"$f":"SUM(IF(MOD(ROW('Выгрузка из прих.накл.'!$J$2:$J$19),2)=0,'Выгрузка из прих.накл.'!$J$2:$J$19))","v":0}]
[{"$f":"'Состав блюд'!A10","v":"Курица"},1,{"$f":"SUM(IF(MOD(ROW('Выгрузка из прих.накл.'!$K$2:$K$19),2)=0,'Выгрузка из прих.накл.'!$K$2:$K$19))","v":0}]
[{"$f":"'Состав блюд'!A11","v":"Лавровый лист"},1,{"$f":"SUM(IF(MOD(ROW('Выгрузка из прих.накл.'!$L$2:$L$19),2)=0,'Выгрузка из прих.накл.'!$L$2:$L$19))","v":0}]
[{"$f":"'Состав блюд'!A12","v":"Лук"},1,{"$f":"SUM(IF(MOD(ROW('Выгрузка из прих.накл.'!$M$2:$M$19),2)=0,'Выгрузка из прих.накл.'!$M$2:$M$19))","v":0}]
[{"$f":"'Состав блюд'!A13","v":"Майонез"},1,{"$f":"SUM(IF(MOD(ROW('Выгрузка из прих.накл.'!$N$2:$N$19),2)=0,'Выгрузка из прих.накл.'!$N$2:$N$19))","v":0}]
[{"$f":"'Состав блюд'!A14","v":"Масло растительное"},1,{"$f":"SUM(IF(MOD(ROW('Выгрузка из прих.накл.'!$O$2:$O$19),2)=0,'Выгрузка из прих.накл.'!$O$2:$O$19))","v":0}]
[{"$f":"'Состав блюд'!A15","v":"Масло сливочное"},1,{"$f":"SUM(IF(MOD(ROW('Выгрузка из прих.накл.'!$P$2:$P$19),2)=0,'Выгрузка из прих.накл.'!$P$2:$P$19))","v":0}]
[{"$f":"'Состав блюд'!A16","v":"Морковь"},1,{"$f":"SUM(IF(MOD(ROW('Выгрузка из прих.накл.'!$Q$2:$Q$19),2)=0,'Выгрузка из прих.накл.'!$Q$2:$Q$19))","v":0}]
[{"$f":"'Состав блюд'!A17","v":"Огурец свежий"},1,{"$f":"SUM(IF(MOD(ROW('Выгрузка из прих.накл.'!$R$2:$R$19),2)=0,'Выгрузка из прих.накл.'!$R$2:$R$19))","v":0}]
[{"$f":"'Состав блюд'!A18","v":"Перец сладкий"},1,{"$f":"SUM(IF(MOD(ROW('Выгрузка из прих.накл.'!$S$2:$S$19),2)=0,'Выгрузка из прих.накл.'!$S$2:$S$19))","v":0}]
[{"$f":"'Состав блюд'!A19","v":"Помидоры"},1,{"$f":"SUM(IF(MOD(ROW('Выгрузка из прих.накл.'!$T$2:$T$19),2)=0,'Выгрузка из прих.накл.'!$T$2:$T$19))","v":0}]
[{"$f":"'Состав блюд'!A20","v":"Рис"},1,{"$f":"SUM(IF(MOD(ROW('Выгрузка из прих.накл.'!$U$2:$U$19),2)=0,'Выгрузка из прих.накл.'!$U$2:$U$19))","v":10}]
[{"$f":"'Состав блюд'!A21","v":"Сахар"},1,{"$f":"SUM(IF(MOD(ROW('Выгрузка из прих.накл.'!$V$2:$V$19),2)=0,'Выгрузка из прих.накл.'!$V$2:$V$19))","v":0}]
[{"$f":"'Состав блюд'!A22","v":"Свекла"},1,{"$f":"SUM(IF(MOD(ROW('Выгрузка из прих.накл.'!$W$2:$W$19),2)=0,'Выгрузка из прих.накл.'!$W$2:$W$19))","v":0}]
[{"$f":"'Состав блюд'!A23","v":"Свинина"},1,{"$f":"SUM(IF(MOD(ROW('Выгрузка из прих.накл.'!$X$2:$X$19),2)=0,'Выгрузка из прих.накл.'!$X$2:$X$19))","v":0}]
[{"$f":"'Состав блюд'!A24","v":"Соль"},1,{"$f":"SUM(IF(MOD(ROW('Выгрузка из прих.накл.'!$Y$2:$Y$19),2)=0,'Выгрузка из прих.накл.'!$Y$2:$Y$19))","v":0}]
[{"$f":"'Состав блюд'!A25","v":"Сухари панировочные"},1,{"$f":"SUM(IF(MOD(ROW('Выгрузка из прих.накл.'!$Z$2:$Z$19),2)=0,'Выгрузка из прих.накл.'!$Z$2:$Z$19))","v":0}]
[{"$f":"'Состав блюд'!A26","v":"Сыр"},1,{"$f":"SUM(IF(MOD(ROW('Выгрузка из прих.накл.'!$AA$2:$AA$19),2)=0,'Выгрузка из прих.накл.'!$AA$2:$AA$19))","v":0}]
[{"$f":"'Состав блюд'!A27","v":"Томатная паста"},1,{"$f":"SUM(IF(MOD(ROW('Выгрузка из прих.накл.'!$AB$2:$AB$19),2)=0,'Выгрузка из прих.накл.'!$AB$2:$AB$19))","v":0}]
[{"$f":"'Состав блюд'!A28","v":"Уксус 9%-ный"},1,{"$f":"SUM(IF(MOD(ROW('Выгрузка из прих.накл.'!$AC$2:$AC$19),2)=0,'Выгрузка из прих.накл.'!$AC$2:$AC$19))","v":0}]
[{"$f":"'Состав блюд'!A29","v":"Чай"},1,{"$f":"SUM(IF(MOD(ROW('Выгрузка из прих.накл.'!$AD$2:$AD$19),2)=0,'Выгрузка из прих.накл.'!$AD$2:$AD$19))","v":0}]
[{"$f":"'Состав блюд'!A30","v":"Яйца куриные"},1,{"$f":"SUM(IF(MOD(ROW('Выгрузка из прих.накл.'!$AE$2:$AE$19),2)=0,'Выгрузка из прих.накл.'!$AE$2:$AE$19))","v":0}]
[{"$f":"'Состав блюд'!A31","v":"Арбуз"},1,{"$f":"SUM(IF(MOD(ROW('Выгрузка из прих.накл.'!$AF$2:$AF$19),2)=0,'Выгрузка из прих.накл.'!$AF$2:$AF$19))","v":0}]
[{"$f":"'Состав блюд'!A32","v":"Горох"},1,{"$f":"SUM(IF(MOD(ROW('Выгрузка из прих.накл.'!$AG$2:$AG$19),2)=0,'Выгрузка из прих.накл.'!$AG$2:$AG$19))","v":0}]
[{"$f":"'Состав блюд'!A33","v":0}]
[{"$f":"'Состав блюд'!A34","v":0}]
[{"$f":"'Состав блюд'!A35","v":0}]
[{"$f":"'Состав блюд'!A36","v":0}]
[{"$f":"'Состав блюд'!A37","v":0}]
[{"$f":"'Состав блюд'!A38","v":0}]
[{"$f":"'Состав блюд'!A39","v":0}]
[{"$f":"'Состав блюд'!A40","v":0}]
[{"$f":"'Состав блюд'!A41","v":0}]
[{"$f":"'Состав блюд'!A42","v":0}]
[{"$f":"'Состав блюд'!A43","v":0}]
[{"$f":"'Состав блюд'!A44","v":0}]
[{"$f":"'Состав блюд'!A45","v":0}]
[{"$f":"'Состав блюд'!A46","v":0}]
[{"$f":"'Состав блюд'!A47","v":0}]
[{"$f":"'Состав блюд'!A48","v":0}]
[{"$f":"'Состав блюд'!A49","v":0}]
[{"$f":"'Состав блюд'!A50","v":0}]
[{"$f":"'Состав блюд'!A51","v":0}]
[{"$f":"'Состав блюд'!A52","v":0}]
[{"$f":"'Состав блюд'!A53","v":0}]
[{"$f":"'Состав блюд'!A54","v":0}]
[{"$f":"'Состав блюд'!A55","v":0}]
[{"$f":"'Состав блюд'!A56","v":0}]
[{"$f":"'Состав блюд'!A57","v":0}]
[{"$f":"'Состав блюд'!A58","v":0}]
[{"$f":"'Состав блюд'!A59","v":0}]
[{"$f":"'Состав блюд'!A60","v":0}]
[{"$f":"'Состав блюд'!A61","v":0}]
[{"$f":"'Состав блюд'!A62","v":0}]
[{"$f":"'Состав блюд'!A63","v":0}]
[{"$f":"'Состав блюд'!A64","v":0}]
[{"$f":"'Состав блюд'!A65","v":0}]
[{"$f":"'Состав блюд'!A66","v":0}]
[{"$f":"'Состав блюд'!A67","v":0}]
[{"$f":"'Состав блюд'!A68","v":0}]
[{"$f":"'Состав блюд'!A69","v":0}]
[{"$f":"'Состав блюд'!A70","v":0}]
[{"$f":"'Состав блюд'!A71","v":0}]
[{"$f":"'Состав блюд'!A72","v":0}]
[{"$f":"'Состав блюд'!A73","v":0}]
[{"$f":"'Состав блюд'!A74","v":0}]
[{"$f":"'Состав блюд'!A75","v":0}]
[{"$f":"'Состав блюд'!A76","v":0}]
[{"$f":"'Состав блюд'!A77","v":0}]
[{"$f":"'Состав блюд'!A78","v":0}]
[{"$f":"'Состав блюд'!A79","v":0}]
[{"$f":"'Состав блюд'!A80","v":0}]
[{"$f":"'Состав блюд'!A81","v":0}]
[{"$f":"'Состав блюд'!A82","v":0}]
[{"$f":"'Состав блюд'!A83","v":0}]
[{"$f":"'Состав блюд'!A84","v":0}]
[{"$f":"'Состав блюд'!A85","v":0}]
[{"$f":"'Состав блюд'!A86","v":0}]
[{"$f":"'Состав блюд'!A87","v":0}]
[{"$f":"'Состав блюд'!A88","v":0}]
[{"$f":"'Состав блюд'!A89","v":0}]
[{"$f":"'Состав блюд'!A90","v":0}]
[{"$f":"'Состав блюд'!A91","v":0}]
[{"$f":"'Состав блюд'!A92","v":0}]
[{"$f":"'Состав блюд'!A93","v":0}]
[{"$f":"'Состав блюд'!A94","v":0}]
[{"$f":"'Состав блюд'!A95","v":0}]
[{"$f":"'Состав блюд'!A96","v":0}]
[{"$f":"'Состав блюд'!A97","v":0}]
[{"$f":"'Состав блюд'!A98","v":0}]
[{"$f":"'Состав блюд'!A99","v":0}]
[{"$f":"'Состав блюд'!A100","v":0}]
[{"$f":"'Состав блюд'!A101","v":0}]
[{"$f":"'Состав блюд'!A102","v":0}]
[{"$f":"'Состав блюд'!A103","v":0}]
[{"$f":"'Состав блюд'!A104","v":0}]
[{"$f":"'Состав блюд'!A105","v":0}]
[{"$f":"'Состав блюд'!A106","v":0}]
[{"$f":"'Состав блюд'!A107","v":0}]
[{"$f":"'Состав блюд'!A108","v":0}]
[{"$f":"'Состав блюд'!A109","v":0}]
[{"$f":"'Состав блюд'!A110","v":0}]
[{"$f":"'Состав блюд'!A111","v":0}]
[{"$f":"'Состав блюд'!A112","v":0}]
[{"$f":"'Состав блюд'!A113","v":0}]
[{"$f":"'Состав блюд'!A114","v":0}]
[{"$f":"'Состав блюд'!A115","v":0}]
[{"$f":"'Состав блюд'!A116","v":0}]
[{"$f":"'Состав блюд'!A117","v":0}]
[{"$f":"'Состав блюд'!A118","v":0}]
[{"$f":"'Состав блюд'!A119","v":0}]
[{"$f":"'Состав блюд'!A120","v":0}]
[{"$f":"'Состав блюд'!A121","v":0}]
[{"$f":"'Состав блюд'!A122","v":0}]
{"$rows_left_out":967}
{"sheet":"Прих.накладная","index":2,"n_rows":59,"n_cols":28,"rows_kept":59,"cut":false,"hidden":false,"merged":[[0,5,0,23],[1,5,1,11],[1,12,1,23],[2,5,2,23],[3,5,3,20],[3,21,3,23],[7,27,11,27],[7,28,11,28],[7,29,11,29],[6,5,6,18],[6,19,6,20],[6,21,6,23],[4,5,4,15],[4,16,4,20],[4,21,4,23],[5,5,5,18],[5,19,5,20],[5,21,5,23],[7,30,11,30],[8,5,8,11],[9,5,9,20],[9,21,9,23],[10,5,10,8],[10,9,10,20],[10,21,10,23],[11,5,11,16],[11,17,11,20],[11,21,11,23],[7,5,7,11],[7,12,8,20],[7,21,8,23],[12,5,12,23],[13,5,13,10],[13,11,13,17],[13,18,13,22],[7,26,11,26],[14,6,14,10],[14,11,14,17],[14,18,14,22],[15,5,15,23],[16,6,16,12],[16,13,16,14],[16,15,16,19],[16,20,16,21],[16,22,16,23],[17,6,17,12],[17,13,17,14],[17,15,17,19],[17,20,17,21],[17,22,17,23],[18,6,18,12],[18,13,18,14],[18,15,18,19],[18,20,18,21],[18,22,18,23],[19,6,19,12],[19,13,19,14],[19,15,19,19],[19,20,19,21],[19,22,19,23],[20,6,20,12],[20,13,20,14],[20,15,20,19],[20,20,20,21],[20,22,20,23],[21,6,21,12],[21,13,21,14],[21,15,21,19],[21,20,21,21],[21,22,21,23],[22,6,22,12],[22,13,22,14],[22,15,22,19],[22,20,22,21],[22,22,22,23],[23,6,23,12],[23,13,23,14],[23,15,23,19],[23,20,23,21],[23,22,23,23],[24,6,24,12],[24,13,24,14],[24,15,24,19],[24,20,24,21],[24,22,24,23],[25,6,25,12],[25,13,25,14],[25,15,25,19],[25,20,25,21],[25,22,25,23],[26,6,26,12],[26,13,26,14],[26,15,26,19],[26,20,26,21],[26,22,26,23],[59,5,59,23],[58,5,58,21],[58,22,58,23],[27,6,27,12],[27,13,27,14],[27,15,27,19],[27,20,27,21],[27,22,27,23],[28,6,28,12],[28,13,28,14],[28,15,28,19],[28,20,28,21],[28,22,28,23],[50,15,50,19],[50,20,50,21],[50,22,50,23],[49,13,49,14],[49,22,49,23],[46,13,46,14],[53,15,53,19],[53,20,53,21],[53,22,53,23],[54,6,54,12],[54,13,54,14],[54,15,54,19],[54,20,54,21],[54,22,54,23],[51,6,51,12],[51,13,51,14],[51,15,51,19],[51,20,51,21],[51,22,51,23],[52,6,52,12],[52,13,52,14],[52,15,52,19],[52,20,52,21],[52,22,52,23],[57,15,57,19],[57,20,57,21],[57,22,57,23],[55,6,55,12],[55,13,55,14],[55,15,55,19],[55,20,55,21],[55,22,55,23],[56,6,56,12],[56,13,56,14],[56,15,56,19],[56,20,56,21],[56,22,56,23],[35,13,35,14],[36,13,36,14],[57,6,57,12],[57,13,57,14],[53,6,53,12],[53,13,53,14],[50,6,50,12],[50,13,50,14],[43,6,43,12],[41,6,41,12],[42,6,42,12],[37,13,37,14],[38,13,38,14],[49,6,49,12],[35,6,35,12],[36,6,36,12],[37,6,37,12],[38,6,38,12],[47,13,47,14],[48,13,48,14],[45,13,45,14],[44,6,44,12],[45,6,45,12],[46,6,46,12],[29,6,29,12],[30,6,30,12],[31,6,31,12],[32,6,32,12],[33,6,33,12],[34,6,34,12],[31,20,31,21],[32,20,32,21],[33,20,33,21],[34,20,34,21],[30,20,30,21],[29,15,29,19],[30,15,30,19],[31,15,31,19],[32,15,32,19],[33,15,33,19],[29,13,29,14],[30,13,30,14],[31,13,31,14],[32,13,32,14],[33,13,33,14],[34,13,34,14],[34,15,34,19],[47,6,47,12],[48,6,48,12],[39,13,39,14],[40,13,40,14],[41,13,41,14],[42,13,42,14],[43,13,43,14],[44,13,44,14],[39,6,39,12],[40,6,40,12],[41,20,41,21],[48,20,48,21],[49,20,49,21],[29,22,29,23],[30,22,30,23],[31,22,31,23],[32,22,32,23],[33,22,33,23],[34,22,34,23],[35,22,35,23],[36,22,36,23],[42,20,42,21],[43,20,43,21],[44,20,44,21],[45,20,45,21],[46,20,46,21],[47,20,47,21],[35,20,35,21],[36,20,36,21],[37,20,37,21],[38,20,38,21],[39,20,39,21],[40,20,40,21],[29,20,29,21],[43,22,43,23],[44,22,44,23],[45,22,45,23],[46,22,46,23],[47,22,47,23],[48,22,48,23],[37,22,37,23],[38,22,38,23],[39,22,39,23],[40,22,40,23],[41,22,41,23],[42,22,42,23],[35,15,35,19],[36,15,36,19],[37,15,37,19],[38,15,38,19],[39,15,39,19],[40,15,40,19],[47,15,47,19],[48,15,48,19],[49,15,49,19],[41,15,41,19],[42,15,42,19],[43,15,43,19],[44,15,44,19],[45,15,45,19],[46,15,46,19]]}
[]
[null,null,null,null,null,null,null,null,null,null,null,null,"Унифицированная форма № ОП-1\nУтверждена постановлением Госкомстата\nРоссии от 25.12.98 № 132  ",null,null,null,null,null,null,null,null,null,null,null,null,null,"День",2]
[null,null,null,null,null,null,null,null,null,null,null,null,null,null,null,null,null,null,null,null,null,null,null,null,null,null,"Месяц",9]
[null,null,null,null,"Товар",null,null,null,null,null,null,null,null,null,null,null,null,null,null,null,null,"Код",null,null,null,null,"Год",2022]
[null,null,null,null,"Борщ украинский",null,null,null,null,null,null,null,null,null,null,null,"Форма по ОКУД",null,null,null,null,330501]
[null,null,null,null,{"$f":"IF(AND(E5<>\"\",INDEX('Состав блюд'!#REF!,MATCH(INDEX(#REF!,MATCH(E$5,#REF!,)),'Состав блюд'!#REF!,)+ROW(E2))=ROW(E1)),INDEX('Состав блюд'!#REF!,MATCH(INDEX(#REF!,MATCH(E$5,#REF!,)),'Состав блюд'!#REF!,)+ROW(E2)),\"\")","v":{"$error":"#REF!"}},null,null,null,null,null,null,null,null,null,null,null,null,null,null,"по ОКПО"]
[null,null,null,null,{"$f":"IF(AND(E6<>\"\",INDEX('Состав блюд'!#REF!,MATCH(INDEX(#REF!,MATCH(E$5,#REF!,)),'Состав блюд'!#REF!,)+ROW(E3))=ROW(E2)),INDEX('Состав блюд'!#REF!,MATCH(INDEX(#REF!,MATCH(E$5,#REF!,)),'Состав блюд'!#REF!,)+ROW(E3)),\"\")","v":{"$error":"#REF!"}},"ООО \"Метро\""]
[null,null,null,null,{"$f":"IF(AND(E7<>\"\",INDEX('Состав блюд'!#REF!,MATCH(INDEX(#REF!,MATCH(E$5,#REF!,)),'Состав блюд'!#REF!,)+ROW(E4))=ROW(E3)),INDEX('Состав блюд'!#REF!,MATCH(INDEX(#REF!,MATCH(E$5,#REF!,)),'Состав блюд'!#REF!,)+ROW(E4)),\"\")","v":{"$error":"#REF!"}},"наименование поставщика",null,null,null,null,null,null,"Вид деятельности по ОКДП"]
[null,null,null,null,{"$f":"IF(AND(E8<>\"\",INDEX('Состав блюд'!#REF!,MATCH(INDEX(#REF!,MATCH(E$5,#REF!,)),'Состав блюд'!#REF!,)+ROW(E5))=ROW(E4)),INDEX('Состав блюд'!#REF!,MATCH(INDEX(#REF!,MATCH(E$5,#REF!,)),'Состав блюд'!#REF!,)+ROW(E5)),\"\")","v":{"$error":"#REF!"}}]
[null,null,null,null,{"$f":"IF(AND(E9<>\"\",INDEX('Состав блюд'!#REF!,MATCH(INDEX(#REF!,MATCH(E$5,#REF!,)),'Состав блюд'!#REF!,)+ROW(E6))=ROW(E5)),INDEX('Состав блюд'!#REF!,MATCH(INDEX(#REF!,MATCH(E$5,#REF!,)),'Состав блюд'!#REF!,)+ROW(E6)),\"\")","v":{"$error":"#REF!"}},"ООО \"Сервис-М\""]
[null,null,null,null,{"$f":"IF(AND(E10<>\"\",INDEX('Состав блюд'!#REF!,MATCH(INDEX(#REF!,MATCH(E$5,#REF!,)),'Состав блюд'!#REF!,)+ROW(E7))=ROW(E6)),INDEX('Состав блюд'!#REF!,MATCH(INDEX(#REF!,MATCH(E$5,#REF!,)),'Состав блюд'!#REF!,)+ROW(E7)),\"\")","v":{"$error":"#REF!"}},"наименование получателя"]
[null,null,null,null,{"$f":"IF(AND(E11<>\"\",INDEX('Состав блюд'!#REF!,MATCH(INDEX(#REF!,MATCH(E$5,#REF!,)),'Состав блюд'!#REF!,)+ROW(E8))=ROW(E7)),INDEX('Состав блюд'!#REF!,MATCH(INDEX(#REF!,MATCH(E$5,#REF!,)),'Состав блюд'!#REF!,)+ROW(E8)),\"\")","v":{"$error":"#REF!"}},null,null,null,null,null,null,null,null,null,null,null,null,"Вид операции"]
[null,null,null,null,{"$f":"IF(AND(E12<>\"\",INDEX('Состав блюд'!#REF!,MATCH(INDEX(#REF!,MATCH(E$5,#REF!,)),'Состав блюд'!#REF!,)+ROW(E9))=ROW(E8)),INDEX('Состав блюд'!#REF!,MATCH(INDEX(#REF!,MATCH(E$5,#REF!,)),'Состав блюд'!#REF!,)+ROW(E9)),\"\")","v":{"$error":"#REF!"}}]
[null,null,null,null,{"$f":"IF(AND(E13<>\"\",INDEX('Состав блюд'!#REF!,MATCH(INDEX(#REF!,MATCH(E$5,#REF!,)),'Состав блюд'!#REF!,)+ROW(E10))=ROW(E9)),INDEX('Состав блюд'!#REF!,MATCH(INDEX(#REF!,MATCH(E$5,#REF!,)),'Состав блюд'!#REF!,)+ROW(E10)),\"\")","v":{"$error":"#REF!"}},null,null,null,null,null,null,"Номер документа",null,null,null,null,null,null,"Дата прихода"]
[null,null,null,null,{"$f":"IF(AND(E14<>\"\",INDEX('Состав блюд'!#REF!,MATCH(INDEX(#REF!,MATCH(E$5,#REF!,)),'Состав блюд'!#REF!,)+ROW(E11))=ROW(E10)),INDEX('Состав блюд'!#REF!,MATCH(INDEX(#REF!,MATCH(E$5,#REF!,)),'Состав блюд'!#REF!,)+ROW(E11)),\"\")","v":{"$error":"#REF!"}},null,"ПРИХОДНАЯ НАКЛАДНАЯ",null,null,null,null,1,null,null,null,null,null,null,{"$f":"DATE($AB$4,$AB$3,$AB$2)","v":"2022-09-02"}]
[null,null,null,null,{"$f":"IF(AND(E15<>\"\",INDEX('Состав блюд'!#REF!,MATCH(INDEX(#REF!,MATCH(E$5,#REF!,)),'Состав блюд'!#REF!,)+ROW(E12))=ROW(E11)),INDEX('Состав блюд'!#REF!,MATCH(INDEX(#REF!,MATCH(E$5,#REF!,)),'Состав блюд'!#REF!,)+ROW(E12)),\"\")","v":{"$error":"#REF!"}}]
[null,null,null,null,{"$f":"IF(AND(#REF!<>\"\",INDEX('Состав блюд'!#REF!,MATCH(INDEX(#REF!,MATCH(E$5,#REF!,)),'Состав блюд'!#REF!,)+ROW(E14))=ROW(E13)),INDEX('Состав блюд'!#REF!,MATCH(INDEX(#REF!,MATCH(E$5,#REF!,)),'Состав блюд'!#REF!,)+ROW(E14)),\"\")","v":{"$error":"#REF!"}},"№","Продукты",null,null,null,null,null,null,"Ед.",null,"Количество, кг",null,null,null,null,"Цена закупки, руб",null,"Сумма, руб"]
[null,null,null,null,{"$f":"IF(AND(E17<>\"\",INDEX('Состав блюд'!#REF!,MATCH(INDEX(#REF!,MATCH(E$5,#REF!,)),'Состав блюд'!#REF!,)+ROW(E15))=ROW(E14)),INDEX('Состав блюд'!#REF!,MATCH(INDEX(#REF!,MATCH(E$5,#REF!,)),'Состав блюд'!#REF!,)+ROW(E15)),\"\")","v":{"$error":"#REF!"}},1,"Гречка",null,null,null,null,null,null,"кг",null,5,null,null,null,null,50,null,{"$f":"IFERROR(P18*U18,\"\")","v":250}]
[null,null,null,null,{"$f":"IF(AND(E18<>\"\",INDEX('Состав блюд'!#REF!,MATCH(INDEX(#REF!,MATCH(E$5,#REF!,)),'Состав блюд'!#REF!,)+ROW(E16))=ROW(E15)),INDEX('Состав блюд'!#REF!,MATCH(INDEX(#REF!,MATCH(E$5,#REF!,)),'Состав блюд'!#REF!,)+ROW(E16)),\"\")","v":{"$error":"#REF!"}},2,"Какао в порошке",null,null,null,null,null,null,"кг",null,5,null,null,null,null,50,null,250]
[null,null,null,null,{"$f":"IF(AND(E19<>\"\",INDEX('Состав блюд'!#REF!,MATCH(INDEX(#REF!,MATCH(E$5,#REF!,)),'Состав блюд'!#REF!,)+ROW(#REF!))=ROW(E16)),INDEX('Состав блюд'!#REF!,MATCH(INDEX(#REF!,MATCH(E$5,#REF!,)),'Состав блюд'!#REF!,)+ROW(#REF!)),\"\")","v":{"$error":"#REF!"}},3,"Гречка",null,null,null,null,null,null,"кг",null,2,null,null,null,null,50,null,100]
[null,null,null,null,{"$f":"IF(AND(E20<>\"\",INDEX('Состав блюд'!#REF!,MATCH(INDEX(#REF!,MATCH(E$5,#REF!,)),'Состав блюд'!#REF!,)+ROW(E17))=ROW(#REF!)),INDEX('Состав блюд'!#REF!,MATCH(INDEX(#REF!,MATCH(E$5,#REF!,)),'Состав блюд'!#REF!,)+ROW(E17)),\"\")","v":{"$error":"#REF!"}},4,"Гречка",null,null,null,null,null,null,"кг",null,5,null,null,null,null,50,null,250]
[null,null,null,null,{"$f":"IF(AND(E21<>\"\",INDEX('Состав блюд'!#REF!,MATCH(INDEX(#REF!,MATCH(E$5,#REF!,)),'Состав блюд'!#REF!,)+ROW(E18))=ROW(E17)),INDEX('Состав блюд'!#REF!,MATCH(INDEX(#REF!,MATCH(E$5,#REF!,)),'Состав блюд'!#REF!,)+ROW(E18)),\"\")","v":{"$error":"#REF!"}},5,"Говядина",null,null,null,null,null,null,"кг",null,5,null,null,null,null,30,null,150]
[null,null,null,null,{"$f":"IF(AND(E22<>\"\",INDEX('Состав блюд'!#REF!,MATCH(INDEX(#REF!,MATCH(E$5,#REF!,)),'Состав блюд'!#REF!,)+ROW(E19))=ROW(E18)),INDEX('Состав блюд'!#REF!,MATCH(INDEX(#REF!,MATCH(E$5,#REF!,)),'Состав блюд'!#REF!,)+ROW(E19)),\"\")","v":{"$error":"#REF!"}},6,"Гречка",null,null,null,null,null,null,"кг",null,5,null,null,null,null,3,null,15]
[null,null,null,null,{"$f":"IF(AND(E23<>\"\",INDEX('Состав блюд'!#REF!,MATCH(INDEX(#REF!,MATCH(E$5,#REF!,)),'Состав блюд'!#REF!,)+ROW(E20))=ROW(E19)),INDEX('Состав блюд'!#REF!,MATCH(INDEX(#REF!,MATCH(E$5,#REF!,)),'Состав блюд'!#REF!,)+ROW(E20)),\"\")","v":{"$error":"#REF!"}},7,"Горох",null,null,null,null,null,null,"кг",null,5,null,null,null,null,1,null,5]
[null,null,null,null,{"$f":"IF(AND(E24<>\"\",INDEX('Состав блюд'!#REF!,MATCH(INDEX(#REF!,MATCH(E$5,#REF!,)),'Состав блюд'!#REF!,)+ROW(E21))=ROW(E20)),INDEX('Состав блюд'!#REF!,MATCH(INDEX(#REF!,MATCH(E$5,#REF!,)),'Состав блюд'!#REF!,)+ROW(E21)),\"\")","v":{"$error":"#REF!"}},8,null,null,null,null,null,null,null,"кг"]
[null,null,null,null,{"$f":"IF(AND(E25<>\"\",INDEX('Состав блюд'!#REF!,MATCH(INDEX(#REF!,MATCH(E$5,#REF!,)),'Состав блюд'!#REF!,)+ROW(E22))=ROW(E21)),INDEX('Состав блюд'!#REF!,MATCH(INDEX(#REF!,MATCH(E$5,#REF!,)),'Состав блюд'!#REF!,)+ROW(E22)),\"\")","v":{"$error":"#REF!"}},9,null,null,null,null,null,null,null,"кг"]
[null,null,null,null,{"$f":"IF(AND(E26<>\"\",INDEX('Состав блюд'!#REF!,MATCH(INDEX(#REF!,MATCH(E$5,#REF!,)),'Состав блюд'!#REF!,)+ROW(E23))=ROW(E22)),INDEX('Состав блюд'!#REF!,MATCH(INDEX(#REF!,MATCH(E$5,#REF!,)),'Состав блюд'!#REF!,)+ROW(E23)),\"\")","v":{"$error":"#REF!"}},10,null,null,null,null,null,null,null,"кг"]
[null,null,null,null,{"$f":"IF(AND(E27<>\"\",INDEX('Состав блюд'!#REF!,MATCH(INDEX(#REF!,MATCH(E$5,#REF!,)),'Состав блюд'!#REF!,)+ROW(E24))=ROW(E23)),INDEX('Состав блюд'!#REF!,MATCH(INDEX(#REF!,MATCH(E$5,#REF!,)),'Состав блюд'!#REF!,)+ROW(E24)),\"\")","v":{"$error":"#REF!"}},11,null,null,null,null,null,null,null,"кг"]
[null,null,null,null,null,12,null,null,null,null,null,null,null,"кг"]
[null,null,null,null,null,13,null,null,null,null,null,null,null,"кг"]
[null,null,null,null,null,14,null,null,null,null,null,null,null,"кг"]
[null,null,null,null,null,15,null,null,null,null,null,null,null,"кг"]
[null,null,null,null,null,16,null,null,null,null,null,null,null,"кг"]
[null,null,null,null,null,17,null,null,null,null,null,null,null,"кг"]
[null,null,null,null,null,18,null,null,null,null,null,null,null,"кг"]
[null,null,null,null,null,19,null,null,null,null,null,null,null,"кг"]
[null,null,null,null,null,20,null,null,null,null,null,null,null,"кг"]
[null,null,null,null,null,21,null,null,null,null,null,null,null,"кг"]
[null,null,null,null,null,22,null,null,null,null,null,null,null,"кг"]
[null,null,null,null,null,23,null,null,null,null,null,null,null,"кг"]
[null,null,null,null,null,24,null,null,null,null,null,null,null,"кг"]
[null,null,null,null,null,25,null,null,null,null,null,null,null,"кг"]
[null,null,null,null,null,26,null,null,null,null,null,null,null,"кг"]
[null,null,null,null,null,27,null,null,null,null,null,null,null,"кг"]
[null,null,null,null,null,28,null,null,null,null,null,null,null,"кг"]
[null,null,null,null,null,29,null,null,null,null,null,null,null,"кг"]
[null,null,null,null,null,30,null,null,null,null,null,null,null,"кг"]
[null,null,null,null,null,31,null,null,null,null,null,null,null,"кг"]
[null,null,null,null,null,32,null,null,null,null,null,null,null,"кг"]
[null,null,null,null,null,33,null,null,null,null,null,null,null,"кг"]
[null,null,null,null,null,34,null,null,null,null,null,null,null,"кг"]
[null,null,null,null,null,35,null,null,null,null,null,null,null,"кг"]
[null,null,null,null,null,36,null,null,null,null,null,null,null,"кг"]
[null,null,null,null,null,37,null,null,null,null,null,null,null,"кг"]
[null,null,null,null,null,38,null,null,null,null,null,null,null,"кг"]
[null,null,null,null,null,39,null,null,null,null,null,null,null,"кг"]
[null,null,null,null,null,40,null,null,null,null,null,null,null,"кг"]
[null,null,null,null,null,41,null,null,null,null,null,null,null,"кг"]
[null,null,null,null,null,"Итого стоимость, руб",null,null,null,null,null,null,null,null,null,null,null,null,null,null,null,null,{"$f":"SUM(W18:X58)","v":1020}]

{"sheet":"Выгрузка из прих.накл.","index":3,"n_rows":9,"n_cols":33,"rows_kept":9,"cut":false,"hidden":false,"merged":[]}
["Дата","№ документа","Итого","Прим","Говядина","Гречка","Какао в порошке","Капуста","Картофель","Колбаса \"Докторская\"","Курица","Лавровый лист","Лук","Майонез","Масло растительное","Масло сливочное","Морковь","Огурец свежий","Перец сладкий","Помидоры","Рис","Сахар","Свекла","Свинина","Соль","Сухари панировочные","Сыр","Томатная паста","Уксус 9%-ный","Чай","Яйца куриные","рм","итм"]
["2022-09-02",1,880,null,null,12,null,null,null,null,null,null,null,null,null,null,null,null,null,null,5]
["2022-09-02",1,"__________",null,null,"50руб./кг",null,null,null,null,null,null,null,null,null,null,null,null,null,null,"50руб./кг"]
["2022-09-02",1,1015,null,5,17,null,null,null,null,null,null,null,null,null,null,null,null,null,null,5]
["2022-09-02",1,"__________",null,"30руб./кг","3руб./кг",null,null,null,null,null,null,null,null,null,null,null,null,null,null,"50руб./кг"]
["2022-09-02",1,1020,null,5,17,5,5]
["2022-09-02",1,"__________",null,"30руб./кг","3руб./кг","50руб./кг","1руб./кг"]
["2022-09-02",1,1020,null,5,17,5]
["2022-09-02",1,"__________",null,"30руб./кг","3руб./кг","50руб./кг"]