{"text_format":"1","workbook":"xlsx","n_sheets":5,"sheets":["Вахта+Подменные","ИТР","Высота","Журнал Вахта_ИТР","Дата печать"],"not_rendered":{"charts":0,"images":1,"macros":1,"external_links":0,"defined_names":4,"comments":0,"pivot_tables":0},"unopened":[],"bounds":{"document_bytes":16777216,"sheet_cells":100000,"rows_first":2000,"rows_last":500,"rows_between":2000,"halvings":0,"cell_chars":16384,"cell_head_chars":4096},"cells_cut":0,"cells_raw":0,"read":"whole","date_system":"1900"}

{"sheet":"Вахта+Подменные","index":0,"n_rows":153,"n_cols":36,"rows_kept":153,"cut":false,"hidden":false,"merged":[[3,0,4,0],[5,0,6,0],[7,0,8,0],[9,0,10,0],[4,1,4,2],[6,1,6,2],[10,1,10,2],[12,1,12,2],[3,12,4,12],[5,12,6,12],[3,14,4,14],[5,14,6,14],[8,1,8,2],[3,9,4,9],[5,9,6,9],[65,0,65,35],[66,12,67,12],[61,0,62,0],[61,9,62,9],[55,0,56,0],[55,9,56,9],[51,0,52,0],[51,9,52,9],[40,0,41,0],[40,9,41,9],[7,9,8,9],[7,12,8,12],[7,14,8,14],[9,9,10,9],[9,12,10,12],[9,14,10,14],[11,9,12,9],[11,12,12,12],[21,14,22,14],[22,1,22,2],[44,0,44,35],[45,0,46,0],[45,9,46,9],[45,12,46,12],[45,14,46,14],[46,1,46,2],[47,0,48,0],[40,12,41,12],[40,14,41,14],[41,1,41,2],[42,0,43,0],[42,9,43,9],[42,12,43,12],[42,14,43,14],[27,1,27,2],[43,1,43,2],[13,12,14,12],[13,14,14,14],[15,0,16,0],[15,9,16,9],[15,12,16,12],[15,14,16,14],[16,1,16,2],[11,0,12,0],[13,0,14,0],[14,1,14,2],[17,12,18,12],[2,0,2,35],[32,0,33,0],[32,9,33,9],[32,12,33,12],[32,14,33,14],[33,1,33,2],[28,12,29,12],[28,14,29,14],[29,1,29,2],[30,0,31,0],[30,9,31,9],[30,12,31,12],[30,14,31,14],[31,1,31,2],[24,12,25,12],[24,14,25,14],[25,1,25,2],[26,0,27,0],[26,9,27,9],[26,12,27,12],[11,14,12,14],[13,9,14,9],[26,14,27,14],[17,14,18,14],[18,1,18,2],[34,12,35,12],[34,14,35,14],[35,1,35,2],[36,0,37,0],[36,9,37,9],[36,12,37,12],[36,14,37,14],[37,1,37,2],[23,0,23,35],[34,0,35,0],[34,9,35,9],[28,0,29,0],[28,9,29,9],[24,0,25,0],[24,9,25,9],[17,0,18,0],[17,9,18,9],[21,0,22,0],[21,9,22,9],[21,12,22,12],[19,0,20,0],[19,9,20,9],[51,12,52,12],[51,14,52,14],[52,1,52,2],[53,0,54,0],[53,9,54,9],[53,12,54,12],[53,14,54,14],[54,1,54,2],[47,9,48,9],[47,12,48,12],[47,14,48,14],[48,1,48,2],[49,0,50,0],[49,9,50,9],[49,12,50,12],[49,14,50,14],[50,1,50,2],[61,12,62,12],[61,14,62,14],[62,1,62,2],[63,0,64,0],[63,9,64,9],[63,12,64,12],[63,14,64,14],[64,1,64,2],[55,12,56,12],[55,14,56,14],[56,1,56,2],[57,0,58,0],[57,9,58,9],[57,12,58,12],[57,14,58,14],[58,1,58,2],[68,0,69,0],[68,9,69,9],[68,12,69,12],[68,14,69,14],[69,1,69,2],[66,0,67,0],[66,9,67,9],[70,0,71,0],[70,9,71,9],[82,0,83,0],[82,9,83,9],[82,12,83,12],[82,14,83,14],[83,1,83,2],[74,12,75,12],[74,14,75,14],[75,1,75,2],[76,0,77,0],[76,9,77,9],[76,12,77,12],[76,14,77,14],[77,1,77,2],[78,0,79,0],[78,9,79,9],[74,0,75,0],[74,9,75,9],[80,0,81,0],[80,9,81,9],[80,12,81,12],[80,14,81,14],[81,1,81,2],[78,12,79,12],[78,14,79,14],[84,12,85,12],[84,14,85,14],[85,1,85,2],[86,0,86,35],[87,0,88,0],[87,9,88,9],[87,12,88,12],[87,14,88,14],[88,1,88,2],[84,0,85,0],[84,9,85,9],[93,12,94,12],[93,14,94,14],[94,1,94,2],[95,0,96,0],[95,9,96,9],[95,12,96,12],[95,14,96,14],[96,1,96,2],[89,12,90,12],[89,14,90,14],[90,1,90,2],[91,0,92,0],[91,9,92,9],[91,12,92,12],[91,14,92,14],[92,1,92,2],[93,0,94,0],[93,9,94,9],[89,0,90,0],[89,9,90,9],[102,12,103,12],[102,14,103,14],[103,1,103,2],[104,0,105,0],[104,9,105,9],[104,12,105,12],[104,14,105,14],[105,1,105,2],[97,12,98,12],[97,14,98,14],[98,1,98,2],[99,0,99,35],[100,0,101,0],[100,9,101,9],[100,12,101,12],[100,14,101,14],[101,1,101,2],[102,0,103,0],[102,9,103,9],[97,0,98,0],[97,9,98,9],[106,0,107,0],[106,9,107,9],[106,12,107,12],[106,14,107,14],[107,1,107,2],[108,0,109,0],[108,9,109,9],[108,12,109,12],[108,14,109,14],[109,1,109,2],[110,0,111,0],[110,9,111,9],[110,12,111,12],[110,14,111,14],[111,1,111,2],[112,0,113,0],[112,9,113,9],[112,12,113,12],[112,14,113,14],[113,1,113,2],[114,0,115,0],[114,9,115,9],[114,12,115,12],[114,14,115,14],[115,1,115,2],[116,0,117,0],[116,9,117,9],[116,12,117,12],[116,14,117,14],[117,1,117,2],[118,0,119,0],[118,9,119,9],[118,12,119,12],[118,14,119,14],[119,1,119,2],[120,0,121,0],[120,9,121,9],[120,12,121,12],[120,14,121,14],[121,1,121,2],[122,0,123,0],[122,9,123,9],[122,12,123,12],[122,14,123,14],[123,1,123,2],[124,0,125,0],[124,9,125,9],[124,12,125,12],[124,14,125,14],[125,1,125,2],[126,0,127,0],[126,9,127,9],[126,12,127,12],[126,14,127,14],[127,1,127,2],[128,0,129,0],[128,9,129,9],[128,12,129,12],[128,14,129,14],[129,1,129,2],[130,0,131,0],[130,9,131,9],[130,12,131,12],[130,14,131,14],[131,1,131,2],[132,0,133,0],[132,9,133,9],[132,12,133,12],[132,14,133,14],[133,1,133,2],[134,0,135,0],[134,9,135,9],[134,12,135,12],[134,14,135,14],[135,1,135,2],[136,0,137,0],[136,9,137,9],[136,12,137,12],[136,14,137,14],[137,1,137,2],[138,0,139,0],[138,9,139,9],[138,12,139,12],[138,14,139,14],[139,1,139,2],[140,0,141,0],[140,9,141,9],[140,12,141,12],[140,14,141,14],[141,1,141,2],[142,0,143,0],[142,9,143,9],[142,12,143,12],[142,14,143,14],[143,1,143,2],[144,0,145,0],[144,9,145,9],[144,12,145,12],[144,14,145,14],[145,1,145,2],[146,0,147,0],[146,9,147,9],[146,12,147,12],[146,14,147,14],[147,1,147,2],[148,0,149,0],[148,9,149,9],[148,12,149,12],[148,14,149,14],[149,1,149,2],[150,0,151,0],[150,9,151,9],[150,12,151,12],[150,14,151,14],[151,1,151,2],[152,0,153,0],[152,9,153,9],[152,12,153,12],[152,14,153,14],[153,1,153,2],[79,1,79,2],[70,12,71,12],[70,14,71,14],[71,1,71,2],[72,0,73,0],[72,9,73,9],[72,12,73,12],[72,14,73,14],[19,12,20,12],[19,14,20,14],[20,1,20,2],[38,0,39,0],[38,9,39,9],[38,12,39,12],[38,14,39,14],[39,1,39,2],[59,0,60,0],[59,9,60,9],[59,12,60,12],[59,14,60,14],[60,1,60,2],[73,1,73,2],[66,14,67,14],[67,1,67,2]]}
["П/п №","ФИО","Должность","Осн.\nпрофессия","Смежная профессия (пом.бур 2, водит автом)","ОТ (5 программ)","Работа на высоте (до)","Высота ежегодная проверка знаний","Cтропальщик                                                                                                      ","Разряд","ПС с пола (раз в квартал)","Вышко\nмонтажник","Разряд","Машинист\nАГП","Разряд","Рабочий\nлюльки","Сосуды","Ремонт ГПМ","ГНВП","ПТМ (журнал)","ЭБ","Водительское (маш автокрана/погрузчика)","Маневрирование специализированной техники","Зимнее вождение","Защитное вождение","Ежегодное обучение водителей","НАКС","IWCF","Допуск к  работе КСАД","Анализ ГВС ","H2S ","Курс по первой помощи","ЗМО","ОПО","ЛЭП"]
[0,1,2,3,4,5,6,7,8,9,10,11,12,13,14,15,16,17,18,19,20,21,22,23,24,25,26,27,28,29,30,30,31,32,33,34]
["Вахта №1"]
[1,"Иванов Андрей","Бурильщик ЭиРБС на нефть и газ 8 р","123077",null,"17-044/322-1","2302","2302",3374,4,3374,"12/317",6,529,5,840,null,null,"001570",null,"022/Т322",null,null,null,null,null,null,null,null,null,null,"111-3.20"]
[null,null,null,"2023-06-24",null,"2023-06-24","2024-06-11","2023-06-24","2023-06-24",null,"2022-09-24","2023-07-17",null,"2023-07-17",null,"2023-07-17",null,null,"2023-06-25",null,"2023-06-25",null,null,null,null,null,null,null,null,null,null,"2022-06-02","2022-08-05"]
[2,"Балык Садир","Бурильщик ЭиРБС на нефть и газ 8 р","165205",null,"Т506/103",null,"3747","174-2-17",null,"174-2-17","97-16-01",null,null,null,null,null,null,"001824",null,"39"]
[null,null,null,"2023-06-24",null,"2023-06-24",null,"2022-10-02","2023-06-24",null,"2022-09-24","2022-08-09",null,null,null,null,null,null,"2023-11-26",null,"2022-08-12"]
[3,"Семенов Сын","Помощник бурильщика ЭиРБС (второй) 6 р.","28-3842",null,"Т506/32",null,"4576","88-16-06",null,"88-16-06","97-16-04",null,null,null,null,null,null,"002014",null,"152"]
[null,null,null,"2022-09-01",null,"2022-09-01",null,"2022-09-01","2022-09-01",null,"2022-09-24","2023-02-03",null,null,null,null,null,null,"2024-04-10",null,"2022-09-12"]
[4,"Топай Отсюда","Помощник бурильщика ЭиРБС (первый) 6 р.","1257",null,"62-19-05",null,"3285","1844",null,"1844",null,null,null,null,null,null,null,"001410",null,"бн"]
[null,null,null,"2022-11-12",null,"2022-11-12",null,"2022-11-13","2022-11-12",null,null,null,null,null,null,null,null,null,"2023-03-19",null,"2022-11-12"]
[5,"Глучше завтра","Помощник бурильщика ЭиРБС (первый) 6 р."," 52-17-01",null,"Т506/31",null,"4577","81-17-10",null,"81-17-10","ПРП-25-15-0178",null,null,null,null,null,null,"001409",null,"151"]
[null,null,null,"2023-02-14",null,"2023-02-14",null,"2023-02-14","2023-02-14",null,null,"2023-02-14",null,null,null,null,null,null,"2023-03-19",null,"2023-02-15"]
[6,"Как Сам","Помощник бурильщика ЭиРБС (первый) 6 р.","3779",null,"Т400-225/10-3",null,"5327","011019-2",null,"011019-2","101019-2",null,null,null,null,null,null,"001710"]
[null,null,null,"2022-11-13",null,"2022-11-12",null,"2022-11-12","2022-11-12",null,"2022-09-24","2023-02-06",null,null,null,null,null,null,"2023-10-08",null,"2023-02-04"]
[7,"Толстый Пингвин","Слесарь по обслуживанию буровых 6 р.","0316/18-2",null,"Т506/22/01","3735","3735",null,null,null,null,null,"178775",5,null,"02-38599",null,null,null,"165"]
[null,null,null,"2023-02-07",null,"2023-06-24","2022-12-14","2022-12-14",null,null,null,null,null,"2023-02-07",null,null,null,null,null,null,"2023-06-25"]
[8,"Закат Расвет","Электромонтер по обслуживанию буровых 6 р.",null,null,"50-21-03",null,"6892",null,null,null,null,null,null,null,null,null,null,null,null,"15"]
[null,null,null,null,null,"2022-10-13",null,"2022-11-02",null,null,null,null,null,null,null,null,null,null,null,null,"2022-10-06"]
[9,"Ничего незнаю","Водитель автопогрузчика","0265",null,"Т506/34","3526","3526","280",null,"280",null,null,null,null,null,null,null,null,null,"154","СМ 923707",null,null,null,null,null,null,null,null,null,null,null,null,"180/2021"]
[null,null,null,"2022-09-01",null,"2022-09-01","2024-07-02","2023-06-24","2022-09-01",null,"2022-09-24",null,null,null,null,null,null,null,null,null,"2022-09-12","2031-07-26",null,null,null,null,null,null,null,null,null,null,null,null,"2022-09-01"]
[10,null,"Водитель автопогрузчика"]
[]
["Вахта №2"]
[11,null,"Бурильщик ЭиРБС на нефть и газ 8 р"]
[]
[12,null,"Бурильщик ЭиРБС на нефть и газ 8 р"]
[]
[13,null,"Помощник бурильщика ЭиРБС (второй) 6 р."]
[]
[14,null,"Помощник бурильщика ЭиРБС (первый) 6 р."]
[]
[15,null,"Помощник бурильщика ЭиРБС (первый) 6 р."]
[]
[16,null,"Помощник бурильщика ЭиРБС (первый) 6 р."]
[]
[17,null,"Слесарь по обслуживанию буровых 6 р."]
[]
[18,"Лучше Так","Электромонтер по обслуживанию буровых 6 р.",null,null,null,"3775","3775",null,null,null,"42-4464"]
[null,null,null,null,null,null,"2024-07-09","2023-07-17",null,null,null,"2023-07-17"]
[19,null,"Водитель автопогрузчика"]
[]
[20,null,"Водитель автопогрузчика"]
[]
["Вахта №3"]
[21,null,"Бурильщик ЭиРБС на нефть и газ 8 р"]
[]
[22,null,"Бурильщик ЭиРБС на нефть и газ 8 р"]
[]
[23,"Коношанов Торган","Помощник бурильщика ЭиРБС (второй) 6 р.","29100","29100","042/Т320","015/17","127/2021","274-2-17",null,null,"9018",4,"157-18-04",5,"262-14-13",null,null,"001182"]
[null,null,null,"2022-08-05","2022-08-05","2022-08-05","2024-01-28","2022-08-05","2023-02-14",null,null,"2022-08-05",null,"2022-08-05",null,"2022-08-05",null,null,"2022-10-02"]
[24,null,"Помощник бурильщика ЭиРБС (первый) 6 р."]
[]
[25,null,"Помощник бурильщика ЭиРБС (первый) 6 р."]
[]
[26,null,"Помощник бурильщика ЭиРБС (первый) 6 р."]
[]
[27,null,"Слесарь по обслуживанию буровых 6 р."]
[]
[28,null,"Электромонтер по обслуживанию буровых 6 р."]
[]
[29,null,"Водитель автопогрузчика"]
[]
[30,null,"Водитель автопогрузчика"]
[]
["Вахта №4"]
[31,null,"Бурильщик ЭиРБС на нефть и газ 8 р"]
[]
[32,null,"Бурильщик ЭиРБС на нефть и газ 8 р"]
[]
[33,null,"Помощник бурильщика ЭиРБС (второй) 6 р."]
[]
[34,null,"Помощник бурильщика ЭиРБС (первый) 6 р."]
[]
[35,null,"Помощник бурильщика ЭиРБС (первый) 6 р."]
[]
[36,null,"Помощник бурильщика ЭиРБС (первый) 6 р."]
[]
[37,null,"Слесарь по обслуживанию буровых 6 р."]
[]
[38,null,"Электромонтер по обслуживанию буровых 6 р."]
[]
[39,null,"Водитель автопогрузчика"]
[]
[40,null,"Водитель автопогрузчика"]
[]
[]
[41,null,"Машинист крана автомобильного"]
[]
[42,null,"Машинист крана автомобильного"]
[]
[43,null,"Электрогазосварщик 6 р."]
[]
[44,null,"Электрогазосварщик 6 р."]
[]
[45]
[]
[46]
[]
["Подменные"]
[47,"Ну зачем","Водитель автопогрузчика",null,null,null,null,null,"631",null,"631"]
[null,null,null,null,null,null,null,null,null,null,"2022-09-24"]
[48,"Я не хочу","Вышкомонтажник 4 р.",null,null,null,null,"153/9"]
[null,null,null,null,null,null,null,"2022-02-26"]
[49,"Мужик в очках","Вышкомонтажник- сварщик 6 р.",null,null,null,null,"153/15"]
[null,null,null,null,null,null,null,"2022-02-26"]
[50,"Зима близко","Помощник бурильщика ЭиРБС (первый) 6 р.",null,null,null,null,"3284"]
[null,null,null,null,null,null,null,"2022-06-25"]
[51,"То куда ты палишь","Машинист крана автомобильного 8р","158",null,"38-21-09",null,"4229",null,null,null,null,null,null,null,null,null,null,null,null,null,null,"79716978","79716978","79716978"]
[null,null,null,"2023-08-03",null,"2023-08-03",null,"2023-08-03",null,null,null,null,null,null,null,null,null,null,null,"2023-02-28",null,null,"2023-08-05","2023-08-05","2023-08-05"]
[52,"Электроды","Вышкомонтажник- электромонтер 5 р.","82169",null,"46-21-13",null,"5882"]
[null,null,null,"2023-02-14",null,"2023-02-27",null,"2023-08-03"]
[53,"Семь пятниц","Водитель автопогрузчика","047-4",null,"027-Т320",null,"153/8","055-ч",null,null,null,null,null,null,null,null,null,null,null,"Т506/27"]
[null,null,null,"2023-08-05",null,"2023-08-05",null,"2023-08-05","2023-08-05",null,null,null,null,null,null,null,null,null,null,"05.002.2023","2022-08-11"]
[54,"Вштаю незамечу","Слесарь по обслуживанию буровых 6 р.",null,null,"Т506/74",null,null,"29097",null,null,"1504-18/7/3",null,null,null,null,null,null,null,null,"41"]
[null,null,null,null,null,"2023-08-05",null,null,"2023-08-05",null,null,"2023-08-05",null,null,null,null,null,null,null,"05.002.2023","2022-08-30"]
[55]
[]
[56]
[]
[57]
[]
[58]
[]
[59]
[]
[60]
[]
[61]
[]
[62]
[]
[63]
[]
[64]
[]
[65]
[]
[66]
[]
[67]
[]
[68]
[]
[69]
[]
[70]
[]
[71]
[]
[72]
[]
[73]

{"sheet":"ИТР","index":1,"n_rows":48,"n_cols":26,"rows_kept":48,"cut":false,"hidden":false,"merged":[[35,0,36,0],[36,1,36,2],[37,0,38,0],[38,1,38,2],[27,0,28,0],[28,1,28,2],[29,0,30,0],[30,1,30,2],[33,0,34,0],[34,1,34,2],[41,0,42,0],[42,1,42,2],[39,0,40,0],[40,1,40,2],[17,0,18,0],[18,1,18,2],[19,0,20,0],[20,1,20,2],[31,0,32,0],[32,1,32,2],[21,0,22,0],[22,1,22,2],[23,0,24,0],[24,1,24,2],[25,0,26,0],[26,1,26,2],[13,0,14,0],[14,1,14,2],[15,0,16,0],[16,1,16,2],[9,0,10,0],[10,1,10,2],[11,0,12,0],[12,1,12,2],[5,0,6,0],[6,1,6,2],[7,0,8,0],[8,1,8,2],[2,0,2,35],[3,0,4,0],[4,1,4,2],[43,0,44,0],[44,1,44,2],[45,0,46,0],[46,1,46,2],[47,0,48,0],[48,1,48,2]]}
["П/п №","ФИО","Должность","Работа на высоте 3гр (до)","ЭБ","ОТ (5 программ)","Работа на высоте 2гр (до)","Высота ежегодная проверка знаний","ПТМ","ГНВП","ПБ\nА1","ПБ\nБ2.4, Б2.6 (2.4) ","ПБ\nБ9.31 (9.3)","ПБ\nБ9.32 (9.4)","ПБ\nБ8.23 (8.3)","Водительское удостоверение до","Зимнее вождение","Защитное вождение","Ежегодное обучение водителей","Экология","IWCF","Допуск к  работе КСАД","Анализ ГВС ","H2S "]
[0,1,2,3,4,5,6,7,8,9,10,11,12,13,14,15,16,17,18,19,20,21,22,23,24,25]
["ИТР"]
[74,"Иыфвф Ильропаевич","Мастер буровой","1063","50","591","814","814","6700","001950","Протокол №12-18","Протокол №12-18","Протокол №12-18","Протокол №12-18","Протокол №12-18",null,null,null,null,null,"DL4S-00102811-SA-T45J"]
[null,null,null,"2025-04-10","2023-05-07","2024-02-03","2024-04-02","2022-04-02","2022-12-17","2024-02-04","2023-02-02","2023-02-02","2023-02-02","2023-02-02","2023-02-02",null,null,null,null,null,"2024-03-29"]
[75,"Жфывфывв Анфвыфывй Владимирович","Мастер буровой","3578"]
[null,null,null,"2023-08-28"]
[76,"Кузфывфы Алекспвапимирович","Мастер буровой"]
[]
[77,"Кавфывфв Русвпапазанович","Мастер буровой",null,"121",null,"2307","2307"]
[null,null,null,null,"2023-07-02",null,null,"2023-06-24"]
[78,"Ефывфы","Специалист по ОТ и ПБ"]
[]
[79,"Авфывфывлерьевич","Специалист по ОТ и ПБ"]
[]
[80,"Лыфвфырьевич","Механик"]
[]
[81,"Клыввфексеевич","Механик"]
[]
[82,"Хопарапргеевич","Главный электрик"]
[]
[83,"Кларпарович","Главный электрик"]
[]
[84,null,"Заведующий складом"]
[]
[85,null,"Заведующий складом"]
[]
[86]
[]
[87]
[]
[88]
[]
[89]
[]
[90]
[]
[91]
[]
[92]
[]
[93]
[]
[94]
[]
[95]
[]
[96]

{"sheet":"Высота","index":2,"n_rows":97,"n_cols":26,"rows_kept":97,"cut":false,"hidden":false,"merged":[[3,2,3,4],[3,5,3,6],[4,0,4,8],[7,0,7,8],[8,0,8,2],[8,3,8,7],[22,0,22,8],[23,0,25,0],[23,1,25,1],[23,2,25,2],[23,3,25,4],[23,5,25,6],[23,7,25,7],[23,8,25,8],[10,0,10,1],[10,2,10,8],[12,0,12,1],[12,2,12,8],[14,2,14,8],[16,0,16,8],[26,7,27,7],[26,8,27,8],[28,0,29,0],[28,1,29,1],[28,2,29,2],[28,3,29,4],[28,5,29,5],[28,6,29,6],[28,7,29,7],[28,8,29,8],[26,0,27,0],[26,1,27,1],[26,2,27,2],[26,3,27,4],[26,5,27,5],[26,6,27,6],[30,7,31,7],[30,8,31,8],[32,0,33,0],[32,1,33,1],[32,2,33,2],[32,3,33,4],[32,5,33,5],[32,6,33,6],[32,7,33,7],[32,8,33,8],[30,0,31,0],[30,1,31,1],[30,2,31,2],[30,3,31,4],[30,5,31,5],[30,6,31,6],[34,7,35,7],[34,8,35,8],[36,0,37,0],[36,1,37,1],[36,2,37,2],[36,3,37,4],[36,5,37,5],[36,6,37,6],[36,7,37,7],[36,8,37,8],[34,0,35,0],[34,1,35,1],[34,2,35,2],[34,3,35,4],[34,5,35,5],[34,6,35,6],[43,0,43,1],[43,3,43,8],[45,0,45,1],[45,3,45,8],[47,3,47,8],[52,2,52,4],[52,5,52,6],[38,7,39,7],[38,8,39,8],[40,0,41,0],[40,1,41,1],[40,2,41,2],[40,3,41,4],[40,5,41,5],[40,6,41,6],[40,7,41,7],[40,8,41,8],[38,0,39,0],[38,1,39,1],[38,2,39,2],[38,3,39,4],[38,5,39,5],[38,6,39,6],[61,0,61,1],[61,2,61,8],[63,2,63,8],[65,0,65,8],[53,0,53,8],[56,0,56,8],[57,0,57,2],[57,3,57,7],[59,0,59,1],[59,2,59,8],[70,3,70,8],[71,0,71,8],[72,0,74,0],[72,1,74,1],[72,2,74,2],[72,3,74,4],[72,5,74,6],[72,7,74,7],[72,8,74,8],[75,7,76,7],[75,8,76,8],[75,9,76,9],[77,0,78,0],[77,1,78,1],[77,2,78,2],[77,3,78,4],[77,5,78,5],[77,6,78,6],[77,7,78,7],[75,0,76,0],[75,1,76,1],[75,2,76,2],[75,3,76,4],[75,5,76,5],[75,6,76,6],[77,8,78,8],[77,9,78,9],[79,0,80,0],[79,1,80,1],[79,2,80,2],[79,3,80,4],[79,5,80,5],[79,6,80,6],[79,7,80,7],[79,8,80,8],[79,9,80,9],[81,0,82,0],[81,1,82,1],[81,2,82,2],[81,3,82,4],[81,5,82,5],[81,6,82,6],[81,7,82,7],[81,8,82,8],[81,9,82,9],[87,6,88,6],[87,7,88,7],[87,8,88,8],[83,7,84,7],[83,8,84,8],[83,9,84,9],[85,0,86,0],[85,1,86,1],[85,2,86,2],[85,3,86,4],[85,5,86,5],[85,6,86,6],[85,7,86,7],[83,0,84,0],[83,1,84,1],[83,2,84,2],[83,3,84,4],[83,5,84,5],[83,6,84,6],[92,0,92,1],[92,3,92,8],[94,0,94,1],[94,3,94,8],[96,3,96,8],[17,0,17,8],[66,0,66,8],[87,9,88,9],[89,0,90,0],[89,1,90,1],[89,2,90,2],[89,3,90,4],[89,5,90,5],[89,6,90,6],[89,7,90,7],[89,8,90,8],[89,9,90,9],[85,8,86,8],[85,9,86,9],[87,0,88,0],[87,1,88,1],[87,2,88,2],[87,3,88,4],[87,5,88,5]]}
[]
[]
[]
[null,null,"Протокол №",null,null,"T506/081/22"]
["заседания комиссии по проверке знаний работников\nООО «КСА ДОЙТАГ Раша»"]
[null,null,null,null,null,null,"Дата:",{"$f":"IF(VLOOKUP(V10,'Дата печать'!$A$4:$F$15,$V12,FALSE)=0,\"\",VLOOKUP(V11,'Дата печать'!$A$4:$F$15,V13,FALSE))","v":"2022-08-29"}]
[]
["В соответствии с приказом (распоряжением) работодателя (руководителя) организации"]
[{"$f":"#REF!","v":{"$error":"#REF!"}},null,null,"комиссия в составе:",null,null,null,null,null,null,null,null,null,null,null,null,null,null,null,null,null,"дата","прот№","пре","ч1","ч2"]
[null,null,null,null,null,null,null,null,null,null,null,null,null,null,null,null,null,null,null,"син",null,1,1,1,1,1]
["председатель",null,{"$f":"IF(VLOOKUP(X10,'Журнал Вахта_ИТР'!$AB$4:$AM$1004,$X12,FALSE)=0,\"\",VLOOKUP(X11,'Журнал Вахта_ИТР'!$AB$4:$AM$1004,X13,FALSE))","v":"Руководитель проекта Ккококр С.Н."},null,null,null,null,null,null,null,null,null,null,null,null,null,null,null,null,"фиол",null,1,1,1,1,1]
[null,null,null,null,null,null,null,null,null,null,null,null,null,null,null,null,null,null,null,"крас",null,1,1,1,1,1]
["члены комиссии:",null,{"$f":"IF(VLOOKUP(Y10,'Журнал Вахта_ИТР'!$AB$4:$AM$1004,$Y12,FALSE)=0,\"\",VLOOKUP(Y11,'Журнал Вахта_ИТР'!$AB$4:$AM$1004,Y13,FALSE))","v":"Мастер буровой Кываыв Р.Р."},null,null,null,null,null,null,null,null,null,null,null,null,null,null,null,null,"зел","строчка",2,3,7,8,9]
[]
[null,null,{"$f":"IF(VLOOKUP(Z10,'Журнал Вахта_ИТР'!$AB$4:$AM$1004,$Z12,FALSE)=0,\"\",VLOOKUP(Z11,'Журнал Вахта_ИТР'!$AB$4:$AM$1004,Z13,FALSE))","v":"Специалист по ОТ и ПБ Ааываывав В.В."}]
[]
["провела проверку знаний у работников по безопасным методам и приемам  "]
["выполнения работ на высоте 2гр"]
[]
[]
[]
[]
["и установила, что ниже указанные сотрудник(и) допускаются к работе:"]
["№ п/п","Ф.И.О.","Должность","Наименование подразделения ",null,"Результат проверки знаний (сдал/не сдал),\n№ удост",null,"Причина проверки знаний (очеред, внеочеред)","Подпись\nпрове-\nряемого"]
[]
[]
[1,{"$f":"IFERROR(VLOOKUP($A27,'Журнал Вахта_ИТР'!$AB$4:$AG$1004,2,FALSE),\"\")","v":"Балык Садир"},{"$f":"IFERROR(VLOOKUP($A27,'Журнал Вахта_ИТР'!$AB$4:AM$1004,12,FALSE),\"\")","v":"Бурильщик ЭиРБС на нефть и газ 8 р"},{"$f":"IFERROR(VLOOKUP(A27,'Журнал Вахта_ИТР'!$AB$4:$AG$1004,5,FALSE),\"\")","v":"T506"},null,{"$f":"IFERROR(VLOOKUP($A27,'Журнал Вахта_ИТР'!$AB$4:$AO$1004,14,FALSE),\"\")","v":"Сдал"},{"$f":"IFERROR(VLOOKUP($A27,'Журнал Вахта_ИТР'!$AB$4:$BC$1004,18,FALSE),\"\")","v":"3747"},{"$f":"IFERROR(VLOOKUP($A27,'Журнал Вахта_ИТР'!$AB$4:$AO$1004,13,FALSE),\"\")","v":"Очередная"}]
[]
[2,{"$f":"IFERROR(VLOOKUP($A29,'Журнал Вахта_ИТР'!$AB$4:$AG$1004,2,FALSE),\"\")","v":"Семенов Сын"},{"$f":"IFERROR(VLOOKUP($A29,'Журнал Вахта_ИТР'!$AB$4:AM$1004,12,FALSE),\"\")","v":"Помощник бурильщика ЭиРБС (второй) 6 р."},{"$f":"IFERROR(VLOOKUP(A29,'Журнал Вахта_ИТР'!$AB$4:$AG$1004,5,FALSE),\"\")","v":"T506"},null,{"$f":"IFERROR(VLOOKUP($A29,'Журнал Вахта_ИТР'!$AB$4:$AO$1004,14,FALSE),\"\")","v":"Сдал"},{"$f":"IFERROR(VLOOKUP($A29,'Журнал Вахта_ИТР'!$AB$4:$BC$1004,18,FALSE),\"\")","v":"4576"},{"$f":"IFERROR(VLOOKUP($A29,'Журнал Вахта_ИТР'!$AB$4:$AO$1004,13,FALSE),\"\")","v":"Очередная"}]
[]
[3,{"$f":"IFERROR(VLOOKUP($A31,'Журнал Вахта_ИТР'!$AB$4:$AG$1004,2,FALSE),\"\")","v":"Коношанов Торган"},{"$f":"IFERROR(VLOOKUP($A31,'Журнал Вахта_ИТР'!$AB$4:AM$1004,12,FALSE),\"\")","v":"Помощник бурильщика ЭиРБС (второй) 6 р."},{"$f":"IFERROR(VLOOKUP(A31,'Журнал Вахта_ИТР'!$AB$4:$AG$1004,5,FALSE),\"\")","v":"T506"},null,{"$f":"IFERROR(VLOOKUP($A31,'Журнал Вахта_ИТР'!$AB$4:$AO$1004,14,FALSE),\"\")","v":"Сдал"},{"$f":"IFERROR(VLOOKUP($A31,'Журнал Вахта_ИТР'!$AB$4:$BC$1004,18,FALSE),\"\")","v":"127/2021"},{"$f":"IFERROR(VLOOKUP($A31,'Журнал Вахта_ИТР'!$AB$4:$AO$1004,13,FALSE),\"\")","v":"Очередная"}]
[]
[4,{"$f":"IFERROR(VLOOKUP($A33,'Журнал Вахта_ИТР'!$AB$4:$AG$1004,2,FALSE),\"\")","v":""},{"$f":"IFERROR(VLOOKUP($A33,'Журнал Вахта_ИТР'!$AB$4:AM$1004,12,FALSE),\"\")","v":""},{"$f":"IFERROR(VLOOKUP(A33,'Журнал Вахта_ИТР'!$AB$4:$AG$1004,5,FALSE),\"\")","v":""},null,{"$f":"IFERROR(VLOOKUP($A33,'Журнал Вахта_ИТР'!$AB$4:$AO$1004,14,FALSE),\"\")","v":""},{"$f":"IFERROR(VLOOKUP($A33,'Журнал Вахта_ИТР'!$AB$4:$BC$1004,18,FALSE),\"\")","v":""},{"$f":"IFERROR(VLOOKUP($A33,'Журнал Вахта_ИТР'!$AB$4:$AO$1004,13,FALSE),\"\")","v":""}]
[]
[5,{"$f":"IFERROR(VLOOKUP($A35,'Журнал Вахта_ИТР'!$AB$4:$AG$1004,2,FALSE),\"\")","v":""},{"$f":"IFERROR(VLOOKUP($A35,'Журнал Вахта_ИТР'!$AB$4:AM$1004,12,FALSE),\"\")","v":""},{"$f":"IFERROR(VLOOKUP(A35,'Журнал Вахта_ИТР'!$AB$4:$AG$1004,5,FALSE),\"\")","v":""},null,{"$f":"IFERROR(VLOOKUP($A35,'Журнал Вахта_ИТР'!$AB$4:$AO$1004,14,FALSE),\"\")","v":""},{"$f":"IFERROR(VLOOKUP($A35,'Журнал Вахта_ИТР'!$AB$4:$BC$1004,18,FALSE),\"\")","v":""},{"$f":"IFERROR(VLOOKUP($A35,'Журнал Вахта_ИТР'!$AB$4:$AO$1004,13,FALSE),\"\")","v":""}]
[]
[6,{"$f":"IFERROR(VLOOKUP($A37,'Журнал Вахта_ИТР'!$AB$4:$AG$1004,2,FALSE),\"\")","v":""},{"$f":"IFERROR(VLOOKUP($A37,'Журнал Вахта_ИТР'!$AB$4:AM$1004,12,FALSE),\"\")","v":""},{"$f":"IFERROR(VLOOKUP(A37,'Журнал Вахта_ИТР'!$AB$4:$AG$1004,5,FALSE),\"\")","v":""},null,{"$f":"IFERROR(VLOOKUP($A37,'Журнал Вахта_ИТР'!$AB$4:$AO$1004,14,FALSE),\"\")","v":""},{"$f":"IFERROR(VLOOKUP($A37,'Журнал Вахта_ИТР'!$AB$4:$BC$1004,18,FALSE),\"\")","v":""},{"$f":"IFERROR(VLOOKUP($A37,'Журнал Вахта_ИТР'!$AB$4:$AO$1004,13,FALSE),\"\")","v":""}]
[]
[7,{"$f":"IFERROR(VLOOKUP($A39,'Журнал Вахта_ИТР'!$AB$4:$AG$1004,2,FALSE),\"\")","v":""},{"$f":"IFERROR(VLOOKUP($A39,'Журнал Вахта_ИТР'!$AB$4:AM$1004,12,FALSE),\"\")","v":""},{"$f":"IFERROR(VLOOKUP(A39,'Журнал Вахта_ИТР'!$AB$4:$AG$1004,5,FALSE),\"\")","v":""},null,{"$f":"IFERROR(VLOOKUP($A39,'Журнал Вахта_ИТР'!$AB$4:$AO$1004,14,FALSE),\"\")","v":""},{"$f":"IFERROR(VLOOKUP($A39,'Журнал Вахта_ИТР'!$AB$4:$BC$1004,18,FALSE),\"\")","v":""},{"$f":"IFERROR(VLOOKUP($A39,'Журнал Вахта_ИТР'!$AB$4:$AO$1004,13,FALSE),\"\")","v":""}]
[]
[8,{"$f":"IFERROR(VLOOKUP($A41,'Журнал Вахта_ИТР'!$AB$4:$AG$1004,2,FALSE),\"\")","v":""},{"$f":"IFERROR(VLOOKUP($A41,'Журнал Вахта_ИТР'!$AB$4:AM$1004,12,FALSE),\"\")","v":""},{"$f":"IFERROR(VLOOKUP(A41,'Журнал Вахта_ИТР'!$AB$4:$AG$1004,5,FALSE),\"\")","v":""},null,{"$f":"IFERROR(VLOOKUP($A41,'Журнал Вахта_ИТР'!$AB$4:$AO$1004,14,FALSE),\"\")","v":""},{"$f":"IFERROR(VLOOKUP($A41,'Журнал Вахта_ИТР'!$AB$4:$BC$1004,18,FALSE),\"\")","v":""},{"$f":"IFERROR(VLOOKUP($A41,'Журнал Вахта_ИТР'!$AB$4:$AO$1004,13,FALSE),\"\")","v":""}]
[]
[]
["Председатель комиссии",null,null,{"$f":"IF(VLOOKUP(X10,'Журнал Вахта_ИТР'!$AB$4:$AM$1004,$X12,FALSE)=0,\"\",VLOOKUP(X11,'Журнал Вахта_ИТР'!$AB$4:$AM$1004,X13,FALSE))","v":"Руководитель проекта Ккококр С.Н."}]
[]
["Члены комиссии:",null,null,{"$f":"IF(VLOOKUP(Y10,'Журнал Вахта_ИТР'!$AB$4:$AM$1004,$Y12,FALSE)=0,\"\",VLOOKUP(Y11,'Журнал Вахта_ИТР'!$AB$4:$AM$1004,Y13,FALSE))","v":"Мастер буровой Кываыв Р.Р."}]
[]
[null,null,null,{"$f":"IF(VLOOKUP(Z10,'Журнал Вахта_ИТР'!$AB$4:$AM$1004,$Z12,FALSE)=0,\"\",VLOOKUP(Z11,'Журнал Вахта_ИТР'!$AB$4:$AM$1004,Z13,FALSE))","v":"Специалист по ОТ и ПБ Ааываывав В.В."}]
[]
[]
[]
[]
[null,null,"Протокол №"]
["заседания комиссии по проверке знаний работников\nООО «КСА ДОЙТАГ Раша»"]
[null,null,null,null,null,null,"Дата:",{"$f":"IF(VLOOKUP(V59,'Дата печать'!$A$4:$F$15,$V61,FALSE)=0,\"\",VLOOKUP(V60,'Дата печать'!$A$4:$F$15,V62,FALSE))","v":"2022-08-29"}]
[]
["В соответствии с приказом (распоряжением) работодателя (руководителя) организации"]
[{"$f":"A9","v":{"$error":"#REF!"}},null,null,"комиссия в составе:"]
[null,null,null,null,null,null,null,null,null,null,null,null,null,null,null,null,null,null,null,null,null,1,1,1,1,1]
["председатель",null,{"$f":"IF(VLOOKUP(X59,'Журнал Вахта_ИТР'!$AB$4:$AM$1004,$X61,FALSE)=0,\"\",VLOOKUP(X60,'Журнал Вахта_ИТР'!$AB$4:$AM$1004,X62,FALSE))","v":"Руководитель проекта Ккококр С.Н."},null,null,null,null,null,null,null,null,null,null,null,null,null,null,null,null,null,null,1,1,1,1,1]
[null,null,null,null,null,null,null,null,null,null,null,null,null,null,null,null,null,null,null,null,null,1,1,1,1,1]
["члены комиссии:",null,{"$f":"IF(VLOOKUP(Y59,'Журнал Вахта_ИТР'!$AB$4:$AM$1004,$Y61,FALSE)=0,\"\",VLOOKUP(Y60,'Журнал Вахта_ИТР'!$AB$4:$AM$1004,Y62,FALSE))","v":"Мастер буровой Кываыв Р.Р."},null,null,null,null,null,null,null,null,null,null,null,null,null,null,null,null,null,null,2,3,7,8,9]
[]
[null,null,{"$f":"IF(VLOOKUP(Z59,'Журнал Вахта_ИТР'!$AB$4:$AM$1004,$Z61,FALSE)=0,\"\",VLOOKUP(Z60,'Журнал Вахта_ИТР'!$AB$4:$AM$1004,Z62,FALSE))","v":"Специалист по ОТ и ПБ Ааываывав В.В."}]
[]
["провела проверку знаний у работников по безопасным методам и приемам  "]
["выполнения работ на высоте 2гр"]
[]
[]
[]
[]
["и установила, что ниже указанные сотрудник(и) допускаются к работе:"]
["№ п/п","Ф.И.О.","Должность","Наименование подразделения ",null,"Результат проверки знаний (сдал/не сдал),\n№ удост",null,"Причина проверки знаний (очеред, внеочеред)","Подпись\nпрове-\nряемого"]
[]
[]
[1,{"$f":"IFERROR(VLOOKUP($J76,'Журнал Вахта_ИТР'!$AB$4:$AG$1004,2,FALSE),\"\")","v":""},{"$f":"IFERROR(VLOOKUP($J76,'Журнал Вахта_ИТР'!$AB$4:AM$1004,12,FALSE),\"\")","v":""},{"$f":"IFERROR(VLOOKUP(J76,'Журнал Вахта_ИТР'!$AB$4:$AG$1004,5,FALSE),\"\")","v":""},null,{"$f":"IFERROR(VLOOKUP($J76,'Журнал Вахта_ИТР'!$AB$4:$AO$1004,14,FALSE),\"\")","v":""},{"$f":"IFERROR(VLOOKUP($J76,'Журнал Вахта_ИТР'!$AB$4:$BC$1004,18,FALSE),\"\")","v":""},{"$f":"IFERROR(VLOOKUP($J76,'Журнал Вахта_ИТР'!$AB$4:$AO$1004,13,FALSE),\"\")","v":""},null,9]
[]
[2,{"$f":"IFERROR(VLOOKUP($J78,'Журнал Вахта_ИТР'!$AB$4:$AG$1004,2,FALSE),\"\")","v":""},{"$f":"IFERROR(VLOOKUP($J78,'Журнал Вахта_ИТР'!$AB$4:AM$1004,12,FALSE),\"\")","v":""},{"$f":"IFERROR(VLOOKUP(J78,'Журнал Вахта_ИТР'!$AB$4:$AG$1004,5,FALSE),\"\")","v":""},null,{"$f":"IFERROR(VLOOKUP($J78,'Журнал Вахта_ИТР'!$AB$4:$AO$1004,14,FALSE),\"\")","v":""},{"$f":"IFERROR(VLOOKUP($J78,'Журнал Вахта_ИТР'!$AB$4:$BC$1004,18,FALSE),\"\")","v":""},{"$f":"IFERROR(VLOOKUP($J78,'Журнал Вахта_ИТР'!$AB$4:$AO$1004,13,FALSE),\"\")","v":""},null,10]
[]
[3,{"$f":"IFERROR(VLOOKUP($J80,'Журнал Вахта_ИТР'!$AB$4:$AG$1004,2,FALSE),\"\")","v":""},{"$f":"IFERROR(VLOOKUP($J80,'Журнал Вахта_ИТР'!$AB$4:AM$1004,12,FALSE),\"\")","v":""},{"$f":"IFERROR(VLOOKUP(J80,'Журнал Вахта_ИТР'!$AB$4:$AG$1004,5,FALSE),\"\")","v":""},null,{"$f":"IFERROR(VLOOKUP($J80,'Журнал Вахта_ИТР'!$AB$4:$AO$1004,14,FALSE),\"\")","v":""},{"$f":"IFERROR(VLOOKUP($J80,'Журнал Вахта_ИТР'!$AB$4:$BC$1004,18,FALSE),\"\")","v":""},{"$f":"IFERROR(VLOOKUP($J80,'Журнал Вахта_ИТР'!$AB$4:$AO$1004,13,FALSE),\"\")","v":""},null,11]
[]
[4,{"$f":"IFERROR(VLOOKUP($J82,'Журнал Вахта_ИТР'!$AB$4:$AG$1004,2,FALSE),\"\")","v":""},{"$f":"IFERROR(VLOOKUP($J82,'Журнал Вахта_ИТР'!$AB$4:AM$1004,12,FALSE),\"\")","v":""},{"$f":"IFERROR(VLOOKUP(J82,'Журнал Вахта_ИТР'!$AB$4:$AG$1004,5,FALSE),\"\")","v":""},null,{"$f":"IFERROR(VLOOKUP($J82,'Журнал Вахта_ИТР'!$AB$4:$AO$1004,14,FALSE),\"\")","v":""},{"$f":"IFERROR(VLOOKUP($J82,'Журнал Вахта_ИТР'!$AB$4:$BC$1004,18,FALSE),\"\")","v":""},{"$f":"IFERROR(VLOOKUP($J82,'Журнал Вахта_ИТР'!$AB$4:$AO$1004,13,FALSE),\"\")","v":""},null,12]
[]
[5,{"$f":"IFERROR(VLOOKUP($J84,'Журнал Вахта_ИТР'!$AB$4:$AG$1004,2,FALSE),\"\")","v":""},{"$f":"IFERROR(VLOOKUP($J84,'Журнал Вахта_ИТР'!$AB$4:AM$1004,12,FALSE),\"\")","v":""},{"$f":"IFERROR(VLOOKUP(J84,'Журнал Вахта_ИТР'!$AB$4:$AG$1004,5,FALSE),\"\")","v":""},null,{"$f":"IFERROR(VLOOKUP($J84,'Журнал Вахта_ИТР'!$AB$4:$AO$1004,14,FALSE),\"\")","v":""},{"$f":"IFERROR(VLOOKUP($J84,'Журнал Вахта_ИТР'!$AB$4:$BC$1004,18,FALSE),\"\")","v":""},{"$f":"IFERROR(VLOOKUP($J84,'Журнал Вахта_ИТР'!$AB$4:$AO$1004,13,FALSE),\"\")","v":""},null,13]
[]
[6,{"$f":"IFERROR(VLOOKUP($J86,'Журнал Вахта_ИТР'!$AB$4:$AG$1004,2,FALSE),\"\")","v":""},{"$f":"IFERROR(VLOOKUP($J86,'Журнал Вахта_ИТР'!$AB$4:AM$1004,12,FALSE),\"\")","v":""},{"$f":"IFERROR(VLOOKUP(J86,'Журнал Вахта_ИТР'!$AB$4:$AG$1004,5,FALSE),\"\")","v":""},null,{"$f":"IFERROR(VLOOKUP($J86,'Журнал Вахта_ИТР'!$AB$4:$AO$1004,14,FALSE),\"\")","v":""},{"$f":"IFERROR(VLOOKUP($J86,'Журнал Вахта_ИТР'!$AB$4:$BC$1004,18,FALSE),\"\")","v":""},{"$f":"IFERROR(VLOOKUP($J86,'Журнал Вахта_ИТР'!$AB$4:$AO$1004,13,FALSE),\"\")","v":""},null,14]
[]
[7,{"$f":"IFERROR(VLOOKUP($J88,'Журнал Вахта_ИТР'!$AB$4:$AG$1004,2,FALSE),\"\")","v":""},{"$f":"IFERROR(VLOOKUP($J88,'Журнал Вахта_ИТР'!$AB$4:AM$1004,12,FALSE),\"\")","v":""},{"$f":"IFERROR(VLOOKUP(J88,'Журнал Вахта_ИТР'!$AB$4:$AG$1004,5,FALSE),\"\")","v":""},null,{"$f":"IFERROR(VLOOKUP($J88,'Журнал Вахта_ИТР'!$AB$4:$AO$1004,14,FALSE),\"\")","v":""},{"$f":"IFERROR(VLOOKUP($J88,'Журнал Вахта_ИТР'!$AB$4:$BC$1004,18,FALSE),\"\")","v":""},{"$f":"IFERROR(VLOOKUP($J88,'Журнал Вахта_ИТР'!$AB$4:$AO$1004,13,FALSE),\"\")","v":""},null,15]
[]
[8,{"$f":"IFERROR(VLOOKUP($J90,'Журнал Вахта_ИТР'!$AB$4:$AG$1004,2,FALSE),\"\")","v":""},{"$f":"IFERROR(VLOOKUP($J90,'Журнал Вахта_ИТР'!$AB$4:AM$1004,12,FALSE),\"\")","v":""},{"$f":"IFERROR(VLOOKUP(J90,'Журнал Вахта_ИТР'!$AB$4:$AG$1004,5,FALSE),\"\")","v":""},null,{"$f":"IFERROR(VLOOKUP($J90,'Журнал Вахта_ИТР'!$AB$4:$AO$1004,14,FALSE),\"\")","v":""},{"$f":"IFERROR(VLOOKUP($J90,'Журнал Вахта_ИТР'!$AB$4:$BC$1004,18,FALSE),\"\")","v":""},{"$f":"IFERROR(VLOOKUP($J90,'Журнал Вахта_ИТР'!$AB$4:$AO$1004,13,FALSE),\"\")","v":""},null,16]
[]
[]
["Председатель комиссии",null,null,{"$f":"IF(VLOOKUP(X10,'Журнал Вахта_ИТР'!$AB$4:$AM$1004,$X12,FALSE)=0,\"\",VLOOKUP(X11,'Журнал Вахта_ИТР'!$AB$4:$AM$1004,X13,FALSE))","v":"Руководитель проекта Ккококр С.Н."}]
[]
["Члены комиссии:",null,null,{"$f":"IF(VLOOKUP(Y10,'Журнал Вахта_ИТР'!$AB$4:$AM$1004,$Y12,FALSE)=0,\"\",VLOOKUP(Y11,'Журнал Вахта_ИТР'!$AB$4:$AM$1004,Y13,FALSE))","v":"Мастер буровой Кываыв Р.Р."}]
[]
[null,null,null,{"$f":"IF(VLOOKUP(Z10,'Журнал Вахта_ИТР'!$AB$4:$AM$1004,$Z12,FALSE)=0,\"\",VLOOKUP(Z11,'Журнал Вахта_ИТР'!$AB$4:$AM$1004,Z13,FALSE))","v":"Специалист по ОТ и ПБ Ааываывав В.В."}]

{"sheet":"Журнал Вахта_ИТР","index":3,"n_rows":1004,"n_cols":55,"rows_kept":1004,"cut":false,"hidden":false,"merged":[]}
["Т","БУ:","T506",null,null,null,null,null,null,null,null,null,null,null,null,null,null,null,null,null,null,null,null,null,null,null,null,{"$f":"'Дата печать'!F1","v":"2022-08-29"}]
["№ п/п","Дата проведения обучения:","ФИО обучаемого:","Должность:","Осн.\nпрофессия","Смежная профессия (пом.бур 2, водит автом)","ОТ","Работа на высоте (до)","Высота ежегодная проверка знаний","Cтропальщик                                                                                                      ","Разряд","ПС с пола (раз в квартал)","Вышко\nмонтажник","Разряд","Машинист\nАГП","Разряд","Рабочий\nлюльки","Сосуды","Ремонт ГПМ","Удостоверение строп (ДО)","Председатель (должность / ФИО):","Член комиссии 1 (должность / ФИО):","Член комиссии 2 (должность / ФИО):","Вид проверки (очеред,внеочеред)","Результат (сдал / не сдал)"," ",null,"№","ФИО","Дата проведения обучения:","Основная профессия","ФИО обучающего","Организация:","Председатель:","Член комиссии:1","Член комиссии:2","Причина (очеред,внеочеред)","Результат","Должность:","Вид проверки (очеред,внеочеред)","Результат","Смежная профессия (пом.бур 2, водит автом)","ОТ","Работа на высоте (до)","Высота ежегодная проверка знаний","Cтропальщик                                                                                                      ","Разряд","ПС с пола (раз в квартал)","Вышко\nмонтажник","Разряд","Машинист\nАГП","Разряд","Рабочий\nлюльки","Сосуды","Ремонт ГПМ"]
["1",2,4,5,6,7,8,9,10,11,12,13,14,15,16,17,18,19,20,7,9,10,11,12,13," ",null,"1",2,3,4,5,6,7,8,9,10,11,12,13,14,15,16,17,18,19,20,21,22,23,24,25,26,27,28]
[1,null,{"$f":"'Вахта+Подменные'!B4","v":"Иванов Андрей"},{"$f":"'Вахта+Подменные'!C4","v":"Бурильщик ЭиРБС на нефть и газ 8 р"},{"$f":"'Вахта+Подменные'!D4","v":"123077"},{"$f":"'Вахта+Подменные'!E4","v":0},{"$f":"'Вахта+Подменные'!F4","v":"17-044/322-1"},{"$f":"'Вахта+Подменные'!G4","v":"2302"},{"$f":"'Вахта+Подменные'!H4","v":"2302"},{"$f":"'Вахта+Подменные'!I4","v":3374},{"$f":"'Вахта+Подменные'!J4","v":4},{"$f":"'Вахта+Подменные'!K4","v":3374},{"$f":"'Вахта+Подменные'!L4","v":"12/317"},{"$f":"'Вахта+Подменные'!M4","v":6},{"$f":"'Вахта+Подменные'!N4","v":529},{"$f":"'Вахта+Подменные'!O4","v":5},{"$f":"'Вахта+Подменные'!P4","v":840},{"$f":"'Вахта+Подменные'!Q4","v":0},{"$f":"'Вахта+Подменные'!R4","v":0},{"$f":"_xlfn.CONCAT('Журнал Вахта_ИТР'!$C$1)","v":"T506"},null,null,null,"Очередная","Сдал"," ",null,{"$f":"IF(AC4=\"\",\"\",MAX($AB$3:AB3)+1)","v":""},{"$f":"IF(C4=\"\",\"\",IF(B4=$AB$1,C4,\"\"))","v":""},{"$f":"IF(AB4=\"\",\"\",B4)","v":""},{"$f":"IF(AB4=\"\",\"\",E4)","v":""},{"$f":"IF(AB4=\"\",T4,T4)","v":"T506"},{"$f":"IF(AD4=\"\",\"\",#REF!)","v":""},{"$f":"IF(AD4=\"\",\"\",U4)","v":""},{"$f":"IF(AD4=\"\",\"\",V4)","v":""},{"$f":"IF(AD4=\"\",\"\",W4)","v":""},{"$f":"IF(AD4=\"\",\"\",X4)","v":""},{"$f":"IF(AI4=\"\",\"\",Y4)","v":""},{"$f":"IF(AD4=\"\",\"\",D4)","v":""},{"$f":"IF(AD4=\"\",\"\",X4)","v":""},{"$f":"IF(AD4=\"\",\"\",Y4)","v":""},{"$f":"IF(AD4=\"\",\"\",F4)","v":""},{"$f":"IF(AE4=\"\",\"\",G4)","v":""},{"$f":"IF(AD4=\"\",\"\",H4)","v":""},{"$f":"IF(AD4=\"\",\"\",I4)","v":""},"","","","","","","","","",""]
[2,"2022-08-29",{"$f":"'Вахта+Подменные'!B6","v":"Балык Садир"},{"$f":"'Вахта+Подменные'!C6","v":"Бурильщик ЭиРБС на нефть и газ 8 р"},{"$f":"'Вахта+Подменные'!D6","v":"165205"},{"$f":"'Вахта+Подменные'!E6","v":0},{"$f":"'Вахта+Подменные'!F6","v":"Т506/103"},{"$f":"'Вахта+Подменные'!G6","v":0},{"$f":"'Вахта+Подменные'!H6","v":"3747"},{"$f":"'Вахта+Подменные'!I6","v":"174-2-17"},{"$f":"'Вахта+Подменные'!J6","v":0},{"$f":"'Вахта+Подменные'!K6","v":"174-2-17"},{"$f":"'Вахта+Подменные'!L6","v":"97-16-01"},{"$f":"'Вахта+Подменные'!M6","v":0},{"$f":"'Вахта+Подменные'!N6","v":0},{"$f":"'Вахта+Подменные'!O6","v":0},{"$f":"'Вахта+Подменные'!P6","v":0},{"$f":"'Вахта+Подменные'!Q6","v":0},{"$f":"'Вахта+Подменные'!R6","v":0},{"$f":"_xlfn.CONCAT('Журнал Вахта_ИТР'!$C$1)","v":"T506"},"Руководитель проекта Ккококр С.Н.","Мастер буровой Кываыв Р.Р.","Специалист по ОТ и ПБ Ааываывав В.В.","Очередная","Сдал"," ",null,{"$f":"IF(AC5=\"\",\"\",MAX($AB$3:AB4)+1)","v":1},{"$f":"IF(C5=\"\",\"\",IF(B5=$AB$1,C5,\"\"))","v":"Балык Садир"},{"$f":"IF(AB5=\"\",\"\",B5)","v":"2022-08-29"},{"$f":"IF(AB5=\"\",\"\",E5)","v":"165205"},{"$f":"IF(AB5=\"\",T5,T5)","v":"T506"},{"$f":"IF(AD5=\"\",\"\",#REF!)","v":{"$error":"#REF!"}},{"$f":"IF(AD5=\"\",\"\",U5)","v":"Руководитель проекта Ккококр С.Н."},{"$f":"IF(AD5=\"\",\"\",V5)","v":"Мастер буровой Кываыв Р.Р."},{"$f":"IF(AD5=\"\",\"\",W5)","v":"Специалист по ОТ и ПБ Ааываывав В.В."},{"$f":"IF(AD5=\"\",\"\",X5)","v":"Очередная"},{"$f":"IF(AI5=\"\",\"\",Y5)","v":"Сдал"},{"$f":"IF(AD5=\"\",\"\",D5)","v":"Бурильщик ЭиРБС на нефть и газ 8 р"},{"$f":"IF(AD5=\"\",\"\",X5)","v":"Очередная"},{"$f":"IF(AD5=\"\",\"\",Y5)","v":"Сдал"},{"$f":"IF(AD5=\"\",\"\",F5)","v":0},{"$f":"IF(AE5=\"\",\"\",G5)","v":"Т506/103"},{"$f":"IF(AD5=\"\",\"\",H5)","v":0},{"$f":"IF(AD5=\"\",\"\",I5)","v":"3747"},{"$f":"IF(AH5=\"\",\"\",J5)","v":"174-2-17"},{"$f":"IF(AI5=\"\",\"\",K5)","v":0},{"$f":"IF(AJ5=\"\",\"\",L5)","v":"174-2-17"},{"$f":"IF(AK5=\"\",\"\",M5)","v":"97-16-01"},{"$f":"IF(AL5=\"\",\"\",N5)","v":0},{"$f":"IF(AM5=\"\",\"\",O5)","v":0},{"$f":"IF(AN5=\"\",\"\",P5)","v":0},{"$f":"IF(AO5=\"\",\"\",Q5)","v":0},{"$f":"IF(AP5=\"\",\"\",R5)","v":0},{"$f":"IF(AQ5=\"\",\"\",S5)","v":0}]
[3,"2022-08-29",{"$f":"'Вахта+Подменные'!B8","v":"Семенов Сын"},{"$f":"'Вахта+Подменные'!C8","v":"Помощник бурильщика ЭиРБС (второй) 6 р."},{"$f":"'Вахта+Подменные'!D8","v":"28-3842"},{"$f":"'Вахта+Подменные'!E8","v":0},{"$f":"'Вахта+Подменные'!F8","v":"Т506/32"},{"$f":"'Вахта+Подменные'!G8","v":0},{"$f":"'Вахта+Подменные'!H8","v":"4576"},{"$f":"'Вахта+Подменные'!I8","v":"88-16-06"},{"$f":"'Вахта+Подменные'!J8","v":0},{"$f":"'Вахта+Подменные'!K8","v":"88-16-06"},{"$f":"'Вахта+Подменные'!L8","v":"97-16-04"},{"$f":"'Вахта+Подменные'!M8","v":0},{"$f":"'Вахта+Подменные'!N8","v":0},{"$f":"'Вахта+Подменные'!O8","v":0},{"$f":"'Вахта+Подменные'!P8","v":0},{"$f":"'Вахта+Подменные'!Q8","v":0},{"$f":"'Вахта+Подменные'!R8","v":0},{"$f":"_xlfn.CONCAT('Журнал Вахта_ИТР'!$C$1)","v":"T506"},null,null,null,"Очередная","Сдал"," ",null,{"$f":"IF(AC6=\"\",\"\",MAX($AB$3:AB5)+1)","v":2},"Семенов Сын","2022-08-29","28-3842","T506",{"$f":"IF(AD6=\"\",\"\",#REF!)","v":{"$error":"#REF!"}},0,0,0,"Очередная","Сдал","Помощник бурильщика ЭиРБС (второй) 6 р.","Очередная","Сдал",0,"Т506/32",0,"4576","88-16-06",0,"88-16-06","97-16-04",0,0,0,0,0,0]
[4,null,{"$f":"'Вахта+Подменные'!B10","v":"Топай Отсюда"},{"$f":"'Вахта+Подменные'!C10","v":"Помощник бурильщика ЭиРБС (первый) 6 р."},{"$f":"'Вахта+Подменные'!D10","v":"1257"},{"$f":"'Вахта+Подменные'!E10","v":0},{"$f":"'Вахта+Подменные'!F10","v":"62-19-05"},{"$f":"'Вахта+Подменные'!G10","v":0},{"$f":"'Вахта+Подменные'!H10","v":"3285"},{"$f":"'Вахта+Подменные'!I10","v":"1844"},{"$f":"'Вахта+Подменные'!J10","v":0},{"$f":"'Вахта+Подменные'!K10","v":"1844"},{"$f":"'Вахта+Подменные'!L10","v":0},{"$f":"'Вахта+Подменные'!M10","v":0},{"$f":"'Вахта+Подменные'!N10","v":0},{"$f":"'Вахта+Подменные'!O10","v":0},{"$f":"'Вахта+Подменные'!P10","v":0},{"$f":"'Вахта+Подменные'!Q10","v":0},{"$f":"'Вахта+Подменные'!R10","v":0},{"$f":"_xlfn.CONCAT('Журнал Вахта_ИТР'!$C$1)","v":"T506"},null,null,null,"Очередная","Сдал"," ",null,{"$f":"IF(AC7=\"\",\"\",MAX($AB$3:AB6)+1)","v":""},"","","","T506",{"$f":"IF(AD7=\"\",\"\",#REF!)","v":""},"","","","","","","","","","","","","","","","","","","","","",""]
[5,null,{"$f":"'Вахта+Подменные'!B12","v":"Глучше завтра"},{"$f":"'Вахта+Подменные'!C12","v":"Помощник бурильщика ЭиРБС (первый) 6 р."},{"$f":"'Вахта+Подменные'!D12","v":" 52-17-01"},{"$f":"'Вахта+Подменные'!E12","v":0},{"$f":"'Вахта+Подменные'!F12","v":"Т506/31"},{"$f":"'Вахта+Подменные'!G12","v":0},{"$f":"'Вахта+Подменные'!H12","v":"4577"},{"$f":"'Вахта+Подменные'!I12","v":"81-17-10"},{"$f":"'Вахта+Подменные'!J12","v":0},{"$f":"'Вахта+Подменные'!K12","v":"81-17-10"},{"$f":"'Вахта+Подменные'!L12","v":"ПРП-25-15-0178"},{"$f":"'Вахта+Подменные'!M12","v":0},{"$f":"'Вахта+Подменные'!N12","v":0},{"$f":"'Вахта+Подменные'!O12","v":0},{"$f":"'Вахта+Подменные'!P12","v":0},{"$f":"'Вахта+Подменные'!Q12","v":0},{"$f":"'Вахта+Подменные'!R12","v":0},{"$f":"_xlfn.CONCAT('Журнал Вахта_ИТР'!$C$1)","v":"T506"},null,null,null,"Очередная","Сдал"," ",null,{"$f":"IF(AC8=\"\",\"\",MAX($AB$3:AB7)+1)","v":""},"","","","T506",{"$f":"IF(AD8=\"\",\"\",#REF!)","v":""},"","","","","","","","","","","","","","","","","","","","","",""]
[6,null,{"$f":"'Вахта+Подменные'!B14","v":"Как Сам"},{"$f":"'Вахта+Подменные'!C14","v":"Помощник бурильщика ЭиРБС (первый) 6 р."},{"$f":"'Вахта+Подменные'!D14","v":"3779"},{"$f":"'Вахта+Подменные'!E14","v":0},{"$f":"'Вахта+Подменные'!F14","v":"Т400-225/10-3"},{"$f":"'Вахта+Подменные'!G14","v":0},{"$f":"'Вахта+Подменные'!H14","v":"5327"},{"$f":"'Вахта+Подменные'!I14","v":"011019-2"},{"$f":"'Вахта+Подменные'!J14","v":0},{"$f":"'Вахта+Подменные'!K14","v":"011019-2"},{"$f":"'Вахта+Подменные'!L14","v":"101019-2"},{"$f":"'Вахта+Подменные'!M14","v":0},{"$f":"'Вахта+Подменные'!N14","v":0},{"$f":"'Вахта+Подменные'!O14","v":0},{"$f":"'Вахта+Подменные'!P14","v":0},{"$f":"'Вахта+Подменные'!Q14","v":0},{"$f":"'Вахта+Подменные'!R14","v":0},{"$f":"_xlfn.CONCAT('Журнал Вахта_ИТР'!$C$1)","v":"T506"},null,null,null,"Очередная","Сдал"," ",null,{"$f":"IF(AC9=\"\",\"\",MAX($AB$3:AB8)+1)","v":""},"","","","T506",{"$f":"IF(AD9=\"\",\"\",#REF!)","v":""},"","","","","","","","","","","","","","","","","","","","","",""]
[7,null,{"$f":"'Вахта+Подменные'!B16","v":"Толстый Пингвин"},{"$f":"'Вахта+Подменные'!C16","v":"Слесарь по обслуживанию буровых 6 р."},{"$f":"'Вахта+Подменные'!D16","v":"0316/18-2"},{"$f":"'Вахта+Подменные'!E16","v":0},{"$f":"'Вахта+Подменные'!F16","v":"Т506/22/01"},{"$f":"'Вахта+Подменные'!G16","v":"3735"},{"$f":"'Вахта+Подменные'!H16","v":"3735"},{"$f":"'Вахта+Подменные'!I16","v":0},{"$f":"'Вахта+Подменные'!J16","v":0},{"$f":"'Вахта+Подменные'!K16","v":0},{"$f":"'Вахта+Подменные'!L16","v":0},{"$f":"'Вахта+Подменные'!M16","v":0},{"$f":"'Вахта+Подменные'!N16","v":"178775"},{"$f":"'Вахта+Подменные'!O16","v":5},{"$f":"'Вахта+Подменные'!P16","v":0},{"$f":"'Вахта+Подменные'!Q16","v":"02-38599"},{"$f":"'Вахта+Подменные'!R16","v":0},{"$f":"_xlfn.CONCAT('Журнал Вахта_ИТР'!$C$1)","v":"T506"},null,null,null,"Очередная","Сдал"," ",null,{"$f":"IF(AC10=\"\",\"\",MAX($AB$3:AB9)+1)","v":""},"","","","T506",{"$f":"IF(AD10=\"\",\"\",#REF!)","v":""},"","","","","","","","","","","","","","","","","","","","","",""]
[8,null,{"$f":"'Вахта+Подменные'!B18","v":"Закат Расвет"},{"$f":"'Вахта+Подменные'!C18","v":"Электромонтер по обслуживанию буровых 6 р."},{"$f":"'Вахта+Подменные'!D18","v":0},{"$f":"'Вахта+Подменные'!E18","v":0},{"$f":"'Вахта+Подменные'!F18","v":"50-21-03"},{"$f":"'Вахта+Подменные'!G18","v":0},{"$f":"'Вахта+Подменные'!H18","v":"6892"},{"$f":"'Вахта+Подменные'!I18","v":0},{"$f":"'Вахта+Подменные'!J18","v":0},{"$f":"'Вахта+Подменные'!K18","v":0},{"$f":"'Вахта+Подменные'!L18","v":0},{"$f":"'Вахта+Подменные'!M18","v":0},{"$f":"'Вахта+Подменные'!N18","v":0},{"$f":"'Вахта+Подменные'!O18","v":0},{"$f":"'Вахта+Подменные'!P18","v":0},{"$f":"'Вахта+Подменные'!Q18","v":0},{"$f":"'Вахта+Подменные'!R18","v":0},{"$f":"_xlfn.CONCAT('Журнал Вахта_ИТР'!$C$1)","v":"T506"},null,null,null,"Очередная","Сдал"," ",null,{"$f":"IF(AC11=\"\",\"\",MAX($AB$3:AB10)+1)","v":""},"","","","T506",{"$f":"IF(AD11=\"\",\"\",#REF!)","v":""},"","","","","","","","","","","","","","","","","","","","","",""]
[9,null,{"$f":"'Вахта+Подменные'!B20","v":"Ничего незнаю"},{"$f":"'Вахта+Подменные'!C20","v":"Водитель автопогрузчика"},{"$f":"'Вахта+Подменные'!D20","v":"0265"},{"$f":"'Вахта+Подменные'!E20","v":0},{"$f":"'Вахта+Подменные'!F20","v":"Т506/34"},{"$f":"'Вахта+Подменные'!G20","v":"3526"},{"$f":"'Вахта+Подменные'!H20","v":"3526"},{"$f":"'Вахта+Подменные'!I20","v":"280"},{"$f":"'Вахта+Подменные'!J20","v":0},{"$f":"'Вахта+Подменные'!K20","v":"280"},{"$f":"'Вахта+Подменные'!L20","v":0},{"$f":"'Вахта+Подменные'!M20","v":0},{"$f":"'Вахта+Подменные'!N20","v":0},{"$f":"'Вахта+Подменные'!O20","v":0},{"$f":"'Вахта+Подменные'!P20","v":0},{"$f":"'Вахта+Подменные'!Q20","v":0},{"$f":"'Вахта+Подменные'!R20","v":0},{"$f":"_xlfn.CONCAT('Журнал Вахта_ИТР'!$C$1)","v":"T506"},null,null,null,"Очередная","Сдал",null,null,{"$f":"IF(AC12=\"\",\"\",MAX($AB$3:AB11)+1)","v":""},"","","","T506",{"$f":"IF(AD12=\"\",\"\",#REF!)","v":""},"","","","","","","","","","","","","","","","","","","","","",""]
[10,null,{"$f":"'Вахта+Подменные'!B22","v":0},{"$f":"'Вахта+Подменные'!C22","v":"Водитель автопогрузчика"},{"$f":"'Вахта+Подменные'!D22","v":0},{"$f":"'Вахта+Подменные'!E22","v":0},{"$f":"'Вахта+Подменные'!F22","v":0},{"$f":"'Вахта+Подменные'!G22","v":0},{"$f":"'Вахта+Подменные'!H22","v":0},{"$f":"'Вахта+Подменные'!I22","v":0},{"$f":"'Вахта+Подменные'!J22","v":0},{"$f":"'Вахта+Подменные'!K22","v":0},{"$f":"'Вахта+Подменные'!L22","v":0},{"$f":"'Вахта+Подменные'!M22","v":0},{"$f":"'Вахта+Подменные'!N22","v":0},{"$f":"'Вахта+Подменные'!O22","v":0},{"$f":"'Вахта+Подменные'!P22","v":0},{"$f":"'Вахта+Подменные'!Q22","v":0},{"$f":"'Вахта+Подменные'!R22","v":0},{"$f":"_xlfn.CONCAT('Журнал Вахта_ИТР'!$C$1)","v":"T506"},null,null,null,"Очередная","Сдал"," ",null,{"$f":"IF(AC13=\"\",\"\",MAX($AB$3:AB12)+1)","v":""},"","","","T506",{"$f":"IF(AD13=\"\",\"\",#REF!)","v":""},"","","","","","","","","","","","","","","","","","","","","",""]
[11,null,{"$f":"'Вахта+Подменные'!B25","v":0},{"$f":"'Вахта+Подменные'!C25","v":"Бурильщик ЭиРБС на нефть и газ 8 р"},{"$f":"'Вахта+Подменные'!D25","v":0},{"$f":"'Вахта+Подменные'!E25","v":0},{"$f":"'Вахта+Подменные'!F25","v":0},{"$f":"'Вахта+Подменные'!G25","v":0},{"$f":"'Вахта+Подменные'!H25","v":0},{"$f":"'Вахта+Подменные'!I25","v":0},{"$f":"'Вахта+Подменные'!J25","v":0},{"$f":"'Вахта+Подменные'!K25","v":0},{"$f":"'Вахта+Подменные'!L25","v":0},{"$f":"'Вахта+Подменные'!M25","v":0},{"$f":"'Вахта+Подменные'!N25","v":0},{"$f":"'Вахта+Подменные'!O25","v":0},{"$f":"'Вахта+Подменные'!P25","v":0},{"$f":"'Вахта+Подменные'!Q25","v":0},{"$f":"'Вахта+Подменные'!R25","v":0},{"$f":"_xlfn.CONCAT('Журнал Вахта_ИТР'!$C$1)","v":"T506"},null,null,null,"Очередная","Сдал"," ",null,{"$f":"IF(AC14=\"\",\"\",MAX($AB$3:AB13)+1)","v":""},"","","","T506",{"$f":"IF(AD14=\"\",\"\",#REF!)","v":""},"","","","","","","","","","","","","","","","","","","","","",""]
[12,null,{"$f":"'Вахта+Подменные'!B27","v":0},{"$f":"'Вахта+Подменные'!C27","v":"Бурильщик ЭиРБС на нефть и газ 8 р"},{"$f":"'Вахта+Подменные'!D27","v":0},{"$f":"'Вахта+Подменные'!E27","v":0},{"$f":"'Вахта+Подменные'!F27","v":0},{"$f":"'Вахта+Подменные'!G27","v":0},{"$f":"'Вахта+Подменные'!H27","v":0},{"$f":"'Вахта+Подменные'!I27","v":0},{"$f":"'Вахта+Подменные'!J27","v":0},{"$f":"'Вахта+Подменные'!K27","v":0},{"$f":"'Вахта+Подменные'!L27","v":0},{"$f":"'Вахта+Подменные'!M27","v":0},{"$f":"'Вахта+Подменные'!N27","v":0},{"$f":"'Вахта+Подменные'!O27","v":0},{"$f":"'Вахта+Подменные'!P27","v":0},{"$f":"'Вахта+Подменные'!Q27","v":0},{"$f":"'Вахта+Подменные'!R27","v":0},{"$f":"_xlfn.CONCAT('Журнал Вахта_ИТР'!$C$1)","v":"T506"},null,null,null,"Очередная","Сдал"," ",null,{"$f":"IF(AC15=\"\",\"\",MAX($AB$3:AB14)+1)","v":""},"","","","T506",{"$f":"IF(AD15=\"\",\"\",#REF!)","v":""},"","","","","","","","","","","","","","","","","","","","","",""]
[13,null,{"$f":"'Вахта+Подменные'!B29","v":0},{"$f":"'Вахта+Подменные'!C29","v":"Помощник бурильщика ЭиРБС (второй) 6 р."},{"$f":"'Вахта+Подменные'!D29","v":0},{"$f":"'Вахта+Подменные'!E29","v":0},{"$f":"'Вахта+Подменные'!F29","v":0},{"$f":"'Вахта+Подменные'!G29","v":0},{"$f":"'Вахта+Подменные'!H29","v":0},{"$f":"'Вахта+Подменные'!I29","v":0},{"$f":"'Вахта+Подменные'!J29","v":0},{"$f":"'Вахта+Подменные'!K29","v":0},{"$f":"'Вахта+Подменные'!L29","v":0},{"$f":"'Вахта+Подменные'!M29","v":0},{"$f":"'Вахта+Подменные'!N29","v":0},{"$f":"'Вахта+Подменные'!O29","v":0},{"$f":"'Вахта+Подменные'!P29","v":0},{"$f":"'Вахта+Подменные'!Q29","v":0},{"$f":"'Вахта+Подменные'!R29","v":0},{"$f":"_xlfn.CONCAT('Журнал Вахта_ИТР'!$C$1)","v":"T506"},null,null,null,"Очередная","Сдал"," ",null,{"$f":"IF(AC16=\"\",\"\",MAX($AB$3:AB15)+1)","v":""},"","","","T506",{"$f":"IF(AD16=\"\",\"\",#REF!)","v":""},"","","","","","","","","","","","","","","","","","","","","",""]
[14,null,{"$f":"'Вахта+Подменные'!B31","v":0},{"$f":"'Вахта+Подменные'!C31","v":"Помощник бурильщика ЭиРБС (первый) 6 р."},{"$f":"'Вахта+Подменные'!D31","v":0},{"$f":"'Вахта+Подменные'!E31","v":0},{"$f":"'Вахта+Подменные'!F31","v":0},{"$f":"'Вахта+Подменные'!G31","v":0},{"$f":"'Вахта+Подменные'!H31","v":0},{"$f":"'Вахта+Подменные'!I31","v":0},{"$f":"'Вахта+Подменные'!J31","v":0},{"$f":"'Вахта+Подменные'!K31","v":0},{"$f":"'Вахта+Подменные'!L31","v":0},{"$f":"'Вахта+Подменные'!M31","v":0},{"$f":"'Вахта+Подменные'!N31","v":0},{"$f":"'Вахта+Подменные'!O31","v":0},{"$f":"'Вахта+Подменные'!P31","v":0},{"$f":"'Вахта+Подменные'!Q31","v":0},{"$f":"'Вахта+Подменные'!R31","v":0},{"$f":"_xlfn.CONCAT('Журнал Вахта_ИТР'!$C$1)","v":"T506"},null,null,null,"Очередная","Сдал"," ",null,{"$f":"IF(AC17=\"\",\"\",MAX($AB$3:AB16)+1)","v":""},"","","","T506",{"$f":"IF(AD17=\"\",\"\",#REF!)","v":""},"","","","","","","","","","","","","","","","","","","","","",""]
[15,null,{"$f":"'Вахта+Подменные'!B33","v":0},{"$f":"'Вахта+Подменные'!C33","v":"Помощник бурильщика ЭиРБС (первый) 6 р."},{"$f":"'Вахта+Подменные'!D33","v":0},{"$f":"'Вахта+Подменные'!E33","v":0},{"$f":"'Вахта+Подменные'!F33","v":0},{"$f":"'Вахта+Подменные'!G33","v":0},{"$f":"'Вахта+Подменные'!H33","v":0},{"$f":"'Вахта+Подменные'!I33","v":0},{"$f":"'Вахта+Подменные'!J33","v":0},{"$f":"'Вахта+Подменные'!K33","v":0},{"$f":"'Вахта+Подменные'!L33","v":0},{"$f":"'Вахта+Подменные'!M33","v":0},{"$f":"'Вахта+Подменные'!N33","v":0},{"$f":"'Вахта+Подменные'!O33","v":0},{"$f":"'Вахта+Подменные'!P33","v":0},{"$f":"'Вахта+Подменные'!Q33","v":0},{"$f":"'Вахта+Подменные'!R33","v":0},{"$f":"_xlfn.CONCAT('Журнал Вахта_ИТР'!$C$1)","v":"T506"},null,null,null,"Очередная","Сдал"," ",null,{"$f":"IF(AC18=\"\",\"\",MAX($AB$3:AB17)+1)","v":""},"","","","T506",{"$f":"IF(AD18=\"\",\"\",#REF!)","v":""},"","","","","","","","","","","","","","","","","","","","","",""]
[16,null,{"$f":"'Вахта+Подменные'!B35","v":0},{"$f":"'Вахта+Подменные'!C35","v":"Помощник бурильщика ЭиРБС (первый) 6 р."},{"$f":"'Вахта+Подменные'!D35","v":0},{"$f":"'Вахта+Подменные'!E35","v":0},{"$f":"'Вахта+Подменные'!F35","v":0},{"$f":"'Вахта+Подменные'!G35","v":0},{"$f":"'Вахта+Подменные'!H35","v":0},{"$f":"'Вахта+Подменные'!I35","v":0},{"$f":"'Вахта+Подменные'!J35","v":0},{"$f":"'Вахта+Подменные'!K35","v":0},{"$f":"'Вахта+Подменные'!L35","v":0},{"$f":"'Вахта+Подменные'!M35","v":0},{"$f":"'Вахта+Подменные'!N35","v":0},{"$f":"'Вахта+Подменные'!O35","v":0},{"$f":"'Вахта+Подменные'!P35","v":0},{"$f":"'Вахта+Подменные'!Q35","v":0},{"$f":"'Вахта+Подменные'!R35","v":0},{"$f":"_xlfn.CONCAT('Журнал Вахта_ИТР'!$C$1)","v":"T506"},null,null,null,"Очередная","Сдал"," ",null,{"$f":"IF(AC19=\"\",\"\",MAX($AB$3:AB18)+1)","v":""},"","","","T506",{"$f":"IF(AD19=\"\",\"\",#REF!)","v":""},"","","","","","","","","","","","","","","","","","","","","",""]
[17,null,{"$f":"'Вахта+Подменные'!B37","v":0},{"$f":"'Вахта+Подменные'!C37","v":"Слесарь по обслуживанию буровых 6 р."},{"$f":"'Вахта+Подменные'!D37","v":0},{"$f":"'Вахта+Подменные'!E37","v":0},{"$f":"'Вахта+Подменные'!F37","v":0},{"$f":"'Вахта+Подменные'!G37","v":0},{"$f":"'Вахта+Подменные'!H37","v":0},{"$f":"'Вахта+Подменные'!I37","v":0},{"$f":"'Вахта+Подменные'!J37","v":0},{"$f":"'Вахта+Подменные'!K37","v":0},{"$f":"'Вахта+Подменные'!L37","v":0},{"$f":"'Вахта+Подменные'!M37","v":0},{"$f":"'Вахта+Подменные'!N37","v":0},{"$f":"'Вахта+Подменные'!O37","v":0},{"$f":"'Вахта+Подменные'!P37","v":0},{"$f":"'Вахта+Подменные'!Q37","v":0},{"$f":"'Вахта+Подменные'!R37","v":0},{"$f":"_xlfn.CONCAT('Журнал Вахта_ИТР'!$C$1)","v":"T506"},null,null,null,"Очередная","Сдал"," ",null,{"$f":"IF(AC20=\"\",\"\",MAX($AB$3:AB19)+1)","v":""},"","","","T506",{"$f":"IF(AD20=\"\",\"\",#REF!)","v":""},"","","","","","","","","","","","","","","","","","","","","",""]
[18,null,{"$f":"'Вахта+Подменные'!B39","v":"Лучше Так"},{"$f":"'Вахта+Подменные'!C39","v":"Электромонтер по обслуживанию буровых 6 р."},{"$f":"'Вахта+Подменные'!D39","v":0},{"$f":"'Вахта+Подменные'!E39","v":0},{"$f":"'Вахта+Подменные'!F39","v":0},{"$f":"'Вахта+Подменные'!G39","v":"3775"},{"$f":"'Вахта+Подменные'!H39","v":"3775"},{"$f":"'Вахта+Подменные'!I39","v":0},{"$f":"'Вахта+Подменные'!J39","v":0},{"$f":"'Вахта+Подменные'!K39","v":0},{"$f":"'Вахта+Подменные'!L39","v":"42-4464"},{"$f":"'Вахта+Подменные'!M39","v":0},{"$f":"'Вахта+Подменные'!N39","v":0},{"$f":"'Вахта+Подменные'!O39","v":0},{"$f":"'Вахта+Подменные'!P39","v":0},{"$f":"'Вахта+Подменные'!Q39","v":0},{"$f":"'Вахта+Подменные'!R39","v":0},{"$f":"_xlfn.CONCAT('Журнал Вахта_ИТР'!$C$1)","v":"T506"},null,null,null,"Очередная","Сдал",null,null,{"$f":"IF(AC21=\"\",\"\",MAX($AB$3:AB20)+1)","v":""},"","","","T506",{"$f":"IF(AD21=\"\",\"\",#REF!)","v":""},"","","","","","","","","","","","","","","","","","","","","",""]
[19,null,{"$f":"'Вахта+Подменные'!B41","v":0},{"$f":"'Вахта+Подменные'!C41","v":"Водитель автопогрузчика"},{"$f":"'Вахта+Подменные'!D41","v":0},{"$f":"'Вахта+Подменные'!E41","v":0},{"$f":"'Вахта+Подменные'!F41","v":0},{"$f":"'Вахта+Подменные'!G41","v":0},{"$f":"'Вахта+Подменные'!H41","v":0},{"$f":"'Вахта+Подменные'!I41","v":0},{"$f":"'Вахта+Подменные'!J41","v":0},{"$f":"'Вахта+Подменные'!K41","v":0},{"$f":"'Вахта+Подменные'!L41","v":0},{"$f":"'Вахта+Подменные'!M41","v":0},{"$f":"'Вахта+Подменные'!N41","v":0},{"$f":"'Вахта+Подменные'!O41","v":0},{"$f":"'Вахта+Подменные'!P41","v":0},{"$f":"'Вахта+Подменные'!Q41","v":0},{"$f":"'Вахта+Подменные'!R41","v":0},{"$f":"_xlfn.CONCAT('Журнал Вахта_ИТР'!$C$1)","v":"T506"},null,null,null,"Очередная","Сдал"," ",null,{"$f":"IF(AC22=\"\",\"\",MAX($AB$3:AB21)+1)","v":""},"","","","T506",{"$f":"IF(AD22=\"\",\"\",#REF!)","v":""},"","","","","","","","","","","","","","","","","","","","","",""]
[20,null,{"$f":"'Вахта+Подменные'!B43","v":0},{"$f":"'Вахта+Подменные'!C43","v":"Водитель автопогрузчика"},{"$f":"'Вахта+Подменные'!D43","v":0},{"$f":"'Вахта+Подменные'!E43","v":0},{"$f":"'Вахта+Подменные'!F43","v":0},{"$f":"'Вахта+Подменные'!G43","v":0},{"$f":"'Вахта+Подменные'!H43","v":0},{"$f":"'Вахта+Подменные'!I43","v":0},{"$f":"'Вахта+Подменные'!J43","v":0},{"$f":"'Вахта+Подменные'!K43","v":0},{"$f":"'Вахта+Подменные'!L43","v":0},{"$f":"'Вахта+Подменные'!M43","v":0},{"$f":"'Вахта+Подменные'!N43","v":0},{"$f":"'Вахта+Подменные'!O43","v":0},{"$f":"'Вахта+Подменные'!P43","v":0},{"$f":"'Вахта+Подменные'!Q43","v":0},{"$f":"'Вахта+Подменные'!R43","v":0},{"$f":"_xlfn.CONCAT('Журнал Вахта_ИТР'!$C$1)","v":"T506"},null,null,null,"Очередная","Сдал"," ",null,{"$f":"IF(AC23=\"\",\"\",MAX($AB$3:AB22)+1)","v":""},"","","","T506",{"$f":"IF(AD23=\"\",\"\",#REF!)","v":""},"","","","","","","","","","","","","","","","","","","","","",""]
[21,null,{"$f":"'Вахта+Подменные'!B46","v":0},{"$f":"'Вахта+Подменные'!C46","v":"Бурильщик ЭиРБС на нефть и газ 8 р"},{"$f":"'Вахта+Подменные'!D46","v":0},{"$f":"'Вахта+Подменные'!E46","v":0},{"$f":"'Вахта+Подменные'!F46","v":0},{"$f":"'Вахта+Подменные'!G46","v":0},{"$f":"'Вахта+Подменные'!H46","v":0},{"$f":"'Вахта+Подменные'!I46","v":0},{"$f":"'Вахта+Подменные'!J46","v":0},{"$f":"'Вахта+Подменные'!K46","v":0},{"$f":"'Вахта+Подменные'!L46","v":0},{"$f":"'Вахта+Подменные'!M46","v":0},{"$f":"'Вахта+Подменные'!N46","v":0},{"$f":"'Вахта+Подменные'!O46","v":0},{"$f":"'Вахта+Подменные'!P46","v":0},{"$f":"'Вахта+Подменные'!Q46","v":0},{"$f":"'Вахта+Подменные'!R46","v":0},{"$f":"_xlfn.CONCAT('Журнал Вахта_ИТР'!$C$1)","v":"T506"},null,null,null,"Очередная","Сдал"," ",null,{"$f":"IF(AC24=\"\",\"\",MAX($AB$3:AB23)+1)","v":""},"","","","T506",{"$f":"IF(AD24=\"\",\"\",#REF!)","v":""},"","","","","","","","","","","","","","","","","","","","","",""]
[22,null,{"$f":"'Вахта+Подменные'!B48","v":0},{"$f":"'Вахта+Подменные'!C48","v":"Бурильщик ЭиРБС на нефть и газ 8 р"},{"$f":"'Вахта+Подменные'!D48","v":0},{"$f":"'Вахта+Подменные'!E48","v":0},{"$f":"'Вахта+Подменные'!F48","v":0},{"$f":"'Вахта+Подменные'!G48","v":0},{"$f":"'Вахта+Подменные'!H48","v":0},{"$f":"'Вахта+Подменные'!I48","v":0},{"$f":"'Вахта+Подменные'!J48","v":0},{"$f":"'Вахта+Подменные'!K48","v":0},{"$f":"'Вахта+Подменные'!L48","v":0},{"$f":"'Вахта+Подменные'!M48","v":0},{"$f":"'Вахта+Подменные'!N48","v":0},{"$f":"'Вахта+Подменные'!O48","v":0},{"$f":"'Вахта+Подменные'!P48","v":0},{"$f":"'Вахта+Подменные'!Q48","v":0},{"$f":"'Вахта+Подменные'!R48","v":0},{"$f":"_xlfn.CONCAT('Журнал Вахта_ИТР'!$C$1)","v":"T506"},null,null,null,"Очередная","Сдал"," ",null,{"$f":"IF(AC25=\"\",\"\",MAX($AB$3:AB24)+1)","v":""},"","","","T506",{"$f":"IF(AD25=\"\",\"\",#REF!)","v":""},"","","","","","","","","","","","","","","","","","","","","",""]
[23,"2022-08-29",{"$f":"'Вахта+Подменные'!B50","v":"Коношанов Торган"},{"$f":"'Вахта+Подменные'!C50","v":"Помощник бурильщика ЭиРБС (второй) 6 р."},{"$f":"'Вахта+Подменные'!D50","v":"29100"},{"$f":"'Вахта+Подменные'!E50","v":"29100"},{"$f":"'Вахта+Подменные'!F50","v":"042/Т320"},{"$f":"'Вахта+Подменные'!G50","v":"015/17"},{"$f":"'Вахта+Подменные'!H50","v":"127/2021"},{"$f":"'Вахта+Подменные'!I50","v":"274-2-17"},{"$f":"'Вахта+Подменные'!J50","v":0},{"$f":"'Вахта+Подменные'!K50","v":0},{"$f":"'Вахта+Подменные'!L50","v":"9018"},{"$f":"'Вахта+Подменные'!M50","v":4},{"$f":"'Вахта+Подменные'!N50","v":"157-18-04"},{"$f":"'Вахта+Подменные'!O50","v":5},{"$f":"'Вахта+Подменные'!P50","v":"262-14-13"},{"$f":"'Вахта+Подменные'!Q50","v":0},{"$f":"'Вахта+Подменные'!R50","v":0},{"$f":"_xlfn.CONCAT('Журнал Вахта_ИТР'!$C$1)","v":"T506"},null,null,null,"Очередная","Сдал"," ",null,{"$f":"IF(AC26=\"\",\"\",MAX($AB$3:AB25)+1)","v":3},"Коношанов Торган","2022-08-29","29100","T506",{"$f":"IF(AD26=\"\",\"\",#REF!)","v":{"$error":"#REF!"}},0,0,0,"Очередная","Сдал","Помощник бурильщика ЭиРБС (второй) 6 р.","Очередная","Сдал","29100","042/Т320","015/17","127/2021","274-2-17",0,0,"9018",4,"157-18-04",5,"262-14-13",0,0]
[24,null,{"$f":"'Вахта+Подменные'!B52","v":0},{"$f":"'Вахта+Подменные'!C52","v":"Помощник бурильщика ЭиРБС (первый) 6 р."},{"$f":"'Вахта+Подменные'!D52","v":0},{"$f":"'Вахта+Подменные'!E52","v":0},{"$f":"'Вахта+Подменные'!F52","v":0},{"$f":"'Вахта+Подменные'!G52","v":0},{"$f":"'Вахта+Подменные'!H52","v":0},{"$f":"'Вахта+Подменные'!I52","v":0},{"$f":"'Вахта+Подменные'!J52","v":0},{"$f":"'Вахта+Подменные'!K52","v":0},{"$f":"'Вахта+Подменные'!L52","v":0},{"$f":"'Вахта+Подменные'!M52","v":0},{"$f":"'Вахта+Подменные'!N52","v":0},{"$f":"'Вахта+Подменные'!O52","v":0},{"$f":"'Вахта+Подменные'!P52","v":0},{"$f":"'Вахта+Подменные'!Q52","v":0},{"$f":"'Вахта+Подменные'!R52","v":0},{"$f":"_xlfn.CONCAT('Журнал Вахта_ИТР'!$C$1)","v":"T506"},null,null,null,"Очередная","Сдал"," ",null,{"$f":"IF(AC27=\"\",\"\",MAX($AB$3:AB26)+1)","v":""},"","","","T506",{"$f":"IF(AD27=\"\",\"\",#REF!)","v":""},"","","","","","","","","","","","","","","","","","","","","",""]
[25,null,{"$f":"'Вахта+Подменные'!B54","v":0},{"$f":"'Вахта+Подменные'!C54","v":"Помощник бурильщика ЭиРБС (первый) 6 р."},{"$f":"'Вахта+Подменные'!D54","v":0},{"$f":"'Вахта+Подменные'!E54","v":0},{"$f":"'Вахта+Подменные'!F54","v":0},{"$f":"'Вахта+Подменные'!G54","v":0},{"$f":"'Вахта+Подменные'!H54","v":0},{"$f":"'Вахта+Подменные'!I54","v":0},{"$f":"'Вахта+Подменные'!J54","v":0},{"$f":"'Вахта+Подменные'!K54","v":0},{"$f":"'Вахта+Подменные'!L54","v":0},{"$f":"'Вахта+Подменные'!M54","v":0},{"$f":"'Вахта+Подменные'!N54","v":0},{"$f":"'Вахта+Подменные'!O54","v":0},{"$f":"'Вахта+Подменные'!P54","v":0},{"$f":"'Вахта+Подменные'!Q54","v":0},{"$f":"'Вахта+Подменные'!R54","v":0},{"$f":"_xlfn.CONCAT('Журнал Вахта_ИТР'!$C$1)","v":"T506"},null,null,null,"Очередная","Сдал"," ",null,{"$f":"IF(AC28=\"\",\"\",MAX($AB$3:AB27)+1)","v":""},"","","","T506",{"$f":"IF(AD28=\"\",\"\",#REF!)","v":""},"","","","","","","","","","","","","","","","","","","","","",""]
[26,null,{"$f":"'Вахта+Подменные'!B56","v":0},{"$f":"'Вахта+Подменные'!C56","v":"Помощник бурильщика ЭиРБС (первый) 6 р."},{"$f":"'Вахта+Подменные'!D56","v":0},{"$f":"'Вахта+Подменные'!E56","v":0},{"$f":"'Вахта+Подменные'!F56","v":0},{"$f":"'Вахта+Подменные'!G56","v":0},{"$f":"'Вахта+Подменные'!H56","v":0},{"$f":"'Вахта+Подменные'!I56","v":0},{"$f":"'Вахта+Подменные'!J56","v":0},{"$f":"'Вахта+Подменные'!K56","v":0},{"$f":"'Вахта+Подменные'!L56","v":0},{"$f":"'Вахта+Подменные'!M56","v":0},{"$f":"'Вахта+Подменные'!N56","v":0},{"$f":"'Вахта+Подменные'!O56","v":0},{"$f":"'Вахта+Подменные'!P56","v":0},{"$f":"'Вахта+Подменные'!Q56","v":0},{"$f":"'Вахта+Подменные'!R56","v":0},{"$f":"_xlfn.CONCAT('Журнал Вахта_ИТР'!$C$1)","v":"T506"},null,null,null,"Очередная","Сдал"," ",null,{"$f":"IF(AC29=\"\",\"\",MAX($AB$3:AB28)+1)","v":""},"","","","T506",{"$f":"IF(AD29=\"\",\"\",#REF!)","v":""},"","","","","","","","","","","","","","","","","","","","","",""]
[27,null,{"$f":"'Вахта+Подменные'!B58","v":0},{"$f":"'Вахта+Подменные'!C58","v":"Слесарь по обслуживанию буровых 6 р."},{"$f":"'Вахта+Подменные'!D58","v":0},{"$f":"'Вахта+Подменные'!E58","v":0},{"$f":"'Вахта+Подменные'!F58","v":0},{"$f":"'Вахта+Подменные'!G58","v":0},{"$f":"'Вахта+Подменные'!H58","v":0},{"$f":"'Вахта+Подменные'!I58","v":0},{"$f":"'Вахта+Подменные'!J58","v":0},{"$f":"'Вахта+Подменные'!K58","v":0},{"$f":"'Вахта+Подменные'!L58","v":0},{"$f":"'Вахта+Подменные'!M58","v":0},{"$f":"'Вахта+Подменные'!N58","v":0},{"$f":"'Вахта+Подменные'!O58","v":0},{"$f":"'Вахта+Подменные'!P58","v":0},{"$f":"'Вахта+Подменные'!Q58","v":0},{"$f":"'Вахта+Подменные'!R58","v":0},{"$f":"_xlfn.CONCAT('Журнал Вахта_ИТР'!$C$1)","v":"T506"},null,null,null,"Очередная","Сдал"," ",null,{"$f":"IF(AC30=\"\",\"\",MAX($AB$3:AB29)+1)","v":""},"","","","T506",{"$f":"IF(AD30=\"\",\"\",#REF!)","v":""},"","","","","","","","","","","","","","","","","","","","","",""]
[28,null,{"$f":"'Вахта+Подменные'!B60","v":0},{"$f":"'Вахта+Подменные'!C60","v":"Электромонтер по обслуживанию буровых 6 р."},{"$f":"'Вахта+Подменные'!D60","v":0},{"$f":"'Вахта+Подменные'!E60","v":0},{"$f":"'Вахта+Подменные'!F60","v":0},{"$f":"'Вахта+Подменные'!G60","v":0},{"$f":"'Вахта+Подменные'!H60","v":0},{"$f":"'Вахта+Подменные'!I60","v":0},{"$f":"'Вахта+Подменные'!J60","v":0},{"$f":"'Вахта+Подменные'!K60","v":0},{"$f":"'Вахта+Подменные'!L60","v":0},{"$f":"'Вахта+Подменные'!M60","v":0},{"$f":"'Вахта+Подменные'!N60","v":0},{"$f":"'Вахта+Подменные'!O60","v":0},{"$f":"'Вахта+Подменные'!P60","v":0},{"$f":"'Вахта+Подменные'!Q60","v":0},{"$f":"'Вахта+Подменные'!R60","v":0},{"$f":"_xlfn.CONCAT('Журнал Вахта_ИТР'!$C$1)","v":"T506"},null,null,null,"Очередная","Сдал",null,null,{"$f":"IF(AC31=\"\",\"\",MAX($AB$3:AB30)+1)","v":""},"","","","T506",{"$f":"IF(AD31=\"\",\"\",#REF!)","v":""},"","","","","","","","","","","","","","","","","","","","","",""]
[29,null,{"$f":"'Вахта+Подменные'!B62","v":0},{"$f":"'Вахта+Подменные'!C62","v":"Водитель автопогрузчика"},{"$f":"'Вахта+Подменные'!D62","v":0},{"$f":"'Вахта+Подменные'!E62","v":0},{"$f":"'Вахта+Подменные'!F62","v":0},{"$f":"'Вахта+Подменные'!G62","v":0},{"$f":"'Вахта+Подменные'!H62","v":0},{"$f":"'Вахта+Подменные'!I62","v":0},{"$f":"'Вахта+Подменные'!J62","v":0},{"$f":"'Вахта+Подменные'!K62","v":0},{"$f":"'Вахта+Подменные'!L62","v":0},{"$f":"'Вахта+Подменные'!M62","v":0},{"$f":"'Вахта+Подменные'!N62","v":0},{"$f":"'Вахта+Подменные'!O62","v":0},{"$f":"'Вахта+Подменные'!P62","v":0},{"$f":"'Вахта+Подменные'!Q62","v":0},{"$f":"'Вахта+Подменные'!R62","v":0},{"$f":"_xlfn.CONCAT('Журнал Вахта_ИТР'!$C$1)","v":"T506"},null,null,null,"Очередная","Сдал"," ",null,{"$f":"IF(AC32=\"\",\"\",MAX($AB$3:AB31)+1)","v":""},"","","","T506",{"$f":"IF(AD32=\"\",\"\",#REF!)","v":""},"","","","","","","","","","","","","","","","","","","","","",""]
[30,null,{"$f":"'Вахта+Подменные'!B64","v":0},{"$f":"'Вахта+Подменные'!C64","v":"Водитель автопогрузчика"},{"$f":"'Вахта+Подменные'!D64","v":0},{"$f":"'Вахта+Подменные'!E64","v":0},{"$f":"'Вахта+Подменные'!F64","v":0},{"$f":"'Вахта+Подменные'!G64","v":0},{"$f":"'Вахта+Подменные'!H64","v":0},{"$f":"'Вахта+Подменные'!I64","v":0},{"$f":"'Вахта+Подменные'!J64","v":0},{"$f":"'Вахта+Подменные'!K64","v":0},{"$f":"'Вахта+Подменные'!L64","v":0},{"$f":"'Вахта+Подменные'!M64","v":0},{"$f":"'Вахта+Подменные'!N64","v":0},{"$f":"'Вахта+Подменные'!O64","v":0},{"$f":"'Вахта+Подменные'!P64","v":0},{"$f":"'Вахта+Подменные'!Q64","v":0},{"$f":"'Вахта+Подменные'!R64","v":0},{"$f":"_xlfn.CONCAT('Журнал Вахта_ИТР'!$C$1)","v":"T506"},null,null,null,"Очередная","Сдал"," ",null,{"$f":"IF(AC33=\"\",\"\",MAX($AB$3:AB32)+1)","v":""},"","","","T506",{"$f":"IF(AD33=\"\",\"\",#REF!)","v":""},"","","","","","","","","","","","","","","","","","","","","",""]
[31,null,{"$f":"'Вахта+Подменные'!B67","v":0},{"$f":"'Вахта+Подменные'!C67","v":"Бурильщик ЭиРБС на нефть и газ 8 р"},{"$f":"'Вахта+Подменные'!D67","v":0},{"$f":"'Вахта+Подменные'!E67","v":0},{"$f":"'Вахта+Подменные'!F67","v":0},{"$f":"'Вахта+Подменные'!G67","v":0},{"$f":"'Вахта+Подменные'!H67","v":0},{"$f":"'Вахта+Подменные'!I67","v":0},{"$f":"'Вахта+Подменные'!J67","v":0},{"$f":"'Вахта+Подменные'!K67","v":0},{"$f":"'Вахта+Подменные'!L67","v":0},{"$f":"'Вахта+Подменные'!M67","v":0},{"$f":"'Вахта+Подменные'!N67","v":0},{"$f":"'Вахта+Подменные'!O67","v":0},{"$f":"'Вахта+Подменные'!P67","v":0},{"$f":"'Вахта+Подменные'!Q67","v":0},{"$f":"'Вахта+Подменные'!R67","v":0},{"$f":"_xlfn.CONCAT('Журнал Вахта_ИТР'!$C$1)","v":"T506"},null,null,null,"Очередная","Сдал"," ",null,{"$f":"IF(AC34=\"\",\"\",MAX($AB$3:AB33)+1)","v":""},"","","","T506",{"$f":"IF(AD34=\"\",\"\",#REF!)","v":""},"","","","","","","","","","","","","","","","","","","","","",""]
[32,null,{"$f":"'Вахта+Подменные'!B69","v":0},{"$f":"'Вахта+Подменные'!C69","v":"Бурильщик ЭиРБС на нефть и газ 8 р"},{"$f":"'Вахта+Подменные'!D69","v":0},{"$f":"'Вахта+Подменные'!E69","v":0},{"$f":"'Вахта+Подменные'!F69","v":0},{"$f":"'Вахта+Подменные'!G69","v":0},{"$f":"'Вахта+Подменные'!H69","v":0},{"$f":"'Вахта+Подменные'!I69","v":0},{"$f":"'Вахта+Подменные'!J69","v":0},{"$f":"'Вахта+Подменные'!K69","v":0},{"$f":"'Вахта+Подменные'!L69","v":0},{"$f":"'Вахта+Подменные'!M69","v":0},{"$f":"'Вахта+Подменные'!N69","v":0},{"$f":"'Вахта+Подменные'!O69","v":0},{"$f":"'Вахта+Подменные'!P69","v":0},{"$f":"'Вахта+Подменные'!Q69","v":0},{"$f":"'Вахта+Подменные'!R69","v":0},{"$f":"_xlfn.CONCAT('Журнал Вахта_ИТР'!$C$1)","v":"T506"},null,null,null,"Очередная","Сдал"," ",null,{"$f":"IF(AC35=\"\",\"\",MAX($AB$3:AB34)+1)","v":""},"","","","T506",{"$f":"IF(AD35=\"\",\"\",#REF!)","v":""},"","","","","","","","","","","","","","","","","","","","","",""]
[33,null,{"$f":"'Вахта+Подменные'!B71","v":0},{"$f":"'Вахта+Подменные'!C71","v":"Помощник бурильщика ЭиРБС (второй) 6 р."},{"$f":"'Вахта+Подменные'!D71","v":0},{"$f":"'Вахта+Подменные'!E71","v":0},{"$f":"'Вахта+Подменные'!F71","v":0},{"$f":"'Вахта+Подменные'!G71","v":0},{"$f":"'Вахта+Подменные'!H71","v":0},{"$f":"'Вахта+Подменные'!I71","v":0},{"$f":"'Вахта+Подменные'!J71","v":0},{"$f":"'Вахта+Подменные'!K71","v":0},{"$f":"'Вахта+Подменные'!L71","v":0},{"$f":"'Вахта+Подменные'!M71","v":0},{"$f":"'Вахта+Подменные'!N71","v":0},{"$f":"'Вахта+Подменные'!O71","v":0},{"$f":"'Вахта+Подменные'!P71","v":0},{"$f":"'Вахта+Подменные'!Q71","v":0},{"$f":"'Вахта+Подменные'!R71","v":0},{"$f":"_xlfn.CONCAT('Журнал Вахта_ИТР'!$C$1)","v":"T506"},null,null,null,"Очередная","Сдал"," ",null,{"$f":"IF(AC36=\"\",\"\",MAX($AB$3:AB35)+1)","v":""},"","","","T506",{"$f":"IF(AD36=\"\",\"\",#REF!)","v":""},"","","","","","","","","","","","","","","","","","","","","",""]
[34,null,{"$f":"'Вахта+Подменные'!B73","v":0},{"$f":"'Вахта+Подменные'!C73","v":"Помощник бурильщика ЭиРБС (первый) 6 р."},{"$f":"'Вахта+Подменные'!D73","v":0},{"$f":"'Вахта+Подменные'!E73","v":0},{"$f":"'Вахта+Подменные'!F73","v":0},{"$f":"'Вахта+Подменные'!G73","v":0},{"$f":"'Вахта+Подменные'!H73","v":0},{"$f":"'Вахта+Подменные'!I73","v":0},{"$f":"'Вахта+Подменные'!J73","v":0},{"$f":"'Вахта+Подменные'!K73","v":0},{"$f":"'Вахта+Подменные'!L73","v":0},{"$f":"'Вахта+Подменные'!M73","v":0},{"$f":"'Вахта+Подменные'!N73","v":0},{"$f":"'Вахта+Подменные'!O73","v":0},{"$f":"'Вахта+Подменные'!P73","v":0},{"$f":"'Вахта+Подменные'!Q73","v":0},{"$f":"'Вахта+Подменные'!R73","v":0},{"$f":"_xlfn.CONCAT('Журнал Вахта_ИТР'!$C$1)","v":"T506"},null,null,null,"Очередная","Сдал"," ",null,{"$f":"IF(AC37=\"\",\"\",MAX($AB$3:AB36)+1)","v":""},"","","","T506",{"$f":"IF(AD37=\"\",\"\",#REF!)","v":""},"","","","","","","","","","","","","","","","","","","","","",""]
[35,null,{"$f":"'Вахта+Подменные'!B75","v":0},{"$f":"'Вахта+Подменные'!C75","v":"Помощник бурильщика ЭиРБС (первый) 6 р."},{"$f":"'Вахта+Подменные'!D75","v":0},{"$f":"'Вахта+Подменные'!E75","v":0},{"$f":"'Вахта+Подменные'!F75","v":0},{"$f":"'Вахта+Подменные'!G75","v":0},{"$f":"'Вахта+Подменные'!H75","v":0},{"$f":"'Вахта+Подменные'!I75","v":0},{"$f":"'Вахта+Подменные'!J75","v":0},{"$f":"'Вахта+Подменные'!K75","v":0},{"$f":"'Вахта+Подменные'!L75","v":0},{"$f":"'Вахта+Подменные'!M75","v":0},{"$f":"'Вахта+Подменные'!N75","v":0},{"$f":"'Вахта+Подменные'!O75","v":0},{"$f":"'Вахта+Подменные'!P75","v":0},{"$f":"'Вахта+Подменные'!Q75","v":0},{"$f":"'Вахта+Подменные'!R75","v":0},{"$f":"_xlfn.CONCAT('Журнал Вахта_ИТР'!$C$1)","v":"T506"},null,null,null,"Очередная","Сдал"," ",null,{"$f":"IF(AC38=\"\",\"\",MAX($AB$3:AB37)+1)","v":""},"","","","T506",{"$f":"IF(AD38=\"\",\"\",#REF!)","v":""},"","","","","","","","","","","","","","","","","","","","","",""]
[36,null,{"$f":"'Вахта+Подменные'!B77","v":0},{"$f":"'Вахта+Подменные'!C77","v":"Помощник бурильщика ЭиРБС (первый) 6 р."},{"$f":"'Вахта+Подменные'!D77","v":0},{"$f":"'Вахта+Подменные'!E77","v":0},{"$f":"'Вахта+Подменные'!F77","v":0},{"$f":"'Вахта+Подменные'!G77","v":0},{"$f":"'Вахта+Подменные'!H77","v":0},{"$f":"'Вахта+Подменные'!I77","v":0},{"$f":"'Вахта+Подменные'!J77","v":0},{"$f":"'Вахта+Подменные'!K77","v":0},{"$f":"'Вахта+Подменные'!L77","v":0},{"$f":"'Вахта+Подменные'!M77","v":0},{"$f":"'Вахта+Подменные'!N77","v":0},{"$f":"'Вахта+Подменные'!O77","v":0},{"$f":"'Вахта+Подменные'!P77","v":0},{"$f":"'Вахта+Подменные'!Q77","v":0},{"$f":"'Вахта+Подменные'!R77","v":0},{"$f":"_xlfn.CONCAT('Журнал Вахта_ИТР'!$C$1)","v":"T506"},null,null,null,"Очередная","Сдал"," ",null,{"$f":"IF(AC39=\"\",\"\",MAX($AB$3:AB38)+1)","v":""},"","","","T506",{"$f":"IF(AD39=\"\",\"\",#REF!)","v":""},"","","","","","","","","","","","","","","","","","","","","",""]
[37,null,{"$f":"'Вахта+Подменные'!B79","v":0},{"$f":"'Вахта+Подменные'!C79","v":"Слесарь по обслуживанию буровых 6 р."},{"$f":"'Вахта+Подменные'!D79","v":0},{"$f":"'Вахта+Подменные'!E79","v":0},{"$f":"'Вахта+Подменные'!F79","v":0},{"$f":"'Вахта+Подменные'!G79","v":0},{"$f":"'Вахта+Подменные'!H79","v":0},{"$f":"'Вахта+Подменные'!I79","v":0},{"$f":"'Вахта+Подменные'!J79","v":0},{"$f":"'Вахта+Подменные'!K79","v":0},{"$f":"'Вахта+Подменные'!L79","v":0},{"$f":"'Вахта+Подменные'!M79","v":0},{"$f":"'Вахта+Подменные'!N79","v":0},{"$f":"'Вахта+Подменные'!O79","v":0},{"$f":"'Вахта+Подменные'!P79","v":0},{"$f":"'Вахта+Подменные'!Q79","v":0},{"$f":"'Вахта+Подменные'!R79","v":0},{"$f":"_xlfn.CONCAT('Журнал Вахта_ИТР'!$C$1)","v":"T506"},null,null,null,"Очередная","Сдал"," ",null,{"$f":"IF(AC40=\"\",\"\",MAX($AB$3:AB39)+1)","v":""},"","","","T506",{"$f":"IF(AD40=\"\",\"\",#REF!)","v":""},"","","","","","","","","","","","","","","","","","","","","",""]
[38,null,{"$f":"'Вахта+Подменные'!B81","v":0},{"$f":"'Вахта+Подменные'!C81","v":"Электромонтер по обслуживанию буровых 6 р."},{"$f":"'Вахта+Подменные'!D81","v":0},{"$f":"'Вахта+Подменные'!E81","v":0},{"$f":"'Вахта+Подменные'!F81","v":0},{"$f":"'Вахта+Подменные'!G81","v":0},{"$f":"'Вахта+Подменные'!H81","v":0},{"$f":"'Вахта+Подменные'!I81","v":0},{"$f":"'Вахта+Подменные'!J81","v":0},{"$f":"'Вахта+Подменные'!K81","v":0},{"$f":"'Вахта+Подменные'!L81","v":0},{"$f":"'Вахта+Подменные'!M81","v":0},{"$f":"'Вахта+Подменные'!N81","v":0},{"$f":"'Вахта+Подменные'!O81","v":0},{"$f":"'Вахта+Подменные'!P81","v":0},{"$f":"'Вахта+Подменные'!Q81","v":0},{"$f":"'Вахта+Подменные'!R81","v":0},{"$f":"_xlfn.CONCAT('Журнал Вахта_ИТР'!$C$1)","v":"T506"},null,null,null,"Очередная","Сдал",null,null,{"$f":"IF(AC41=\"\",\"\",MAX($AB$3:AB40)+1)","v":""},"","","","T506",{"$f":"IF(AD41=\"\",\"\",#REF!)","v":""},"","","","","","","","","","","","","","","","","","","","","",""]
[39,null,{"$f":"'Вахта+Подменные'!B83","v":0},{"$f":"'Вахта+Подменные'!C83","v":"Водитель автопогрузчика"},{"$f":"'Вахта+Подменные'!D83","v":0},{"$f":"'Вахта+Подменные'!E83","v":0},{"$f":"'Вахта+Подменные'!F83","v":0},{"$f":"'Вахта+Подменные'!G83","v":0},{"$f":"'Вахта+Подменные'!H83","v":0},{"$f":"'Вахта+Подменные'!I83","v":0},{"$f":"'Вахта+Подменные'!J83","v":0},{"$f":"'Вахта+Подменные'!K83","v":0},{"$f":"'Вахта+Подменные'!L83","v":0},{"$f":"'Вахта+Подменные'!M83","v":0},{"$f":"'Вахта+Подменные'!N83","v":0},{"$f":"'Вахта+Подменные'!O83","v":0},{"$f":"'Вахта+Подменные'!P83","v":0},{"$f":"'Вахта+Подменные'!Q83","v":0},{"$f":"'Вахта+Подменные'!R83","v":0},{"$f":"_xlfn.CONCAT('Журнал Вахта_ИТР'!$C$1)","v":"T506"},null,null,null,"Очередная","Сдал"," ",null,{"$f":"IF(AC42=\"\",\"\",MAX($AB$3:AB41)+1)","v":""},"","","","T506",{"$f":"IF(AD42=\"\",\"\",#REF!)","v":""},"","","","","","","","","","","","","","","","","","","","","",""]
[40,null,{"$f":"'Вахта+Подменные'!B85","v":0},{"$f":"'Вахта+Подменные'!C85","v":"Водитель автопогрузчика"},{"$f":"'Вахта+Подменные'!D85","v":0},{"$f":"'Вахта+Подменные'!E85","v":0},{"$f":"'Вахта+Подменные'!F85","v":0},{"$f":"'Вахта+Подменные'!G85","v":0},{"$f":"'Вахта+Подменные'!H85","v":0},{"$f":"'Вахта+Подменные'!I85","v":0},{"$f":"'Вахта+Подменные'!J85","v":0},{"$f":"'Вахта+Подменные'!K85","v":0},{"$f":"'Вахта+Подменные'!L85","v":0},{"$f":"'Вахта+Подменные'!M85","v":0},{"$f":"'Вахта+Подменные'!N85","v":0},{"$f":"'Вахта+Подменные'!O85","v":0},{"$f":"'Вахта+Подменные'!P85","v":0},{"$f":"'Вахта+Подменные'!Q85","v":0},{"$f":"'Вахта+Подменные'!R85","v":0},{"$f":"_xlfn.CONCAT('Журнал Вахта_ИТР'!$C$1)","v":"T506"},null,null,null,"Очередная","Сдал"," ",null,{"$f":"IF(AC43=\"\",\"\",MAX($AB$3:AB42)+1)","v":""},"","","","T506",{"$f":"IF(AD43=\"\",\"\",#REF!)","v":""},"","","","","","","","","","","","","","","","","","","","","",""]
[41,null,{"$f":"'Вахта+Подменные'!B88","v":0},{"$f":"'Вахта+Подменные'!C88","v":"Машинист крана автомобильного"},{"$f":"'Вахта+Подменные'!D88","v":0},{"$f":"'Вахта+Подменные'!E88","v":0},{"$f":"'Вахта+Подменные'!F88","v":0},{"$f":"'Вахта+Подменные'!G88","v":0},{"$f":"'Вахта+Подменные'!H88","v":0},{"$f":"'Вахта+Подменные'!I88","v":0},{"$f":"'Вахта+Подменные'!J88","v":0},{"$f":"'Вахта+Подменные'!K88","v":0},{"$f":"'Вахта+Подменные'!L88","v":0},{"$f":"'Вахта+Подменные'!M88","v":0},{"$f":"'Вахта+Подменные'!N88","v":0},{"$f":"'Вахта+Подменные'!O88","v":0},{"$f":"'Вахта+Подменные'!P88","v":0},{"$f":"'Вахта+Подменные'!Q88","v":0},{"$f":"'Вахта+Подменные'!R88","v":0},{"$f":"_xlfn.CONCAT('Журнал Вахта_ИТР'!$C$1)","v":"T506"},null,null,null,"Очередная","Сдал"," ",null,{"$f":"IF(AC44=\"\",\"\",MAX($AB$3:AB43)+1)","v":""},"","","","T506",{"$f":"IF(AD44=\"\",\"\",#REF!)","v":""},"","","","","","","","","","","","","","","","","","","","","",""]
[42,null,{"$f":"'Вахта+Подменные'!B90","v":0},{"$f":"'Вахта+Подменные'!C90","v":"Машинист крана автомобильного"},{"$f":"'Вахта+Подменные'!D90","v":0},{"$f":"'Вахта+Подменные'!E90","v":0},{"$f":"'Вахта+Подменные'!F90","v":0},{"$f":"'Вахта+Подменные'!G90","v":0},{"$f":"'Вахта+Подменные'!H90","v":0},{"$f":"'Вахта+Подменные'!I90","v":0},{"$f":"'Вахта+Подменные'!J90","v":0},{"$f":"'Вахта+Подменные'!K90","v":0},{"$f":"'Вахта+Подменные'!L90","v":0},{"$f":"'Вахта+Подменные'!M90","v":0},{"$f":"'Вахта+Подменные'!N90","v":0},{"$f":"'Вахта+Подменные'!O90","v":0},{"$f":"'Вахта+Подменные'!P90","v":0},{"$f":"'Вахта+Подменные'!Q90","v":0},{"$f":"'Вахта+Подменные'!R90","v":0},{"$f":"_xlfn.CONCAT('Журнал Вахта_ИТР'!$C$1)","v":"T506"},null,null,null,"Очередная","Сдал"," ",null,{"$f":"IF(AC45=\"\",\"\",MAX($AB$3:AB44)+1)","v":""},"","","","T506",{"$f":"IF(AD45=\"\",\"\",#REF!)","v":""},"","","","","","","","","","","","","","","","","","","","","",""]
[43,null,{"$f":"'Вахта+Подменные'!B92","v":0},{"$f":"'Вахта+Подменные'!C92","v":"Электрогазосварщик 6 р."},{"$f":"'Вахта+Подменные'!D92","v":0},{"$f":"'Вахта+Подменные'!E92","v":0},{"$f":"'Вахта+Подменные'!F92","v":0},{"$f":"'Вахта+Подменные'!G92","v":0},{"$f":"'Вахта+Подменные'!H92","v":0},{"$f":"'Вахта+Подменные'!I92","v":0},{"$f":"'Вахта+Подменные'!J92","v":0},{"$f":"'Вахта+Подменные'!K92","v":0},{"$f":"'Вахта+Подменные'!L92","v":0},{"$f":"'Вахта+Подменные'!M92","v":0},{"$f":"'Вахта+Подменные'!N92","v":0},{"$f":"'Вахта+Подменные'!O92","v":0},{"$f":"'Вахта+Подменные'!P92","v":0},{"$f":"'Вахта+Подменные'!Q92","v":0},{"$f":"'Вахта+Подменные'!R92","v":0},{"$f":"_xlfn.CONCAT('Журнал Вахта_ИТР'!$C$1)","v":"T506"},null,null,null,"Очередная","Сдал"," ",null,{"$f":"IF(AC46=\"\",\"\",MAX($AB$3:AB45)+1)","v":""},"","","","T506",{"$f":"IF(AD46=\"\",\"\",#REF!)","v":""},"","","","","","","","","","","","","","","","","","","","","",""]
[44,null,{"$f":"'Вахта+Подменные'!B94","v":0},{"$f":"'Вахта+Подменные'!C94","v":"Электрогазосварщик 6 р."},{"$f":"'Вахта+Подменные'!D94","v":0},{"$f":"'Вахта+Подменные'!E94","v":0},{"$f":"'Вахта+Подменные'!F94","v":0},{"$f":"'Вахта+Подменные'!G94","v":0},{"$f":"'Вахта+Подменные'!H94","v":0},{"$f":"'Вахта+Подменные'!I94","v":0},{"$f":"'Вахта+Подменные'!J94","v":0},{"$f":"'Вахта+Подменные'!K94","v":0},{"$f":"'Вахта+Подменные'!L94","v":0},{"$f":"'Вахта+Подменные'!M94","v":0},{"$f":"'Вахта+Подменные'!N94","v":0},{"$f":"'Вахта+Подменные'!O94","v":0},{"$f":"'Вахта+Подменные'!P94","v":0},{"$f":"'Вахта+Подменные'!Q94","v":0},{"$f":"'Вахта+Подменные'!R94","v":0},{"$f":"_xlfn.CONCAT('Журнал Вахта_ИТР'!$C$1)","v":"T506"},null,null,null,"Очередная","Сдал"," ",null,{"$f":"IF(AC47=\"\",\"\",MAX($AB$3:AB46)+1)","v":""},"","","","T506",{"$f":"IF(AD47=\"\",\"\",#REF!)","v":""},"","","","","","","","","","","","","","","","","","","","","",""]
[45,null,{"$f":"'Вахта+Подменные'!B96","v":0},{"$f":"'Вахта+Подменные'!C96","v":0},{"$f":"'Вахта+Подменные'!D96","v":0},{"$f":"'Вахта+Подменные'!E96","v":0},{"$f":"'Вахта+Подменные'!F96","v":0},{"$f":"'Вахта+Подменные'!G96","v":0},{"$f":"'Вахта+Подменные'!H96","v":0},{"$f":"'Вахта+Подменные'!I96","v":0},{"$f":"'Вахта+Подменные'!J96","v":0},{"$f":"'Вахта+Подменные'!K96","v":0},{"$f":"'Вахта+Подменные'!L96","v":0},{"$f":"'Вахта+Подменные'!M96","v":0},{"$f":"'Вахта+Подменные'!N96","v":0},{"$f":"'Вахта+Подменные'!O96","v":0},{"$f":"'Вахта+Подменные'!P96","v":0},{"$f":"'Вахта+Подменные'!Q96","v":0},{"$f":"'Вахта+Подменные'!R96","v":0},{"$f":"_xlfn.CONCAT('Журнал Вахта_ИТР'!$C$1)","v":"T506"},null,null,null,"Очередная","Сдал"," ",null,{"$f":"IF(AC48=\"\",\"\",MAX($AB$3:AB47)+1)","v":""},"","","","T506",{"$f":"IF(AD48=\"\",\"\",#REF!)","v":""},"","","","","","","","","","","","","","","","","","","","","",""]
[46,null,{"$f":"'Вахта+Подменные'!B98","v":0},{"$f":"'Вахта+Подменные'!C98","v":0},{"$f":"'Вахта+Подменные'!D98","v":0},{"$f":"'Вахта+Подменные'!E98","v":0},{"$f":"'Вахта+Подменные'!F98","v":0},{"$f":"'Вахта+Подменные'!G98","v":0},{"$f":"'Вахта+Подменные'!H98","v":0},{"$f":"'Вахта+Подменные'!I98","v":0},{"$f":"'Вахта+Подменные'!J98","v":0},{"$f":"'Вахта+Подменные'!K98","v":0},{"$f":"'Вахта+Подменные'!L98","v":0},{"$f":"'Вахта+Подменные'!M98","v":0},{"$f":"'Вахта+Подменные'!N98","v":0},{"$f":"'Вахта+Подменные'!O98","v":0},{"$f":"'Вахта+Подменные'!P98","v":0},{"$f":"'Вахта+Подменные'!Q98","v":0},{"$f":"'Вахта+Подменные'!R98","v":0},{"$f":"_xlfn.CONCAT('Журнал Вахта_ИТР'!$C$1)","v":"T506"},null,null,null,"Очередная","Сдал"," ",null,{"$f":"IF(AC49=\"\",\"\",MAX($AB$3:AB48)+1)","v":""},"","","","T506",{"$f":"IF(AD49=\"\",\"\",#REF!)","v":""},"","","","","","","","","","","","","","","","","","","","","",""]
[47,null,{"$f":"'Вахта+Подменные'!B101","v":"Ну зачем"},{"$f":"'Вахта+Подменные'!C101","v":"Водитель автопогрузчика"},{"$f":"'Вахта+Подменные'!D101","v":0},{"$f":"'Вахта+Подменные'!E101","v":0},{"$f":"'Вахта+Подменные'!F101","v":0},{"$f":"'Вахта+Подменные'!G101","v":0},{"$f":"'Вахта+Подменные'!H101","v":0},{"$f":"'Вахта+Подменные'!I101","v":"631"},{"$f":"'Вахта+Подменные'!J101","v":0},{"$f":"'Вахта+Подменные'!K101","v":"631"},{"$f":"'Вахта+Подменные'!L101","v":0},{"$f":"'Вахта+Подменные'!M101","v":0},{"$f":"'Вахта+Подменные'!N101","v":0},{"$f":"'Вахта+Подменные'!O101","v":0},{"$f":"'Вахта+Подменные'!P101","v":0},{"$f":"'Вахта+Подменные'!Q101","v":0},{"$f":"'Вахта+Подменные'!R101","v":0},{"$f":"_xlfn.CONCAT('Журнал Вахта_ИТР'!$C$1)","v":"T506"},null,null,null,"Очередная","Сдал"," ",null,{"$f":"IF(AC50=\"\",\"\",MAX($AB$3:AB49)+1)","v":""},"","","","T506",{"$f":"IF(AD50=\"\",\"\",#REF!)","v":""},"","","","","","","","","","","","","","","","","","","","","",""]
[48,null,{"$f":"'Вахта+Подменные'!B103","v":"Я не хочу"},{"$f":"'Вахта+Подменные'!C103","v":"Вышкомонтажник 4 р."},{"$f":"'Вахта+Подменные'!D103","v":0},{"$f":"'Вахта+Подменные'!E103","v":0},{"$f":"'Вахта+Подменные'!F103","v":0},{"$f":"'Вахта+Подменные'!G103","v":0},{"$f":"'Вахта+Подменные'!H103","v":"153/9"},{"$f":"'Вахта+Подменные'!I103","v":0},{"$f":"'Вахта+Подменные'!J103","v":0},{"$f":"'Вахта+Подменные'!K103","v":0},{"$f":"'Вахта+Подменные'!L103","v":0},{"$f":"'Вахта+Подменные'!M103","v":0},{"$f":"'Вахта+Подменные'!N103","v":0},{"$f":"'Вахта+Подменные'!O103","v":0},{"$f":"'Вахта+Подменные'!P103","v":0},{"$f":"'Вахта+Подменные'!Q103","v":0},{"$f":"'Вахта+Подменные'!R103","v":0},{"$f":"_xlfn.CONCAT('Журнал Вахта_ИТР'!$C$1)","v":"T506"},null,null,null,"Очередная","Сдал"," ",null,{"$f":"IF(AC51=\"\",\"\",MAX($AB$3:AB50)+1)","v":""},"","","","T506",{"$f":"IF(AD51=\"\",\"\",#REF!)","v":""},"","","","","","","","","","","","","","","","","","","","","",""]
[49,null,{"$f":"'Вахта+Подменные'!B105","v":"Мужик в очках"},{"$f":"'Вахта+Подменные'!C105","v":"Вышкомонтажник- сварщик 6 р."},{"$f":"'Вахта+Подменные'!D105","v":0},{"$f":"'Вахта+Подменные'!E105","v":0},{"$f":"'Вахта+Подменные'!F105","v":0},{"$f":"'Вахта+Подменные'!G105","v":0},{"$f":"'Вахта+Подменные'!H105","v":"153/15"},{"$f":"'Вахта+Подменные'!I105","v":0},{"$f":"'Вахта+Подменные'!J105","v":0},{"$f":"'Вахта+Подменные'!K105","v":0},{"$f":"'Вахта+Подменные'!L105","v":0},{"$f":"'Вахта+Подменные'!M105","v":0},{"$f":"'Вахта+Подменные'!N105","v":0},{"$f":"'Вахта+Подменные'!O105","v":0},{"$f":"'Вахта+Подменные'!P105","v":0},{"$f":"'Вахта+Подменные'!Q105","v":0},{"$f":"'Вахта+Подменные'!R105","v":0},{"$f":"_xlfn.CONCAT('Журнал Вахта_ИТР'!$C$1)","v":"T506"},null,null,null,"Очередная","Сдал"," ",null,{"$f":"IF(AC52=\"\",\"\",MAX($AB$3:AB51)+1)","v":""},"","","","T506",{"$f":"IF(AD52=\"\",\"\",#REF!)","v":""},"","","","","","","","","","","","","","","","","","","","","",""]
[50,null,{"$f":"'Вахта+Подменные'!B107","v":"Зима близко"},{"$f":"'Вахта+Подменные'!C107","v":"Помощник бурильщика ЭиРБС (первый) 6 р."},{"$f":"'Вахта+Подменные'!D107","v":0},{"$f":"'Вахта+Подменные'!E107","v":0},{"$f":"'Вахта+Подменные'!F107","v":0},{"$f":"'Вахта+Подменные'!G107","v":0},{"$f":"'Вахта+Подменные'!H107","v":"3284"},{"$f":"'Вахта+Подменные'!I107","v":0},{"$f":"'Вахта+Подменные'!J107","v":0},{"$f":"'Вахта+Подменные'!K107","v":0},{"$f":"'Вахта+Подменные'!L107","v":0},{"$f":"'Вахта+Подменные'!M107","v":0},{"$f":"'Вахта+Подменные'!N107","v":0},{"$f":"'Вахта+Подменные'!O107","v":0},{"$f":"'Вахта+Подменные'!P107","v":0},{"$f":"'Вахта+Подменные'!Q107","v":0},{"$f":"'Вахта+Подменные'!R107","v":0},{"$f":"_xlfn.CONCAT('Журнал Вахта_ИТР'!$C$1)","v":"T506"},null,null,null,"Очередная","Сдал"," ",null,{"$f":"IF(AC53=\"\",\"\",MAX($AB$3:AB52)+1)","v":""},"","","","T506",{"$f":"IF(AD53=\"\",\"\",#REF!)","v":""},"","","","","","","","","","","","","","","","","","","","","",""]
[51,null,{"$f":"'Вахта+Подменные'!B109","v":"То куда ты палишь"},{"$f":"'Вахта+Подменные'!C109","v":"Машинист крана автомобильного 8р"},{"$f":"'Вахта+Подменные'!D109","v":"158"},{"$f":"'Вахта+Подменные'!E109","v":0},{"$f":"'Вахта+Подменные'!F109","v":"38-21-09"},{"$f":"'Вахта+Подменные'!G109","v":0},{"$f":"'Вахта+Подменные'!H109","v":"4229"},{"$f":"'Вахта+Подменные'!I109","v":0},{"$f":"'Вахта+Подменные'!J109","v":0},{"$f":"'Вахта+Подменные'!K109","v":0},{"$f":"'Вахта+Подменные'!L109","v":0},{"$f":"'Вахта+Подменные'!M109","v":0},{"$f":"'Вахта+Подменные'!N109","v":0},{"$f":"'Вахта+Подменные'!O109","v":0},{"$f":"'Вахта+Подменные'!P109","v":0},{"$f":"'Вахта+Подменные'!Q109","v":0},{"$f":"'Вахта+Подменные'!R109","v":0},{"$f":"_xlfn.CONCAT('Журнал Вахта_ИТР'!$C$1)","v":"T506"},null,null,null,"Очередная","Сдал"," ",null,{"$f":"IF(AC54=\"\",\"\",MAX($AB$3:AB53)+1)","v":""},"","","","T506",{"$f":"IF(AD54=\"\",\"\",#REF!)","v":""},"","","","","","","","","","","","","","","","","","","","","",""]
[52,null,{"$f":"'Вахта+Подменные'!B111","v":"Электроды"},{"$f":"'Вахта+Подменные'!C111","v":"Вышкомонтажник- электромонтер 5 р."},{"$f":"'Вахта+Подменные'!D111","v":"82169"},{"$f":"'Вахта+Подменные'!E111","v":0},{"$f":"'Вахта+Подменные'!F111","v":"46-21-13"},{"$f":"'Вахта+Подменные'!G111","v":0},{"$f":"'Вахта+Подменные'!H111","v":"5882"},{"$f":"'Вахта+Подменные'!I111","v":0},{"$f":"'Вахта+Подменные'!J111","v":0},{"$f":"'Вахта+Подменные'!K111","v":0},{"$f":"'Вахта+Подменные'!L111","v":0},{"$f":"'Вахта+Подменные'!M111","v":0},{"$f":"'Вахта+Подменные'!N111","v":0},{"$f":"'Вахта+Подменные'!O111","v":0},{"$f":"'Вахта+Подменные'!P111","v":0},{"$f":"'Вахта+Подменные'!Q111","v":0},{"$f":"'Вахта+Подменные'!R111","v":0},{"$f":"_xlfn.CONCAT('Журнал Вахта_ИТР'!$C$1)","v":"T506"},null,null,null,"Очередная","Сдал"," ",null,{"$f":"IF(AC55=\"\",\"\",MAX($AB$3:AB54)+1)","v":""},"","","","T506",{"$f":"IF(AD55=\"\",\"\",#REF!)","v":""},"","","","","","","","","","","","","","","","","","","","","",""]
[53,null,{"$f":"'Вахта+Подменные'!B113","v":"Семь пятниц"},{"$f":"'Вахта+Подменные'!C113","v":"Водитель автопогрузчика"},{"$f":"'Вахта+Подменные'!D113","v":"047-4"},{"$f":"'Вахта+Подменные'!E113","v":0},{"$f":"'Вахта+Подменные'!F113","v":"027-Т320"},{"$f":"'Вахта+Подменные'!G113","v":0},{"$f":"'Вахта+Подменные'!H113","v":"153/8"},{"$f":"'Вахта+Подменные'!I113","v":"055-ч"},{"$f":"'Вахта+Подменные'!J113","v":0},{"$f":"'Вахта+Подменные'!K113","v":0},{"$f":"'Вахта+Подменные'!L113","v":0},{"$f":"'Вахта+Подменные'!M113","v":0},{"$f":"'Вахта+Подменные'!N113","v":0},{"$f":"'Вахта+Подменные'!O113","v":0},{"$f":"'Вахта+Подменные'!P113","v":0},{"$f":"'Вахта+Подменные'!Q113","v":0},{"$f":"'Вахта+Подменные'!R113","v":0},{"$f":"_xlfn.CONCAT('Журнал Вахта_ИТР'!$C$1)","v":"T506"},null,null,null,"Очередная","Сдал"," ",null,{"$f":"IF(AC56=\"\",\"\",MAX($AB$3:AB55)+1)","v":""},"","","","T506",{"$f":"IF(AD56=\"\",\"\",#REF!)","v":""},"","","","","","","","","","","","","","","","","","","","","",""]
[54,null,{"$f":"'Вахта+Подменные'!B115","v":"Вштаю незамечу"},{"$f":"'Вахта+Подменные'!C115","v":"Слесарь по обслуживанию буровых 6 р."},{"$f":"'Вахта+Подменные'!D115","v":0},{"$f":"'Вахта+Подменные'!E115","v":0},{"$f":"'Вахта+Подменные'!F115","v":"Т506/74"},{"$f":"'Вахта+Подменные'!G115","v":0},{"$f":"'Вахта+Подменные'!H115","v":0},{"$f":"'Вахта+Подменные'!I115","v":"29097"},{"$f":"'Вахта+Подменные'!J115","v":0},{"$f":"'Вахта+Подменные'!K115","v":0},{"$f":"'Вахта+Подменные'!L115","v":"1504-18/7/3"},{"$f":"'Вахта+Подменные'!M115","v":0},{"$f":"'Вахта+Подменные'!N115","v":0},{"$f":"'Вахта+Подменные'!O115","v":0},{"$f":"'Вахта+Подменные'!P115","v":0},{"$f":"'Вахта+Подменные'!Q115","v":0},{"$f":"'Вахта+Подменные'!R115","v":0},{"$f":"_xlfn.CONCAT('Журнал Вахта_ИТР'!$C$1)","v":"T506"},null,null,null,"Очередная","Сдал"," ",null,{"$f":"IF(AC57=\"\",\"\",MAX($AB$3:AB56)+1)","v":""},"","","","T506",{"$f":"IF(AD57=\"\",\"\",#REF!)","v":""},"","","","","","","","","","","","","","","","","","","","","",""]
[55,null,{"$f":"'Вахта+Подменные'!B117","v":0},{"$f":"'Вахта+Подменные'!C117","v":0},{"$f":"'Вахта+Подменные'!D117","v":0},{"$f":"'Вахта+Подменные'!E117","v":0},{"$f":"'Вахта+Подменные'!F117","v":0},{"$f":"'Вахта+Подменные'!G117","v":0},{"$f":"'Вахта+Подменные'!H117","v":0},{"$f":"'Вахта+Подменные'!I117","v":0},{"$f":"'Вахта+Подменные'!J117","v":0},{"$f":"'Вахта+Подменные'!K117","v":0},{"$f":"'Вахта+Подменные'!L117","v":0},{"$f":"'Вахта+Подменные'!M117","v":0},{"$f":"'Вахта+Подменные'!N117","v":0},{"$f":"'Вахта+Подменные'!O117","v":0},{"$f":"'Вахта+Подменные'!P117","v":0},{"$f":"'Вахта+Подменные'!Q117","v":0},{"$f":"'Вахта+Подменные'!R117","v":0},{"$f":"_xlfn.CONCAT('Журнал Вахта_ИТР'!$C$1)","v":"T506"},null,null,null,"Очередная","Сдал"," ",null,{"$f":"IF(AC58=\"\",\"\",MAX($AB$3:AB57)+1)","v":""},"","","","T506",{"$f":"IF(AD58=\"\",\"\",#REF!)","v":""},"","","","","","","","","","","","","","","","","","","","","",""]
[56,null,{"$f":"'Вахта+Подменные'!B119","v":0},{"$f":"'Вахта+Подменные'!C119","v":0},{"$f":"'Вахта+Подменные'!D119","v":0},{"$f":"'Вахта+Подменные'!E119","v":0},{"$f":"'Вахта+Подменные'!F119","v":0},{"$f":"'Вахта+Подменные'!G119","v":0},{"$f":"'Вахта+Подменные'!H119","v":0},{"$f":"'Вахта+Подменные'!I119","v":0},{"$f":"'Вахта+Подменные'!J119","v":0},{"$f":"'Вахта+Подменные'!K119","v":0},{"$f":"'Вахта+Подменные'!L119","v":0},{"$f":"'Вахта+Подменные'!M119","v":0},{"$f":"'Вахта+Подменные'!N119","v":0},{"$f":"'Вахта+Подменные'!O119","v":0},{"$f":"'Вахта+Подменные'!P119","v":0},{"$f":"'Вахта+Подменные'!Q119","v":0},{"$f":"'Вахта+Подменные'!R119","v":0},{"$f":"_xlfn.CONCAT('Журнал Вахта_ИТР'!$C$1)","v":"T506"},null,null,null,"Очередная","Сдал"," ",null,{"$f":"IF(AC59=\"\",\"\",MAX($AB$3:AB58)+1)","v":""},"","","","T506",{"$f":"IF(AD59=\"\",\"\",#REF!)","v":""},"","","","","","","","","","","","","","","","","","","","","",""]
[57,null,{"$f":"'Вахта+Подменные'!B121","v":0},{"$f":"'Вахта+Подменные'!C121","v":0},{"$f":"'Вахта+Подменные'!D121","v":0},{"$f":"'Вахта+Подменные'!E121","v":0},{"$f":"'Вахта+Подменные'!F121","v":0},{"$f":"'Вахта+Подменные'!G121","v":0},{"$f":"'Вахта+Подменные'!H121","v":0},{"$f":"'Вахта+Подменные'!I121","v":0},{"$f":"'Вахта+Подменные'!J121","v":0},{"$f":"'Вахта+Подменные'!K121","v":0},{"$f":"'Вахта+Подменные'!L121","v":0},{"$f":"'Вахта+Подменные'!M121","v":0},{"$f":"'Вахта+Подменные'!N121","v":0},{"$f":"'Вахта+Подменные'!O121","v":0},{"$f":"'Вахта+Подменные'!P121","v":0},{"$f":"'Вахта+Подменные'!Q121","v":0},{"$f":"'Вахта+Подменные'!R121","v":0},{"$f":"_xlfn.CONCAT('Журнал Вахта_ИТР'!$C$1)","v":"T506"},null,null,null,"Очередная","Сдал"," ",null,{"$f":"IF(AC60=\"\",\"\",MAX($AB$3:AB59)+1)","v":""},"","","","T506",{"$f":"IF(AD60=\"\",\"\",#REF!)","v":""},"","","","","","","","","","","","","","","","","","","","","",""]
[58,null,{"$f":"'Вахта+Подменные'!B123","v":0},{"$f":"'Вахта+Подменные'!C123","v":0},{"$f":"'Вахта+Подменные'!D123","v":0},{"$f":"'Вахта+Подменные'!E123","v":0},{"$f":"'Вахта+Подменные'!F123","v":0},{"$f":"'Вахта+Подменные'!G123","v":0},{"$f":"'Вахта+Подменные'!H123","v":0},{"$f":"'Вахта+Подменные'!I123","v":0},{"$f":"'Вахта+Подменные'!J123","v":0},{"$f":"'Вахта+Подменные'!K123","v":0},{"$f":"'Вахта+Подменные'!L123","v":0},{"$f":"'Вахта+Подменные'!M123","v":0},{"$f":"'Вахта+Подменные'!N123","v":0},{"$f":"'Вахта+Подменные'!O123","v":0},{"$f":"'Вахта+Подменные'!P123","v":0},{"$f":"'Вахта+Подменные'!Q123","v":0},{"$f":"'Вахта+Подменные'!R123","v":0},{"$f":"_xlfn.CONCAT('Журнал Вахта_ИТР'!$C$1)","v":"T506"},null,null,null,"Очередная","Сдал"," ",null,{"$f":"IF(AC61=\"\",\"\",MAX($AB$3:AB60)+1)","v":""},"","","","T506",{"$f":"IF(AD61=\"\",\"\",#REF!)","v":""},"","","","","","","","","","","","","","","","","","","","","",""]
[59,null,{"$f":"'Вахта+Подменные'!B125","v":0},{"$f":"'Вахта+Подменные'!C125","v":0},{"$f":"'Вахта+Подменные'!D125","v":0},{"$f":"'Вахта+Подменные'!E125","v":0},{"$f":"'Вахта+Подменные'!F125","v":0},{"$f":"'Вахта+Подменные'!G125","v":0},{"$f":"'Вахта+Подменные'!H125","v":0},{"$f":"'Вахта+Подменные'!I125","v":0},{"$f":"'Вахта+Подменные'!J125","v":0},{"$f":"'Вахта+Подменные'!K125","v":0},{"$f":"'Вахта+Подменные'!L125","v":0},{"$f":"'Вахта+Подменные'!M125","v":0},{"$f":"'Вахта+Подменные'!N125","v":0},{"$f":"'Вахта+Подменные'!O125","v":0},{"$f":"'Вахта+Подменные'!P125","v":0},{"$f":"'Вахта+Подменные'!Q125","v":0},{"$f":"'Вахта+Подменные'!R125","v":0},{"$f":"_xlfn.CONCAT('Журнал Вахта_ИТР'!$C$1)","v":"T506"},null,null,null,"Очередная","Сдал"," ",null,{"$f":"IF(AC62=\"\",\"\",MAX($AB$3:AB61)+1)","v":""},"","","","T506",{"$f":"IF(AD62=\"\",\"\",#REF!)","v":""},"","","","","","","","","","","","","","","","","","","","","",""]
[60,null,{"$f":"'Вахта+Подменные'!B127","v":0},{"$f":"'Вахта+Подменные'!C127","v":0},{"$f":"'Вахта+Подменные'!D127","v":0},{"$f":"'Вахта+Подменные'!E127","v":0},{"$f":"'Вахта+Подменные'!F127","v":0},{"$f":"'Вахта+Подменные'!G127","v":0},{"$f":"'Вахта+Подменные'!H127","v":0},{"$f":"'Вахта+Подменные'!I127","v":0},{"$f":"'Вахта+Подменные'!J127","v":0},{"$f":"'Вахта+Подменные'!K127","v":0},{"$f":"'Вахта+Подменные'!L127","v":0},{"$f":"'Вахта+Подменные'!M127","v":0},{"$f":"'Вахта+Подменные'!N127","v":0},{"$f":"'Вахта+Подменные'!O127","v":0},{"$f":"'Вахта+Подменные'!P127","v":0},{"$f":"'Вахта+Подменные'!Q127","v":0},{"$f":"'Вахта+Подменные'!R127","v":0},{"$f":"_xlfn.CONCAT('Журнал Вахта_ИТР'!$C$1)","v":"T506"},null,null,null,"Очередная","Сдал"," ",null,{"$f":"IF(AC63=\"\",\"\",MAX($AB$3:AB62)+1)","v":""},"","","","T506",{"$f":"IF(AD63=\"\",\"\",#REF!)","v":""},"","","","","","","","","","","","","","","","","","","","","",""]
[61,null,{"$f":"'Вахта+Подменные'!B129","v":0},{"$f":"'Вахта+Подменные'!C129","v":0},{"$f":"'Вахта+Подменные'!D129","v":0},{"$f":"'Вахта+Подменные'!E129","v":0},{"$f":"'Вахта+Подменные'!F129","v":0},{"$f":"'Вахта+Подменные'!G129","v":0},{"$f":"'Вахта+Подменные'!H129","v":0},{"$f":"'Вахта+Подменные'!I129","v":0},{"$f":"'Вахта+Подменные'!J129","v":0},{"$f":"'Вахта+Подменные'!K129","v":0},{"$f":"'Вахта+Подменные'!L129","v":0},{"$f":"'Вахта+Подменные'!M129","v":0},{"$f":"'Вахта+Подменные'!N129","v":0},{"$f":"'Вахта+Подменные'!O129","v":0},{"$f":"'Вахта+Подменные'!P129","v":0},{"$f":"'Вахта+Подменные'!Q129","v":0},{"$f":"'Вахта+Подменные'!R129","v":0},{"$f":"_xlfn.CONCAT('Журнал Вахта_ИТР'!$C$1)","v":"T506"},null,null,null,"Очередная","Сдал"," ",null,{"$f":"IF(AC64=\"\",\"\",MAX($AB$3:AB63)+1)","v":""},"","","","T506",{"$f":"IF(AD64=\"\",\"\",#REF!)","v":""},"","","","","","","","","","","","","","","","","","","","","",""]
[62,null,{"$f":"'Вахта+Подменные'!B131","v":0},{"$f":"'Вахта+Подменные'!C131","v":0},{"$f":"'Вахта+Подменные'!D131","v":0},{"$f":"'Вахта+Подменные'!E131","v":0},{"$f":"'Вахта+Подменные'!F131","v":0},{"$f":"'Вахта+Подменные'!G131","v":0},{"$f":"'Вахта+Подменные'!H131","v":0},{"$f":"'Вахта+Подменные'!I131","v":0},{"$f":"'Вахта+Подменные'!J131","v":0},{"$f":"'Вахта+Подменные'!K131","v":0},{"$f":"'Вахта+Подменные'!L131","v":0},{"$f":"'Вахта+Подменные'!M131","v":0},{"$f":"'Вахта+Подменные'!N131","v":0},{"$f":"'Вахта+Подменные'!O131","v":0},{"$f":"'Вахта+Подменные'!P131","v":0},{"$f":"'Вахта+Подменные'!Q131","v":0},{"$f":"'Вахта+Подменные'!R131","v":0},{"$f":"_xlfn.CONCAT('Журнал Вахта_ИТР'!$C$1)","v":"T506"},null,null,null,"Очередная","Сдал"," ",null,{"$f":"IF(AC65=\"\",\"\",MAX($AB$3:AB64)+1)","v":""},"","","","T506",{"$f":"IF(AD65=\"\",\"\",#REF!)","v":""},"","","","","","","","","","","","","","","","","","","","","",""]
[63,null,{"$f":"'Вахта+Подменные'!B133","v":0},{"$f":"'Вахта+Подменные'!C133","v":0},{"$f":"'Вахта+Подменные'!D133","v":0},{"$f":"'Вахта+Подменные'!E133","v":0},{"$f":"'Вахта+Подменные'!F133","v":0},{"$f":"'Вахта+Подменные'!G133","v":0},{"$f":"'Вахта+Подменные'!H133","v":0},{"$f":"'Вахта+Подменные'!I133","v":0},{"$f":"'Вахта+Подменные'!J133","v":0},{"$f":"'Вахта+Подменные'!K133","v":0},{"$f":"'Вахта+Подменные'!L133","v":0},{"$f":"'Вахта+Подменные'!M133","v":0},{"$f":"'Вахта+Подменные'!N133","v":0},{"$f":"'Вахта+Подменные'!O133","v":0},{"$f":"'Вахта+Подменные'!P133","v":0},{"$f":"'Вахта+Подменные'!Q133","v":0},{"$f":"'Вахта+Подменные'!R133","v":0},{"$f":"_xlfn.CONCAT('Журнал Вахта_ИТР'!$C$1)","v":"T506"},null,null,null,"Очередная","Сдал"," ",null,{"$f":"IF(AC66=\"\",\"\",MAX($AB$3:AB65)+1)","v":""},"","","","T506",{"$f":"IF(AD66=\"\",\"\",#REF!)","v":""},"","","","","","","","","","","","","","","","","","","","","",""]
[64,null,{"$f":"'Вахта+Подменные'!B135","v":0},{"$f":"'Вахта+Подменные'!C135","v":0},{"$f":"'Вахта+Подменные'!D135","v":0},{"$f":"'Вахта+Подменные'!E135","v":0},{"$f":"'Вахта+Подменные'!F135","v":0},{"$f":"'Вахта+Подменные'!G135","v":0},{"$f":"'Вахта+Подменные'!H135","v":0},{"$f":"'Вахта+Подменные'!I135","v":0},{"$f":"'Вахта+Подменные'!J135","v":0},{"$f":"'Вахта+Подменные'!K135","v":0},{"$f":"'Вахта+Подменные'!L135","v":0},{"$f":"'Вахта+Подменные'!M135","v":0},{"$f":"'Вахта+Подменные'!N135","v":0},{"$f":"'Вахта+Подменные'!O135","v":0},{"$f":"'Вахта+Подменные'!P135","v":0},{"$f":"'Вахта+Подменные'!Q135","v":0},{"$f":"'Вахта+Подменные'!R135","v":0},{"$f":"_xlfn.CONCAT('Журнал Вахта_ИТР'!$C$1)","v":"T506"},null,null,null,"Очередная","Сдал"," ",null,{"$f":"IF(AC67=\"\",\"\",MAX($AB$3:AB66)+1)","v":""},"","","","T506",{"$f":"IF(AD67=\"\",\"\",#REF!)","v":""},"","","","","","","","","","","","","","","","","","","","","",""]
[65,null,{"$f":"'Вахта+Подменные'!B137","v":0},{"$f":"'Вахта+Подменные'!C137","v":0},{"$f":"'Вахта+Подменные'!D137","v":0},{"$f":"'Вахта+Подменные'!E137","v":0},{"$f":"'Вахта+Подменные'!F137","v":0},{"$f":"'Вахта+Подменные'!G137","v":0},{"$f":"'Вахта+Подменные'!H137","v":0},{"$f":"'Вахта+Подменные'!I137","v":0},{"$f":"'Вахта+Подменные'!J137","v":0},{"$f":"'Вахта+Подменные'!K137","v":0},{"$f":"'Вахта+Подменные'!L137","v":0},{"$f":"'Вахта+Подменные'!M137","v":0},{"$f":"'Вахта+Подменные'!N137","v":0},{"$f":"'Вахта+Подменные'!O137","v":0},{"$f":"'Вахта+Подменные'!P137","v":0},{"$f":"'Вахта+Подменные'!Q137","v":0},{"$f":"'Вахта+Подменные'!R137","v":0},{"$f":"_xlfn.CONCAT('Журнал Вахта_ИТР'!$C$1)","v":"T506"},null,null,null,"Очередная","Сдал"," ",null,{"$f":"IF(AC68=\"\",\"\",MAX($AB$3:AB67)+1)","v":""},"","","","T506",{"$f":"IF(AD68=\"\",\"\",#REF!)","v":""},"","","","","","","","","","","","","","","","","","","","","",""]
[66,null,{"$f":"'Вахта+Подменные'!B139","v":0},{"$f":"'Вахта+Подменные'!C139","v":0},{"$f":"'Вахта+Подменные'!D139","v":0},{"$f":"'Вахта+Подменные'!E139","v":0},{"$f":"'Вахта+Подменные'!F139","v":0},{"$f":"'Вахта+Подменные'!G139","v":0},{"$f":"'Вахта+Подменные'!H139","v":0},{"$f":"'Вахта+Подменные'!I139","v":0},{"$f":"'Вахта+Подменные'!J139","v":0},{"$f":"'Вахта+Подменные'!K139","v":0},{"$f":"'Вахта+Подменные'!L139","v":0},{"$f":"'Вахта+Подменные'!M139","v":0},{"$f":"'Вахта+Подменные'!N139","v":0},{"$f":"'Вахта+Подменные'!O139","v":0},{"$f":"'Вахта+Подменные'!P139","v":0},{"$f":"'Вахта+Подменные'!Q139","v":0},{"$f":"'Вахта+Подменные'!R139","v":0},{"$f":"_xlfn.CONCAT('Журнал Вахта_ИТР'!$C$1)","v":"T506"},null,null,null,"Очередная","Сдал"," ",null,{"$f":"IF(AC69=\"\",\"\",MAX($AB$3:AB68)+1)","v":""},{"$f":"IF(C69=\"\",\"\",IF(B69=$AB$1,C69,\"\"))","v":""},{"$f":"IF(AB69=\"\",\"\",B69)","v":""},{"$f":"IF(AB69=\"\",\"\",E69)","v":""},{"$f":"IF(AB69=\"\",T69,T69)","v":"T506"},{"$f":"IF(AD69=\"\",\"\",#REF!)","v":""},{"$f":"IF(AD69=\"\",\"\",U69)","v":""},{"$f":"IF(AD69=\"\",\"\",V69)","v":""},{"$f":"IF(AD69=\"\",\"\",W69)","v":""},{"$f":"IF(AD69=\"\",\"\",X69)","v":""},{"$f":"IF(AI69=\"\",\"\",Y69)","v":""},{"$f":"IF(AD69=\"\",\"\",D69)","v":""},{"$f":"IF(AD69=\"\",\"\",X69)","v":""},{"$f":"IF(AD69=\"\",\"\",Y69)","v":""},{"$f":"IF(AD69=\"\",\"\",F69)","v":""},{"$f":"IF(AE69=\"\",\"\",G69)","v":""},{"$f":"IF(AD69=\"\",\"\",H69)","v":""},{"$f":"IF(AD69=\"\",\"\",I69)","v":""},{"$f":"IF(AH69=\"\",\"\",J69)","v":""},{"$f":"IF(AI69=\"\",\"\",K69)","v":""},{"$f":"IF(AJ69=\"\",\"\",L69)","v":""},{"$f":"IF(AK69=\"\",\"\",M69)","v":""},{"$f":"IF(AL69=\"\",\"\",N69)","v":""},{"$f":"IF(AM69=\"\",\"\",O69)","v":""},{"$f":"IF(AN69=\"\",\"\",P69)","v":""},{"$f":"IF(AO69=\"\",\"\",Q69)","v":""},{"$f":"IF(AP69=\"\",\"\",R69)","v":""},{"$f":"IF(AQ69=\"\",\"\",S69)","v":""}]
[67,null,{"$f":"'Вахта+Подменные'!B141","v":0},{"$f":"'Вахта+Подменные'!C141","v":0},{"$f":"'Вахта+Подменные'!D141","v":0},{"$f":"'Вахта+Подменные'!E141","v":0},{"$f":"'Вахта+Подменные'!F141","v":0},{"$f":"'Вахта+Подменные'!G141","v":0},{"$f":"'Вахта+Подменные'!H141","v":0},{"$f":"'Вахта+Подменные'!I141","v":0},{"$f":"'Вахта+Подменные'!J141","v":0},{"$f":"'Вахта+Подменные'!K141","v":0},{"$f":"'Вахта+Подменные'!L141","v":0},{"$f":"'Вахта+Подменные'!M141","v":0},{"$f":"'Вахта+Подменные'!N141","v":0},{"$f":"'Вахта+Подменные'!O141","v":0},{"$f":"'Вахта+Подменные'!P141","v":0},{"$f":"'Вахта+Подменные'!Q141","v":0},{"$f":"'Вахта+Подменные'!R141","v":0},{"$f":"_xlfn.CONCAT('Журнал Вахта_ИТР'!$C$1)","v":"T506"},null,null,null,"Очередная","Сдал"," ",null,{"$f":"IF(AC70=\"\",\"\",MAX($AB$3:AB69)+1)","v":""},"","","","T506",{"$f":"IF(AD70=\"\",\"\",#REF!)","v":""},"","","","","","","","","","","","","","","","","","","","","",""]
[68,null,{"$f":"'Вахта+Подменные'!B143","v":0},{"$f":"'Вахта+Подменные'!C143","v":0},{"$f":"'Вахта+Подменные'!D143","v":0},{"$f":"'Вахта+Подменные'!E143","v":0},{"$f":"'Вахта+Подменные'!F143","v":0},{"$f":"'Вахта+Подменные'!G143","v":0},{"$f":"'Вахта+Подменные'!H143","v":0},{"$f":"'Вахта+Подменные'!I143","v":0},{"$f":"'Вахта+Подменные'!J143","v":0},{"$f":"'Вахта+Подменные'!K143","v":0},{"$f":"'Вахта+Подменные'!L143","v":0},{"$f":"'Вахта+Подменные'!M143","v":0},{"$f":"'Вахта+Подменные'!N143","v":0},{"$f":"'Вахта+Подменные'!O143","v":0},{"$f":"'Вахта+Подменные'!P143","v":0},{"$f":"'Вахта+Подменные'!Q143","v":0},{"$f":"'Вахта+Подменные'!R143","v":0},{"$f":"_xlfn.CONCAT('Журнал Вахта_ИТР'!$C$1)","v":"T506"},null,null,null,"Очередная","Сдал"," ",null,{"$f":"IF(AC71=\"\",\"\",MAX($AB$3:AB70)+1)","v":""},"","","","T506",{"$f":"IF(AD71=\"\",\"\",#REF!)","v":""},"","","","","","","","","","","","","","","","","","","","","",""]
[69,null,{"$f":"'Вахта+Подменные'!B145","v":0},{"$f":"'Вахта+Подменные'!C145","v":0},{"$f":"'Вахта+Подменные'!D145","v":0},{"$f":"'Вахта+Подменные'!E145","v":0},{"$f":"'Вахта+Подменные'!F145","v":0},{"$f":"'Вахта+Подменные'!G145","v":0},{"$f":"'Вахта+Подменные'!H145","v":0},{"$f":"'Вахта+Подменные'!I145","v":0},{"$f":"'Вахта+Подменные'!J145","v":0},{"$f":"'Вахта+Подменные'!K145","v":0},{"$f":"'Вахта+Подменные'!L145","v":0},{"$f":"'Вахта+Подменные'!M145","v":0},{"$f":"'Вахта+Подменные'!N145","v":0},{"$f":"'Вахта+Подменные'!O145","v":0},{"$f":"'Вахта+Подменные'!P145","v":0},{"$f":"'Вахта+Подменные'!Q145","v":0},{"$f":"'Вахта+Подменные'!R145","v":0},{"$f":"_xlfn.CONCAT('Журнал Вахта_ИТР'!$C$1)","v":"T506"},null,null,null,"Очередная","Сдал"," ",null,{"$f":"IF(AC72=\"\",\"\",MAX($AB$3:AB71)+1)","v":""},"","","","T506",{"$f":"IF(AD72=\"\",\"\",#REF!)","v":""},"","","","","","","","","","","","","","","","","","","","","",""]
[70,null,{"$f":"'Вахта+Подменные'!B147","v":0},{"$f":"'Вахта+Подменные'!C147","v":0},{"$f":"'Вахта+Подменные'!D147","v":0},{"$f":"'Вахта+Подменные'!E147","v":0},{"$f":"'Вахта+Подменные'!F147","v":0},{"$f":"'Вахта+Подменные'!G147","v":0},{"$f":"'Вахта+Подменные'!H147","v":0},{"$f":"'Вахта+Подменные'!I147","v":0},{"$f":"'Вахта+Подменные'!J147","v":0},{"$f":"'Вахта+Подменные'!K147","v":0},{"$f":"'Вахта+Подменные'!L147","v":0},{"$f":"'Вахта+Подменные'!M147","v":0},{"$f":"'Вахта+Подменные'!N147","v":0},{"$f":"'Вахта+Подменные'!O147","v":0},{"$f":"'Вахта+Подменные'!P147","v":0},{"$f":"'Вахта+Подменные'!Q147","v":0},{"$f":"'Вахта+Подменные'!R147","v":0},{"$f":"_xlfn.CONCAT('Журнал Вахта_ИТР'!$C$1)","v":"T506"},null,null,null,"Очередная","Сдал"," ",null,{"$f":"IF(AC73=\"\",\"\",MAX($AB$3:AB72)+1)","v":""},"","","","T506",{"$f":"IF(AD73=\"\",\"\",#REF!)","v":""},"","","","","","","","","","","","","","","","","","","","","",""]
[71,null,{"$f":"'Вахта+Подменные'!B149","v":0},{"$f":"'Вахта+Подменные'!C149","v":0},{"$f":"'Вахта+Подменные'!D149","v":0},{"$f":"'Вахта+Подменные'!E149","v":0},{"$f":"'Вахта+Подменные'!F149","v":0},{"$f":"'Вахта+Подменные'!G149","v":0},{"$f":"'Вахта+Подменные'!H149","v":0},{"$f":"'Вахта+Подменные'!I149","v":0},{"$f":"'Вахта+Подменные'!J149","v":0},{"$f":"'Вахта+Подменные'!K149","v":0},{"$f":"'Вахта+Подменные'!L149","v":0},{"$f":"'Вахта+Подменные'!M149","v":0},{"$f":"'Вахта+Подменные'!N149","v":0},{"$f":"'Вахта+Подменные'!O149","v":0},{"$f":"'Вахта+Подменные'!P149","v":0},{"$f":"'Вахта+Подменные'!Q149","v":0},{"$f":"'Вахта+Подменные'!R149","v":0},{"$f":"_xlfn.CONCAT('Журнал Вахта_ИТР'!$C$1)","v":"T506"},null,null,null,"Очередная","Сдал"," ",null,{"$f":"IF(AC74=\"\",\"\",MAX($AB$3:AB73)+1)","v":""},"","","","T506",{"$f":"IF(AD74=\"\",\"\",#REF!)","v":""},"","","","","","","","","","","","","","","","","","","","","",""]
[72,null,{"$f":"'Вахта+Подменные'!B151","v":0},{"$f":"'Вахта+Подменные'!C151","v":0},{"$f":"'Вахта+Подменные'!D151","v":0},{"$f":"'Вахта+Подменные'!E151","v":0},{"$f":"'Вахта+Подменные'!F151","v":0},{"$f":"'Вахта+Подменные'!G151","v":0},{"$f":"'Вахта+Подменные'!H151","v":0},{"$f":"'Вахта+Подменные'!I151","v":0},{"$f":"'Вахта+Подменные'!J151","v":0},{"$f":"'Вахта+Подменные'!K151","v":0},{"$f":"'Вахта+Подменные'!L151","v":0},{"$f":"'Вахта+Подменные'!M151","v":0},{"$f":"'Вахта+Подменные'!N151","v":0},{"$f":"'Вахта+Подменные'!O151","v":0},{"$f":"'Вахта+Подменные'!P151","v":0},{"$f":"'Вахта+Подменные'!Q151","v":0},{"$f":"'Вахта+Подменные'!R151","v":0},{"$f":"_xlfn.CONCAT('Журнал Вахта_ИТР'!$C$1)","v":"T506"},null,null,null,"Очередная","Сдал"," ",null,{"$f":"IF(AC75=\"\",\"\",MAX($AB$3:AB74)+1)","v":""},"","","","T506",{"$f":"IF(AD75=\"\",\"\",#REF!)","v":""},"","","","","","","","","","","","","","","","","","","","","",""]
[73,null,{"$f":"'Вахта+Подменные'!B153","v":0},{"$f":"'Вахта+Подменные'!C153","v":0},{"$f":"'Вахта+Подменные'!D153","v":0},{"$f":"'Вахта+Подменные'!E153","v":0},{"$f":"'Вахта+Подменные'!F153","v":0},{"$f":"'Вахта+Подменные'!G153","v":0},{"$f":"'Вахта+Подменные'!H153","v":0},{"$f":"'Вахта+Подменные'!I153","v":0},{"$f":"'Вахта+Подменные'!J153","v":0},{"$f":"'Вахта+Подменные'!K153","v":0},{"$f":"'Вахта+Подменные'!L153","v":0},{"$f":"'Вахта+Подменные'!M153","v":0},{"$f":"'Вахта+Подменные'!N153","v":0},{"$f":"'Вахта+Подменные'!O153","v":0},{"$f":"'Вахта+Подменные'!P153","v":0},{"$f":"'Вахта+Подменные'!Q153","v":0},{"$f":"'Вахта+Подменные'!R153","v":0},{"$f":"_xlfn.CONCAT('Журнал Вахта_ИТР'!$C$1)","v":"T506"},null,null,null,"Очередная","Сдал"," ",null,{"$f":"IF(AC76=\"\",\"\",MAX($AB$3:AB75)+1)","v":""},"","","","T506",{"$f":"IF(AD76=\"\",\"\",#REF!)","v":""},"","","","","","","","","","","","","","","","","","","","","",""]
[74,null,{"$f":"ИТР!B4","v":"Иыфвф Ильропаевич"},{"$f":"ИТР!C4","v":"Мастер буровой"},{"$f":"ИТР!D4","v":"1063"},{"$f":"ИТР!E4","v":"50"},{"$f":"ИТР!F4","v":"591"},{"$f":"ИТР!G4","v":"814"},{"$f":"ИТР!H4","v":"814"},{"$f":"ИТР!I4","v":"6700"},{"$f":"ИТР!J4","v":"001950"},{"$f":"ИТР!K4","v":"Протокол №12-18"},{"$f":"ИТР!L4","v":"Протокол №12-18"},{"$f":"ИТР!M4","v":"Протокол №12-18"},{"$f":"ИТР!N4","v":"Протокол №12-18"},{"$f":"ИТР!O4","v":"Протокол №12-18"},{"$f":"ИТР!P4","v":0},{"$f":"ИТР!Q4","v":0},{"$f":"ИТР!R4","v":0},{"$f":"_xlfn.CONCAT('Журнал Вахта_ИТР'!$C$1)","v":"T506"},null,null,null,"Очередная","Сдал"," ",null,{"$f":"IF(AC77=\"\",\"\",MAX($AB$3:AB76)+1)","v":""},"","","","T506",{"$f":"IF(AD77=\"\",\"\",#REF!)","v":""},"","","","","","","","","","","","","","","","","","","","","",""]
[75,null,{"$f":"ИТР!B6","v":"Жфывфывв Анфвыфывй Владимирович"},{"$f":"ИТР!C6","v":"Мастер буровой"},{"$f":"ИТР!D6","v":"3578"},{"$f":"ИТР!E6","v":0},{"$f":"ИТР!F6","v":0},{"$f":"ИТР!G6","v":0},{"$f":"ИТР!H6","v":0},{"$f":"ИТР!I6","v":0},{"$f":"ИТР!J6","v":0},{"$f":"ИТР!K6","v":0},{"$f":"ИТР!L6","v":0},{"$f":"ИТР!M6","v":0},{"$f":"ИТР!N6","v":0},{"$f":"ИТР!O6","v":0},{"$f":"ИТР!P6","v":0},{"$f":"ИТР!Q6","v":0},{"$f":"ИТР!R6","v":0},{"$f":"_xlfn.CONCAT('Журнал Вахта_ИТР'!$C$1)","v":"T506"},null,null,null,"Очередная","Сдал"," ",null,{"$f":"IF(AC78=\"\",\"\",MAX($AB$3:AB77)+1)","v":""},"","","","T506",{"$f":"IF(AD78=\"\",\"\",#REF!)","v":""},"","","","","","","","","","","","","","","","","","","","","",""]
[76,null,{"$f":"ИТР!B8","v":"Кузфывфы Алекспвапимирович"},{"$f":"ИТР!C8","v":"Мастер буровой"},{"$f":"ИТР!D8","v":0},{"$f":"ИТР!E8","v":0},{"$f":"ИТР!F8","v":0},{"$f":"ИТР!G8","v":0},{"$f":"ИТР!H8","v":0},{"$f":"ИТР!I8","v":0},{"$f":"ИТР!J8","v":0},{"$f":"ИТР!K8","v":0},{"$f":"ИТР!L8","v":0},{"$f":"ИТР!M8","v":0},{"$f":"ИТР!N8","v":0},{"$f":"ИТР!O8","v":0},{"$f":"ИТР!P8","v":0},{"$f":"ИТР!Q8","v":0},{"$f":"ИТР!R8","v":0},{"$f":"_xlfn.CONCAT('Журнал Вахта_ИТР'!$C$1)","v":"T506"},null,null,null,"Очередная","Сдал"," ",null,{"$f":"IF(AC79=\"\",\"\",MAX($AB$3:AB78)+1)","v":""},"","","","T506",{"$f":"IF(AD79=\"\",\"\",#REF!)","v":""},"","","","","","","","","","","","","","","","","","","","","",""]
[77,null,{"$f":"ИТР!B10","v":"Кавфывфв Русвпапазанович"},{"$f":"ИТР!C10","v":"Мастер буровой"},{"$f":"ИТР!D10","v":0},{"$f":"ИТР!E10","v":"121"},{"$f":"ИТР!F10","v":0},{"$f":"ИТР!G10","v":"2307"},{"$f":"ИТР!H10","v":"2307"},{"$f":"ИТР!I10","v":0},{"$f":"ИТР!J10","v":0},{"$f":"ИТР!K10","v":0},{"$f":"ИТР!L10","v":0},{"$f":"ИТР!M10","v":0},{"$f":"ИТР!N10","v":0},{"$f":"ИТР!O10","v":0},{"$f":"ИТР!P10","v":0},{"$f":"ИТР!Q10","v":0},{"$f":"ИТР!R10","v":0},{"$f":"_xlfn.CONCAT('Журнал Вахта_ИТР'!$C$1)","v":"T506"},null,null,null,"Очередная","Сдал"," ",null,{"$f":"IF(AC80=\"\",\"\",MAX($AB$3:AB79)+1)","v":""},"","","","T506",{"$f":"IF(AD80=\"\",\"\",#REF!)","v":""},"","","","","","","","","","","","","","","","","","","","","",""]
[78,null,{"$f":"ИТР!B12","v":"Ефывфы"},{"$f":"ИТР!C12","v":"Специалист по ОТ и ПБ"},{"$f":"ИТР!D12","v":0},{"$f":"ИТР!E12","v":0},{"$f":"ИТР!F12","v":0},{"$f":"ИТР!G12","v":0},{"$f":"ИТР!H12","v":0},{"$f":"ИТР!I12","v":0},{"$f":"ИТР!J12","v":0},{"$f":"ИТР!K12","v":0},{"$f":"ИТР!L12","v":0},{"$f":"ИТР!M12","v":0},{"$f":"ИТР!N12","v":0},{"$f":"ИТР!O12","v":0},{"$f":"ИТР!P12","v":0},{"$f":"ИТР!Q12","v":0},{"$f":"ИТР!R12","v":0},{"$f":"_xlfn.CONCAT('Журнал Вахта_ИТР'!$C$1)","v":"T506"},null,null,null,"Очередная","Сдал"," ",null,{"$f":"IF(AC81=\"\",\"\",MAX($AB$3:AB80)+1)","v":""},"","","","T506",{"$f":"IF(AD81=\"\",\"\",#REF!)","v":""},"","","","","","","","","","","","","","","","","","","","","",""]
[79,null,{"$f":"ИТР!B14","v":"Авфывфывлерьевич"},{"$f":"ИТР!C14","v":"Специалист по ОТ и ПБ"},{"$f":"ИТР!D14","v":0},{"$f":"ИТР!E14","v":0},{"$f":"ИТР!F14","v":0},{"$f":"ИТР!G14","v":0},{"$f":"ИТР!H14","v":0},{"$f":"ИТР!I14","v":0},{"$f":"ИТР!J14","v":0},{"$f":"ИТР!K14","v":0},{"$f":"ИТР!L14","v":0},{"$f":"ИТР!M14","v":0},{"$f":"ИТР!N14","v":0},{"$f":"ИТР!O14","v":0},{"$f":"ИТР!P14","v":0},{"$f":"ИТР!Q14","v":0},{"$f":"ИТР!R14","v":0},{"$f":"_xlfn.CONCAT('Журнал Вахта_ИТР'!$C$1)","v":"T506"},null,null,null,"Очередная","Сдал"," ",null,{"$f":"IF(AC82=\"\",\"\",MAX($AB$3:AB81)+1)","v":""},"","","","T506",{"$f":"IF(AD82=\"\",\"\",#REF!)","v":""},"","","","","","","","","","","","","","","","","","","","","",""]
[80,null,{"$f":"ИТР!B16","v":"Лыфвфырьевич"},{"$f":"ИТР!C16","v":"Механик"},{"$f":"ИТР!D16","v":0},{"$f":"ИТР!E16","v":0},{"$f":"ИТР!F16","v":0},{"$f":"ИТР!G16","v":0},{"$f":"ИТР!H16","v":0},{"$f":"ИТР!I16","v":0},{"$f":"ИТР!J16","v":0},{"$f":"ИТР!K16","v":0},{"$f":"ИТР!L16","v":0},{"$f":"ИТР!M16","v":0},{"$f":"ИТР!N16","v":0},{"$f":"ИТР!O16","v":0},{"$f":"ИТР!P16","v":0},{"$f":"ИТР!Q16","v":0},{"$f":"ИТР!R16","v":0},{"$f":"_xlfn.CONCAT('Журнал Вахта_ИТР'!$C$1)","v":"T506"},null,null,null,"Очередная","Сдал"," ",null,{"$f":"IF(AC83=\"\",\"\",MAX($AB$3:AB82)+1)","v":""},"","","","T506",{"$f":"IF(AD83=\"\",\"\",#REF!)","v":""},"","","","","","","","","","","","","","","","","","","","","",""]
[81,null,{"$f":"ИТР!B18","v":"Клыввфексеевич"},{"$f":"ИТР!C18","v":"Механик"},{"$f":"ИТР!D18","v":0},{"$f":"ИТР!E18","v":0},{"$f":"ИТР!F18","v":0},{"$f":"ИТР!G18","v":0},{"$f":"ИТР!H18","v":0},{"$f":"ИТР!I18","v":0},{"$f":"ИТР!J18","v":0},{"$f":"ИТР!K18","v":0},{"$f":"ИТР!L18","v":0},{"$f":"ИТР!M18","v":0},{"$f":"ИТР!N18","v":0},{"$f":"ИТР!O18","v":0},{"$f":"ИТР!P18","v":0},{"$f":"ИТР!Q18","v":0},{"$f":"ИТР!R18","v":0},{"$f":"_xlfn.CONCAT('Журнал Вахта_ИТР'!$C$1)","v":"T506"},null,null,null,"Очередная","Сдал"," ",null,{"$f":"IF(AC84=\"\",\"\",MAX($AB$3:AB83)+1)","v":""},"","","","T506",{"$f":"IF(AD84=\"\",\"\",#REF!)","v":""},"","","","","","","","","","","","","","","","","","","","","",""]
[82,null,{"$f":"ИТР!B20","v":"Хопарапргеевич"},{"$f":"ИТР!C20","v":"Главный электрик"},{"$f":"ИТР!D20","v":0},{"$f":"ИТР!E20","v":0},{"$f":"ИТР!F20","v":0},{"$f":"ИТР!G20","v":0},{"$f":"ИТР!H20","v":0},{"$f":"ИТР!I20","v":0},{"$f":"ИТР!J20","v":0},{"$f":"ИТР!K20","v":0},{"$f":"ИТР!L20","v":0},{"$f":"ИТР!M20","v":0},{"$f":"ИТР!N20","v":0},{"$f":"ИТР!O20","v":0},{"$f":"ИТР!P20","v":0},{"$f":"ИТР!Q20","v":0},{"$f":"ИТР!R20","v":0},{"$f":"_xlfn.CONCAT('Журнал Вахта_ИТР'!$C$1)","v":"T506"},null,null,null,"Очередная","Сдал"," ",null,{"$f":"IF(AC85=\"\",\"\",MAX($AB$3:AB84)+1)","v":""},"","","","T506",{"$f":"IF(AD85=\"\",\"\",#REF!)","v":""},"","","","","","","","","","","","","","","","","","","","","",""]
[83,null,{"$f":"ИТР!B22","v":"Кларпарович"},{"$f":"ИТР!C22","v":"Главный электрик"},{"$f":"ИТР!D22","v":0},{"$f":"ИТР!E22","v":0},{"$f":"ИТР!F22","v":0},{"$f":"ИТР!G22","v":0},{"$f":"ИТР!H22","v":0},{"$f":"ИТР!I22","v":0},{"$f":"ИТР!J22","v":0},{"$f":"ИТР!K22","v":0},{"$f":"ИТР!L22","v":0},{"$f":"ИТР!M22","v":0},{"$f":"ИТР!N22","v":0},{"$f":"ИТР!O22","v":0},{"$f":"ИТР!P22","v":0},{"$f":"ИТР!Q22","v":0},{"$f":"ИТР!R22","v":0},{"$f":"_xlfn.CONCAT('Журнал Вахта_ИТР'!$C$1)","v":"T506"},null,null,null,"Очередная","Сдал"," ",null,{"$f":"IF(AC86=\"\",\"\",MAX($AB$3:AB85)+1)","v":""},"","","","T506",{"$f":"IF(AD86=\"\",\"\",#REF!)","v":""},"","","","","","","","","","","","","","","","","","","","","",""]
[84,null,{"$f":"ИТР!B24","v":0},{"$f":"ИТР!C24","v":"Заведующий складом"},{"$f":"ИТР!D24","v":0},{"$f":"ИТР!E24","v":0},{"$f":"ИТР!F24","v":0},{"$f":"ИТР!G24","v":0},{"$f":"ИТР!H24","v":0},{"$f":"ИТР!I24","v":0},{"$f":"ИТР!J24","v":0},{"$f":"ИТР!K24","v":0},{"$f":"ИТР!L24","v":0},{"$f":"ИТР!M24","v":0},{"$f":"ИТР!N24","v":0},{"$f":"ИТР!O24","v":0},{"$f":"ИТР!P24","v":0},{"$f":"ИТР!Q24","v":0},{"$f":"ИТР!R24","v":0},{"$f":"_xlfn.CONCAT('Журнал Вахта_ИТР'!$C$1)","v":"T506"},null,null,null,"Очередная","Сдал"," ",null,{"$f":"IF(AC87=\"\",\"\",MAX($AB$3:AB86)+1)","v":""},"","","","T506",{"$f":"IF(AD87=\"\",\"\",#REF!)","v":""},"","","","","","","","","","","","","","","","","","","","","",""]
[85,null,{"$f":"ИТР!B28","v":0},{"$f":"ИТР!C28","v":0},{"$f":"ИТР!D28","v":0},{"$f":"ИТР!E28","v":0},{"$f":"ИТР!F28","v":0},{"$f":"ИТР!G28","v":0},{"$f":"ИТР!H28","v":0},{"$f":"ИТР!I28","v":0},{"$f":"ИТР!J28","v":0},{"$f":"ИТР!K28","v":0},{"$f":"ИТР!L28","v":0},{"$f":"ИТР!M28","v":0},{"$f":"ИТР!N28","v":0},{"$f":"ИТР!O28","v":0},{"$f":"ИТР!P28","v":0},{"$f":"ИТР!Q28","v":0},{"$f":"ИТР!R28","v":0},{"$f":"_xlfn.CONCAT('Журнал Вахта_ИТР'!$C$1)","v":"T506"},null,null,null,"Очередная","Сдал"," ",null,{"$f":"IF(AC88=\"\",\"\",MAX($AB$3:AB87)+1)","v":""},"","","","T506",{"$f":"IF(AD88=\"\",\"\",#REF!)","v":""},"","","","","","","","","","","","","","","","","","","","","",""]
[86,null,{"$f":"ИТР!B28","v":0},{"$f":"ИТР!C28","v":0},{"$f":"ИТР!D28","v":0},{"$f":"ИТР!E28","v":0},{"$f":"ИТР!F28","v":0},{"$f":"ИТР!G28","v":0},{"$f":"ИТР!H28","v":0},{"$f":"ИТР!I28","v":0},{"$f":"ИТР!J28","v":0},{"$f":"ИТР!K28","v":0},{"$f":"ИТР!L28","v":0},{"$f":"ИТР!M28","v":0},{"$f":"ИТР!N28","v":0},{"$f":"ИТР!O28","v":0},{"$f":"ИТР!P28","v":0},{"$f":"ИТР!Q28","v":0},{"$f":"ИТР!R28","v":0},{"$f":"_xlfn.CONCAT('Журнал Вахта_ИТР'!$C$1)","v":"T506"},null,null,null,"Очередная","Сдал"," ",null,{"$f":"IF(AC89=\"\",\"\",MAX($AB$3:AB88)+1)","v":""},"","","","T506",{"$f":"IF(AD89=\"\",\"\",#REF!)","v":""},"","","","","","","","","","","","","","","","","","","","","",""]
[87,null,{"$f":"ИТР!B30","v":0},{"$f":"ИТР!C30","v":0},{"$f":"ИТР!D30","v":0},{"$f":"ИТР!E30","v":0},{"$f":"ИТР!F30","v":0},{"$f":"ИТР!G30","v":0},{"$f":"ИТР!H30","v":0},{"$f":"ИТР!I30","v":0},{"$f":"ИТР!J30","v":0},{"$f":"ИТР!K30","v":0},{"$f":"ИТР!L30","v":0},{"$f":"ИТР!M30","v":0},{"$f":"ИТР!N30","v":0},{"$f":"ИТР!O30","v":0},{"$f":"ИТР!P30","v":0},{"$f":"ИТР!Q30","v":0},{"$f":"ИТР!R30","v":0},{"$f":"_xlfn.CONCAT('Журнал Вахта_ИТР'!$C$1)","v":"T506"},null,null,null,"Очередная","Сдал"," ",null,{"$f":"IF(AC90=\"\",\"\",MAX($AB$3:AB89)+1)","v":""},"","","","T506",{"$f":"IF(AD90=\"\",\"\",#REF!)","v":""},"","","","","","","","","","","","","","","","","","","","","",""]
[88,null,{"$f":"ИТР!B32","v":0},{"$f":"ИТР!C32","v":0},{"$f":"ИТР!D32","v":0},{"$f":"ИТР!E32","v":0},{"$f":"ИТР!F32","v":0},{"$f":"ИТР!G32","v":0},{"$f":"ИТР!H32","v":0},{"$f":"ИТР!I32","v":0},{"$f":"ИТР!J32","v":0},{"$f":"ИТР!K32","v":0},{"$f":"ИТР!L32","v":0},{"$f":"ИТР!M32","v":0},{"$f":"ИТР!N32","v":0},{"$f":"ИТР!O32","v":0},{"$f":"ИТР!P32","v":0},{"$f":"ИТР!Q32","v":0},{"$f":"ИТР!R32","v":0},{"$f":"_xlfn.CONCAT('Журнал Вахта_ИТР'!$C$1)","v":"T506"},null,null,null,"Очередная","Сдал"," ",null,{"$f":"IF(AC91=\"\",\"\",MAX($AB$3:AB90)+1)","v":""},"","","","T506",{"$f":"IF(AD91=\"\",\"\",#REF!)","v":""},"","","","","","","","","","","","","","","","","","","","","",""]
[89,null,{"$f":"ИТР!B34","v":0},{"$f":"ИТР!C34","v":0},{"$f":"ИТР!D34","v":0},{"$f":"ИТР!E34","v":0},{"$f":"ИТР!F34","v":0},{"$f":"ИТР!G34","v":0},{"$f":"ИТР!H34","v":0},{"$f":"ИТР!I34","v":0},{"$f":"ИТР!J34","v":0},{"$f":"ИТР!K34","v":0},{"$f":"ИТР!L34","v":0},{"$f":"ИТР!M34","v":0},{"$f":"ИТР!N34","v":0},{"$f":"ИТР!O34","v":0},{"$f":"ИТР!P34","v":0},{"$f":"ИТР!Q34","v":0},{"$f":"ИТР!R34","v":0},{"$f":"_xlfn.CONCAT('Журнал Вахта_ИТР'!$C$1)","v":"T506"},null,null,null,"Очередная","Сдал"," ",null,{"$f":"IF(AC92=\"\",\"\",MAX($AB$3:AB91)+1)","v":""},"","","","T506",{"$f":"IF(AD92=\"\",\"\",#REF!)","v":""},"","","","","","","","","","","","","","","","","","","","","",""]
[90,null,{"$f":"ИТР!B36","v":0},{"$f":"ИТР!C36","v":0},{"$f":"ИТР!D36","v":0},{"$f":"ИТР!E36","v":0},{"$f":"ИТР!F36","v":0},{"$f":"ИТР!G36","v":0},{"$f":"ИТР!H36","v":0},{"$f":"ИТР!I36","v":0},{"$f":"ИТР!J36","v":0},{"$f":"ИТР!K36","v":0},{"$f":"ИТР!L36","v":0},{"$f":"ИТР!M36","v":0},{"$f":"ИТР!N36","v":0},{"$f":"ИТР!O36","v":0},{"$f":"ИТР!P36","v":0},{"$f":"ИТР!Q36","v":0},{"$f":"ИТР!R36","v":0},{"$f":"_xlfn.CONCAT('Журнал Вахта_ИТР'!$C$1)","v":"T506"},null,null,null,"Очередная","Сдал"," ",null,{"$f":"IF(AC93=\"\",\"\",MAX($AB$3:AB92)+1)","v":""},"","","","T506",{"$f":"IF(AD93=\"\",\"\",#REF!)","v":""},"","","","","","","","","","","","","","","","","","","","","",""]
[91,null,{"$f":"ИТР!B38","v":0},{"$f":"ИТР!C38","v":0},{"$f":"ИТР!D38","v":0},{"$f":"ИТР!E38","v":0},{"$f":"ИТР!F38","v":0},{"$f":"ИТР!G38","v":0},{"$f":"ИТР!H38","v":0},{"$f":"ИТР!I38","v":0},{"$f":"ИТР!J38","v":0},{"$f":"ИТР!K38","v":0},{"$f":"ИТР!L38","v":0},{"$f":"ИТР!M38","v":0},{"$f":"ИТР!N38","v":0},{"$f":"ИТР!O38","v":0},{"$f":"ИТР!P38","v":0},{"$f":"ИТР!Q38","v":0},{"$f":"ИТР!R38","v":0},{"$f":"_xlfn.CONCAT('Журнал Вахта_ИТР'!$C$1)","v":"T506"},null,null,null,"Очередная","Сдал"," ",null,{"$f":"IF(AC94=\"\",\"\",MAX($AB$3:AB93)+1)","v":""},"","","","T506",{"$f":"IF(AD94=\"\",\"\",#REF!)","v":""},"","","","","","","","","","","","","","","","","","","","","",""]
[92,null,{"$f":"ИТР!B40","v":0},{"$f":"ИТР!C40","v":0},{"$f":"ИТР!D40","v":0},{"$f":"ИТР!E40","v":0},{"$f":"ИТР!F40","v":0},{"$f":"ИТР!G40","v":0},{"$f":"ИТР!H40","v":0},{"$f":"ИТР!I40","v":0},{"$f":"ИТР!J40","v":0},{"$f":"ИТР!K40","v":0},{"$f":"ИТР!L40","v":0},{"$f":"ИТР!M40","v":0},{"$f":"ИТР!N40","v":0},{"$f":"ИТР!O40","v":0},{"$f":"ИТР!P40","v":0},{"$f":"ИТР!Q40","v":0},{"$f":"ИТР!R40","v":0},{"$f":"_xlfn.CONCAT('Журнал Вахта_ИТР'!$C$1)","v":"T506"},null,null,null,"Очередная","Сдал"," ",null,{"$f":"IF(AC95=\"\",\"\",MAX($AB$3:AB94)+1)","v":""},"","","","T506",{"$f":"IF(AD95=\"\",\"\",#REF!)","v":""},"","","","","","","","","","","","","","","","","","","","","",""]
[93,null,{"$f":"ИТР!B42","v":0},{"$f":"ИТР!C42","v":0},{"$f":"ИТР!D42","v":0},{"$f":"ИТР!E42","v":0},{"$f":"ИТР!F42","v":0},{"$f":"ИТР!G42","v":0},{"$f":"ИТР!H42","v":0},{"$f":"ИТР!I42","v":0},{"$f":"ИТР!J42","v":0},{"$f":"ИТР!K42","v":0},{"$f":"ИТР!L42","v":0},{"$f":"ИТР!M42","v":0},{"$f":"ИТР!N42","v":0},{"$f":"ИТР!O42","v":0},{"$f":"ИТР!P42","v":0},{"$f":"ИТР!Q42","v":0},{"$f":"ИТР!R42","v":0},{"$f":"_xlfn.CONCAT('Журнал Вахта_ИТР'!$C$1)","v":"T506"},null,null,null,"Очередная","Сдал"," ",null,{"$f":"IF(AC96=\"\",\"\",MAX($AB$3:AB95)+1)","v":""},"","","","T506",{"$f":"IF(AD96=\"\",\"\",#REF!)","v":""},"","","","","","","","","","","","","","","","","","","","","",""]
[94,null,{"$f":"ИТР!B44","v":0},{"$f":"ИТР!C44","v":0},{"$f":"ИТР!D44","v":0},{"$f":"ИТР!E44","v":0},{"$f":"ИТР!F44","v":0},{"$f":"ИТР!G44","v":0},{"$f":"ИТР!H44","v":0},{"$f":"ИТР!I44","v":0},{"$f":"ИТР!J44","v":0},{"$f":"ИТР!K44","v":0},{"$f":"ИТР!L44","v":0},{"$f":"ИТР!M44","v":0},{"$f":"ИТР!N44","v":0},{"$f":"ИТР!O44","v":0},{"$f":"ИТР!P44","v":0},{"$f":"ИТР!Q44","v":0},{"$f":"ИТР!R44","v":0},{"$f":"_xlfn.CONCAT('Журнал Вахта_ИТР'!$C$1)","v":"T506"},null,null,null,"Очередная","Сдал"," ",null,{"$f":"IF(AC97=\"\",\"\",MAX($AB$3:AB96)+1)","v":""},"","","","T506",{"$f":"IF(AD97=\"\",\"\",#REF!)","v":""},"","","","","","","","","","","","","","","","","","","","","",""]
[95,null,{"$f":"ИТР!B46","v":0},{"$f":"ИТР!C46","v":0},{"$f":"ИТР!D46","v":0},{"$f":"ИТР!E46","v":0},{"$f":"ИТР!F46","v":0},{"$f":"ИТР!G46","v":0},{"$f":"ИТР!H46","v":0},{"$f":"ИТР!I46","v":0},{"$f":"ИТР!J46","v":0},{"$f":"ИТР!K46","v":0},{"$f":"ИТР!L46","v":0},{"$f":"ИТР!M46","v":0},{"$f":"ИТР!N46","v":0},{"$f":"ИТР!O46","v":0},{"$f":"ИТР!P46","v":0},{"$f":"ИТР!Q46","v":0},{"$f":"ИТР!R46","v":0},{"$f":"_xlfn.CONCAT('Журнал Вахта_ИТР'!$C$1)","v":"T506"},null,null,null,"Очередная","Сдал"," ",null,{"$f":"IF(AC98=\"\",\"\",MAX($AB$3:AB97)+1)","v":""},"","","","T506",{"$f":"IF(AD98=\"\",\"\",#REF!)","v":""},"","","","","","","","","","","","","","","","","","","","","",""]
[96,null,{"$f":"ИТР!B48","v":0},{"$f":"ИТР!C48","v":0},{"$f":"ИТР!D48","v":0},{"$f":"ИТР!E48","v":0},{"$f":"ИТР!F48","v":0},{"$f":"ИТР!G48","v":0},{"$f":"ИТР!H48","v":0},{"$f":"ИТР!I48","v":0},{"$f":"ИТР!J48","v":0},{"$f":"ИТР!K48","v":0},{"$f":"ИТР!L48","v":0},{"$f":"ИТР!M48","v":0},{"$f":"ИТР!N48","v":0},{"$f":"ИТР!O48","v":0},{"$f":"ИТР!P48","v":0},{"$f":"ИТР!Q48","v":0},{"$f":"ИТР!R48","v":0},{"$f":"_xlfn.CONCAT('Журнал Вахта_ИТР'!$C$1)","v":"T506"},null,null,null,"Очередная","Сдал"," ",null,{"$f":"IF(AC99=\"\",\"\",MAX($AB$3:AB98)+1)","v":""},"","","","T506",{"$f":"IF(AD99=\"\",\"\",#REF!)","v":""},"","","","","","","","","","","","","","","","","","","","","",""]
[null,null,null,null,null,null,null,null,null,null,null,null,null,null,null,null,null,null,null,{"$f":"IF(AND(C100=\"\",B100=\"\"),\"\",B100+1095)","v":""},null,null,null,null,null," ",null,{"$f":"IF(AC100=\"\",\"\",MAX($AB$3:AB99)+1)","v":""},{"$f":"IF(C100=\"\",\"\",IF(B100=$AB$1,C100,\"\"))","v":""},{"$f":"IF(AB100=\"\",\"\",B100)","v":""},{"$f":"IF(AB100=\"\",\"\",E100)","v":""},{"$f":"IF(AB100=\"\",\"\",#REF!)","v":""},{"$f":"IF(AD100=\"\",\"\",#REF!)","v":""},{"$f":"IF(AD100=\"\",\"\",U100)","v":""},{"$f":"IF(AD100=\"\",\"\",V100)","v":""},{"$f":"IF(AD100=\"\",\"\",W100)","v":""},{"$f":"IF(AH100=\"\",\"\",X100)","v":""},{"$f":"IF(AI100=\"\",\"\",Y100)","v":""},{"$f":"IF(AE100=\"\",\"\",D100)","v":""},{"$f":"IF(AE100=\"\",\"\",X100)","v":""},{"$f":"IF(AE100=\"\",\"\",Y100)","v":""},{"$f":"IF(AD100=\"\",\"\",F100)","v":""},{"$f":"IF(AE100=\"\",\"\",G100)","v":""},{"$f":"IF(AD100=\"\",\"\",H100)","v":""},{"$f":"IF(AD100=\"\",\"\",I100)","v":""},{"$f":"IF(AH100=\"\",\"\",J100)","v":""},{"$f":"IF(AI100=\"\",\"\",K100)","v":""},{"$f":"IF(AJ100=\"\",\"\",L100)","v":""},{"$f":"IF(AK100=\"\",\"\",M100)","v":""},{"$f":"IF(AL100=\"\",\"\",N100)","v":""},{"$f":"IF(AM100=\"\",\"\",O100)","v":""},{"$f":"IF(AN100=\"\",\"\",P100)","v":""},{"$f":"IF(AO100=\"\",\"\",Q100)","v":""},{"$f":"IF(AP100=\"\",\"\",R100)","v":""},{"$f":"IF(AQ100=\"\",\"\",S100)","v":""}]
[null,null,null,null,null,null,null,null,null,null,null,null,null,null,null,null,null,null,null,"",null,null,null,null,null," ",null,{"$f":"IF(AC101=\"\",\"\",MAX($AB$3:AB100)+1)","v":""},"","","",{"$f":"IF(AB101=\"\",\"\",#REF!)","v":""},{"$f":"IF(AD101=\"\",\"\",#REF!)","v":""},"","","","","","","","","","","","","","","","","","","","","",""]
[null,null,null,null,null,null,null,null,null,null,null,null,null,null,null,null,null,null,null,"",null,null,null,null,null," ",null,{"$f":"IF(AC102=\"\",\"\",MAX($AB$3:AB101)+1)","v":""},"","","",{"$f":"IF(AB102=\"\",\"\",#REF!)","v":""},{"$f":"IF(AD102=\"\",\"\",#REF!)","v":""},"","","","","","","","","","","","","","","","","","","","","",""]
[null,null,null,null,null,null,null,null,null,null,null,null,null,null,null,null,null,null,null,"",null,null,null,null,null," ",null,{"$f":"IF(AC103=\"\",\"\",MAX($AB$3:AB102)+1)","v":""},"","","",{"$f":"IF(AB103=\"\",\"\",#REF!)","v":""},{"$f":"IF(AD103=\"\",\"\",#REF!)","v":""},"","","","","","","","","","","","","","","","","","","","","",""]
[null,null,null,null,null,null,null,null,null,null,null,null,null,null,null,null,null,null,null,"",null,null,null,null,null," ",null,{"$f":"IF(AC104=\"\",\"\",MAX($AB$3:AB103)+1)","v":""},"","","",{"$f":"IF(AB104=\"\",\"\",#REF!)","v":""},{"$f":"IF(AD104=\"\",\"\",#REF!)","v":""},"","","","","","","","","","","","","","","","","","","","","",""]
[null,null,null,null,null,null,null,null,null,null,null,null,null,null,null,null,null,null,null,"",null,null,null,null,null," ",null,{"$f":"IF(AC105=\"\",\"\",MAX($AB$3:AB104)+1)","v":""},"","","",{"$f":"IF(AB105=\"\",\"\",#REF!)","v":""},{"$f":"IF(AD105=\"\",\"\",#REF!)","v":""},"","","","","","","","","","","","","","","","","","","","","",""]
[null,null,null,null,null,null,null,null,null,null,null,null,null,null,null,null,null,null,null,"",null,null,null,null,null," ",null,{"$f":"IF(AC106=\"\",\"\",MAX($AB$3:AB105)+1)","v":""},"","","",{"$f":"IF(AB106=\"\",\"\",#REF!)","v":""},{"$f":"IF(AD106=\"\",\"\",#REF!)","v":""},"","","","","","","","","","","","","","","","","","","","","",""]
[null,null,null,null,null,null,null,null,null,null,null,null,null,null,null,null,null,null,null,"",null,null,null,null,null," ",null,{"$f":"IF(AC107=\"\",\"\",MAX($AB$3:AB106)+1)","v":""},"","","",{"$f":"IF(AB107=\"\",\"\",#REF!)","v":""},{"$f":"IF(AD107=\"\",\"\",#REF!)","v":""},"","","","","","","","","","","","","","","","","","","","","",""]
[null,null,null,null,null,null,null,null,null,null,null,null,null,null,null,null,null,null,null,"",null,null,null,null,null," ",null,{"$f":"IF(AC108=\"\",\"\",MAX($AB$3:AB107)+1)","v":""},"","","",{"$f":"IF(AB108=\"\",\"\",#REF!)","v":""},{"$f":"IF(AD108=\"\",\"\",#REF!)","v":""},"","","","","","","","","","","","","","","","","","","","","",""]
[null,null,null,null,null,null,null,null,null,null,null,null,null,null,null,null,null,null,null,"",null,null,null,null,null," ",null,{"$f":"IF(AC109=\"\",\"\",MAX($AB$3:AB108)+1)","v":""},"","","",{"$f":"IF(AB109=\"\",\"\",#REF!)","v":""},{"$f":"IF(AD109=\"\",\"\",#REF!)","v":""},"","","","","","","","","","","","","","","","","","","","","",""]
[null,null,null,null,null,null,null,null,null,null,null,null,null,null,null,null,null,null,null,"",null,null,null,null,null," ",null,{"$f":"IF(AC110=\"\",\"\",MAX($AB$3:AB109)+1)","v":""},"","","",{"$f":"IF(AB110=\"\",\"\",#REF!)","v":""},{"$f":"IF(AD110=\"\",\"\",#REF!)","v":""},"","","","","","","","","","","","","","","","","","","","","",""]
[null,null,null,null,null,null,null,null,null,null,null,null,null,null,null,null,null,null,null,"",null,null,null,null,null," ",null,{"$f":"IF(AC111=\"\",\"\",MAX($AB$3:AB110)+1)","v":""},"","","",{"$f":"IF(AB111=\"\",\"\",#REF!)","v":""},{"$f":"IF(AD111=\"\",\"\",#REF!)","v":""},"","","","","","","","","","","","","","","","","","","","","",""]
[null,null,null,null,null,null,null,null,null,null,null,null,null,null,null,null,null,null,null,"",null,null,null,null,null," ",null,{"$f":"IF(AC112=\"\",\"\",MAX($AB$3:AB111)+1)","v":""},"","","",{"$f":"IF(AB112=\"\",\"\",#REF!)","v":""},{"$f":"IF(AD112=\"\",\"\",#REF!)","v":""},"","","","","","","","","","","","","","","","","","","","","",""]
[null,null,null,null,null,null,null,null,null,null,null,null,null,null,null,null,null,null,null,"",null,null,null,null,null," ",null,{"$f":"IF(AC113=\"\",\"\",MAX($AB$3:AB112)+1)","v":""},"","","",{"$f":"IF(AB113=\"\",\"\",#REF!)","v":""},{"$f":"IF(AD113=\"\",\"\",#REF!)","v":""},"","","","","","","","","","","","","","","","","","","","","",""]
[null,null,null,null,null,null,null,null,null,null,null,null,null,null,null,null,null,null,null,"",null,null,null,null,null," ",null,{"$f":"IF(AC114=\"\",\"\",MAX($AB$3:AB113)+1)","v":""},"","","",{"$f":"IF(AB114=\"\",\"\",#REF!)","v":""},{"$f":"IF(AD114=\"\",\"\",#REF!)","v":""},"","","","","","","","","","","","","","","","","","","","","",""]
[null,null,null,null,null,null,null,null,null,null,null,null,null,null,null,null,null,null,null,"",null,null,null,null,null," ",null,{"$f":"IF(AC115=\"\",\"\",MAX($AB$3:AB114)+1)","v":""},"","","",{"$f":"IF(AB115=\"\",\"\",#REF!)","v":""},{"$f":"IF(AD115=\"\",\"\",#REF!)","v":""},"","","","","","","","","","","","","","","","","","","","","",""]
[null,null,null,null,null,null,null,null,null,null,null,null,null,null,null,null,null,null,null,"",null,null,null,null,null," ",null,{"$f":"IF(AC116=\"\",\"\",MAX($AB$3:AB115)+1)","v":""},"","","",{"$f":"IF(AB116=\"\",\"\",#REF!)","v":""},{"$f":"IF(AD116=\"\",\"\",#REF!)","v":""},"","","","","","","","","","","","","","","","","","","","","",""]
[null,null,null,null,null,null,null,null,null,null,null,null,null,null,null,null,null,null,null,"",null,null,null,null,null," ",null,{"$f":"IF(AC117=\"\",\"\",MAX($AB$3:AB116)+1)","v":""},"","","",{"$f":"IF(AB117=\"\",\"\",#REF!)","v":""},{"$f":"IF(AD117=\"\",\"\",#REF!)","v":""},"","","","","","","","","","","","","","","","","","","","","",""]
[null,null,null,null,null,null,null,null,null,null,null,null,null,null,null,null,null,null,null,"",null,null,null,null,null," ",null,{"$f":"IF(AC118=\"\",\"\",MAX($AB$3:AB117)+1)","v":""},"","","",{"$f":"IF(AB118=\"\",\"\",#REF!)","v":""},{"$f":"IF(AD118=\"\",\"\",#REF!)","v":""},"","","","","","","","","","","","","","","","","","","","","",""]
[null,null,null,null,null,null,null,null,null,null,null,null,null,null,null,null,null,null,null,"",null,null,null,null,null," ",null,{"$f":"IF(AC119=\"\",\"\",MAX($AB$3:AB118)+1)","v":""},"","","",{"$f":"IF(AB119=\"\",\"\",#REF!)","v":""},{"$f":"IF(AD119=\"\",\"\",#REF!)","v":""},"","","","","","","","","","","","","","","","","","","","","",""]
[null,null,null,null,null,null,null,null,null,null,null,null,null,null,null,null,null,null,null,"",null,null,null,null,null," ",null,{"$f":"IF(AC120=\"\",\"\",MAX($AB$3:AB119)+1)","v":""},"","","",{"$f":"IF(AB120=\"\",\"\",#REF!)","v":""},{"$f":"IF(AD120=\"\",\"\",#REF!)","v":""},"","","","","","","","","","","","","","","","","","","","","",""]
[null,null,null,null,null,null,null,null,null,null,null,null,null,null,null,null,null,null,null,"",null,null,null,null,null," ",null,{"$f":"IF(AC121=\"\",\"\",MAX($AB$3:AB120)+1)","v":""},"","","",{"$f":"IF(AB121=\"\",\"\",#REF!)","v":""},{"$f":"IF(AD121=\"\",\"\",#REF!)","v":""},"","","","","","","","","","","","","","","","","","","","","",""]
[null,null,null,null,null,null,null,null,null,null,null,null,null,null,null,null,null,null,null,"",null,null,null,null,null," ",null,{"$f":"IF(AC122=\"\",\"\",MAX($AB$3:AB121)+1)","v":""},"","","",{"$f":"IF(AB122=\"\",\"\",#REF!)","v":""},{"$f":"IF(AD122=\"\",\"\",#REF!)","v":""},"","","","","","","","","","","","","","","","","","","","","",""]
[null,null,null,null,null,null,null,null,null,null,null,null,null,null,null,null,null,null,null,"",null,null,null,null,null," ",null,{"$f":"IF(AC123=\"\",\"\",MAX($AB$3:AB122)+1)","v":""},"","","",{"$f":"IF(AB123=\"\",\"\",#REF!)","v":""},{"$f":"IF(AD123=\"\",\"\",#REF!)","v":""},"","","","","","","","","","","","","","","","","","","","","",""]
[null,null,null,null,null,null,null,null,null,null,null,null,null,null,null,null,null,null,null,"",null,null,null,null,null," ",null,{"$f":"IF(AC124=\"\",\"\",MAX($AB$3:AB123)+1)","v":""},"","","",{"$f":"IF(AB124=\"\",\"\",#REF!)","v":""},{"$f":"IF(AD124=\"\",\"\",#REF!)","v":""},"","","","","","","","","","","","","","","","","","","","","",""]
[null,null,null,null,null,null,null,null,null,null,null,null,null,null,null,null,null,null,null,"",null,null,null,null,null," ",null,{"$f":"IF(AC125=\"\",\"\",MAX($AB$3:AB124)+1)","v":""},"","","",{"$f":"IF(AB125=\"\",\"\",#REF!)","v":""},{"$f":"IF(AD125=\"\",\"\",#REF!)","v":""},"","","","","","","","","","","","","","","","","","","","","",""]
[null,null,null,null,null,null,null,null,null,null,null,null,null,null,null,null,null,null,null,"",null,null,null,null,null," ",null,{"$f":"IF(AC126=\"\",\"\",MAX($AB$3:AB125)+1)","v":""},"","","",{"$f":"IF(AB126=\"\",\"\",#REF!)","v":""},{"$f":"IF(AD126=\"\",\"\",#REF!)","v":""},"","","","","","","","","","","","","","","","","","","","","",""]
[null,null,null,null,null,null,null,null,null,null,null,null,null,null,null,null,null,null,null,"",null,null,null,null,null," ",null,{"$f":"IF(AC127=\"\",\"\",MAX($AB$3:AB126)+1)","v":""},"","","",{"$f":"IF(AB127=\"\",\"\",#REF!)","v":""},{"$f":"IF(AD127=\"\",\"\",#REF!)","v":""},"","","","","","","","","","","","","","","","","","","","","",""]
[null,null,null,null,null,null,null,null,null,null,null,null,null,null,null,null,null,null,null,"",null,null,null,null,null," ",null,{"$f":"IF(AC128=\"\",\"\",MAX($AB$3:AB127)+1)","v":""},"","","",{"$f":"IF(AB128=\"\",\"\",#REF!)","v":""},{"$f":"IF(AD128=\"\",\"\",#REF!)","v":""},"","","","","","","","","","","","","","","","","","","","","",""]
[null,null,null,null,null,null,null,null,null,null,null,null,null,null,null,null,null,null,null,"",null,null,null,null,null," ",null,{"$f":"IF(AC129=\"\",\"\",MAX($AB$3:AB128)+1)","v":""},"","","",{"$f":"IF(AB129=\"\",\"\",#REF!)","v":""},{"$f":"IF(AD129=\"\",\"\",#REF!)","v":""},"","","","","","","","","","","","","","","","","","","","","",""]
[null,null,null,null,null,null,null,null,null,null,null,null,null,null,null,null,null,null,null,"",null,null,null,null,null," ",null,{"$f":"IF(AC130=\"\",\"\",MAX($AB$3:AB129)+1)","v":""},"","","",{"$f":"IF(AB130=\"\",\"\",#REF!)","v":""},{"$f":"IF(AD130=\"\",\"\",#REF!)","v":""},"","","","","","","","","","","","","","","","","","","","","",""]
[null,null,null,null,null,null,null,null,null,null,null,null,null,null,null,null,null,null,null,"",null,null,null,null,null," ",null,{"$f":"IF(AC131=\"\",\"\",MAX($AB$3:AB130)+1)","v":""},"","","",{"$f":"IF(AB131=\"\",\"\",#REF!)","v":""},{"$f":"IF(AD131=\"\",\"\",#REF!)","v":""},"","","","","","","","","","","","","","","","","","","","","",""]
[null,null,null,null,null,null,null,null,null,null,null,null,null,null,null,null,null,null,null,"",null,null,null,null,null," ",null,{"$f":"IF(AC132=\"\",\"\",MAX($AB$3:AB131)+1)","v":""},"","","",{"$f":"IF(AB132=\"\",\"\",#REF!)","v":""},{"$f":"IF(AD132=\"\",\"\",#REF!)","v":""},"","","","","","","","","","","","","","","","","","","","","",""]
[null,null,null,null,null,null,null,null,null,null,null,null,null,null,null,null,null,null,null,"",null,null,null,null,null," ",null,{"$f":"IF(AC133=\"\",\"\",MAX($AB$3:AB132)+1)","v":""},"","","",{"$f":"IF(AB133=\"\",\"\",#REF!)","v":""},{"$f":"IF(AD133=\"\",\"\",#REF!)","v":""},"","","","","","","","","","","","","","","","","","","","","",""]
[null,null,null,null,null,null,null,null,null,null,null,null,null,null,null,null,null,null,null,"",null,null,null,null,null," ",null,{"$f":"IF(AC134=\"\",\"\",MAX($AB$3:AB133)+1)","v":""},"","","",{"$f":"IF(AB134=\"\",\"\",#REF!)","v":""},{"$f":"IF(AD134=\"\",\"\",#REF!)","v":""},"","","","","","","","","","","","","","","","","","","","","",""]
[null,null,null,null,null,null,null,null,null,null,null,null,null,null,null,null,null,null,null,"",null,null,null,null,null," ",null,{"$f":"IF(AC135=\"\",\"\",MAX($AB$3:AB134)+1)","v":""},"","","",{"$f":"IF(AB135=\"\",\"\",#REF!)","v":""},{"$f":"IF(AD135=\"\",\"\",#REF!)","v":""},"","","","","","","","","","","","","","","","","","","","","",""]
[null,null,null,null,null,null,null,null,null,null,null,null,null,null,null,null,null,null,null,"",null,null,null,null,null," ",null,{"$f":"IF(AC136=\"\",\"\",MAX($AB$3:AB135)+1)","v":""},"","","",{"$f":"IF(AB136=\"\",\"\",#REF!)","v":""},{"$f":"IF(AD136=\"\",\"\",#REF!)","v":""},"","","","","","","","","","","","","","","","","","","","","",""]
[null,null,null,null,null,null,null,null,null,null,null,null,null,null,null,null,null,null,null,"",null,null,null,null,null," ",null,{"$f":"IF(AC137=\"\",\"\",MAX($AB$3:AB136)+1)","v":""},"","","",{"$f":"IF(AB137=\"\",\"\",#REF!)","v":""},{"$f":"IF(AD137=\"\",\"\",#REF!)","v":""},"","","","","","","","","","","","","","","","","","","","","",""]
[null,null,null,null,null,null,null,null,null,null,null,null,null,null,null,null,null,null,null,"",null,null,null,null,null," ",null,{"$f":"IF(AC138=\"\",\"\",MAX($AB$3:AB137)+1)","v":""},"","","",{"$f":"IF(AB138=\"\",\"\",#REF!)","v":""},{"$f":"IF(AD138=\"\",\"\",#REF!)","v":""},"","","","","","","","","","","","","","","","","","","","","",""]
[null,null,null,null,null,null,null,null,null,null,null,null,null,null,null,null,null,null,null,"",null,null,null,null,null," ",null,{"$f":"IF(AC139=\"\",\"\",MAX($AB$3:AB138)+1)","v":""},"","","",{"$f":"IF(AB139=\"\",\"\",#REF!)","v":""},{"$f":"IF(AD139=\"\",\"\",#REF!)","v":""},"","","","","","","","","","","","","","","","","","","","","",""]
[null,null,null,null,null,null,null,null,null,null,null,null,null,null,null,null,null,null,null,"",null,null,null,null,null," ",null,{"$f":"IF(AC140=\"\",\"\",MAX($AB$3:AB139)+1)","v":""},"","","",{"$f":"IF(AB140=\"\",\"\",#REF!)","v":""},{"$f":"IF(AD140=\"\",\"\",#REF!)","v":""},"","","","","","","","","","","","","","","","","","","","","",""]
[null,null,null,null,null,null,null,null,null,null,null,null,null,null,null,null,null,null,null,"",null,null,null,null,null," ",null,{"$f":"IF(AC141=\"\",\"\",MAX($AB$3:AB140)+1)","v":""},"","","",{"$f":"IF(AB141=\"\",\"\",#REF!)","v":""},{"$f":"IF(AD141=\"\",\"\",#REF!)","v":""},"","","","","","","","","","","","","","","","","","","","","",""]
[null,null,null,null,null,null,null,null,null,null,null,null,null,null,null,null,null,null,null,"",null,null,null,null,null," ",null,{"$f":"IF(AC142=\"\",\"\",MAX($AB$3:AB141)+1)","v":""},"","","",{"$f":"IF(AB142=\"\",\"\",#REF!)","v":""},{"$f":"IF(AD142=\"\",\"\",#REF!)","v":""},"","","","","","","","","","","","","","","","","","","","","",""]
[null,null,null,null,null,null,null,null,null,null,null,null,null,null,null,null,null,null,null,"",null,null,null,null,null," ",null,{"$f":"IF(AC143=\"\",\"\",MAX($AB$3:AB142)+1)","v":""},"","","",{"$f":"IF(AB143=\"\",\"\",#REF!)","v":""},{"$f":"IF(AD143=\"\",\"\",#REF!)","v":""},"","","","","","","","","","","","","","","","","","","","","",""]
[null,null,null,null,null,null,null,null,null,null,null,null,null,null,null,null,null,null,null,"",null,null,null,null,null," ",null,{"$f":"IF(AC144=\"\",\"\",MAX($AB$3:AB143)+1)","v":""},"","","",{"$f":"IF(AB144=\"\",\"\",#REF!)","v":""},{"$f":"IF(AD144=\"\",\"\",#REF!)","v":""},"","","","","","","","","","","","","","","","","","","","","",""]
[null,null,null,null,null,null,null,null,null,null,null,null,null,null,null,null,null,null,null,"",null,null,null,null,null," ",null,{"$f":"IF(AC145=\"\",\"\",MAX($AB$3:AB144)+1)","v":""},{"$f":"IF(C145=\"\",\"\",IF(B145=$AB$1,C145,\"\"))","v":""},{"$f":"IF(AB145=\"\",\"\",B145)","v":""},{"$f":"IF(AB145=\"\",\"\",E145)","v":""},{"$f":"IF(AB145=\"\",\"\",#REF!)","v":""},{"$f":"IF(AD145=\"\",\"\",#REF!)","v":""},{"$f":"IF(AD145=\"\",\"\",U145)","v":""},{"$f":"IF(AD145=\"\",\"\",V145)","v":""},{"$f":"IF(AD145=\"\",\"\",W145)","v":""},{"$f":"IF(AH145=\"\",\"\",X145)","v":""},{"$f":"IF(AI145=\"\",\"\",Y145)","v":""},{"$f":"IF(AE145=\"\",\"\",D145)","v":""},{"$f":"IF(AE145=\"\",\"\",X145)","v":""},{"$f":"IF(AE145=\"\",\"\",Y145)","v":""},{"$f":"IF(AD145=\"\",\"\",F145)","v":""},{"$f":"IF(AE145=\"\",\"\",G145)","v":""},{"$f":"IF(AD145=\"\",\"\",H145)","v":""},{"$f":"IF(AD145=\"\",\"\",I145)","v":""},{"$f":"IF(AH145=\"\",\"\",J145)","v":""},{"$f":"IF(AI145=\"\",\"\",K145)","v":""},{"$f":"IF(AJ145=\"\",\"\",L145)","v":""},{"$f":"IF(AK145=\"\",\"\",M145)","v":""},{"$f":"IF(AL145=\"\",\"\",N145)","v":""},{"$f":"IF(AM145=\"\",\"\",O145)","v":""},{"$f":"IF(AN145=\"\",\"\",P145)","v":""},{"$f":"IF(AO145=\"\",\"\",Q145)","v":""},{"$f":"IF(AP145=\"\",\"\",R145)","v":""},{"$f":"IF(AQ145=\"\",\"\",S145)","v":""}]
[null,null,null,null,null,null,null,null,null,null,null,null,null,null,null,null,null,null,null,{"$f":"IF(AND(C146=\"\",B146=\"\"),\"\",B146+1095)","v":""},null,null,null,null,null," ",null,{"$f":"IF(AC146=\"\",\"\",MAX($AB$3:AB145)+1)","v":""},"","","",{"$f":"IF(AB146=\"\",\"\",#REF!)","v":""},{"$f":"IF(AD146=\"\",\"\",#REF!)","v":""},"","","","","","","","","","","","","","","","","","","","","",""]
[null,null,null,null,null,null,null,null,null,null,null,null,null,null,null,null,null,null,null,"",null,null,null,null,null," ",null,{"$f":"IF(AC147=\"\",\"\",MAX($AB$3:AB146)+1)","v":""},"","","",{"$f":"IF(AB147=\"\",\"\",#REF!)","v":""},{"$f":"IF(AD147=\"\",\"\",#REF!)","v":""},"","","","","","","","","","","","","","","","","","","","","",""]
[null,null,null,null,null,null,null,null,null,null,null,null,null,null,null,null,null,null,null,"",null,null,null,null,null," ",null,{"$f":"IF(AC148=\"\",\"\",MAX($AB$3:AB147)+1)","v":""},"","","",{"$f":"IF(AB148=\"\",\"\",#REF!)","v":""},{"$f":"IF(AD148=\"\",\"\",#REF!)","v":""},"","","","","","","","","","","","","","","","","","","","","",""]
[null,null,null,null,null,null,null,null,null,null,null,null,null,null,null,null,null,null,null,"",null,null,null,null,null," ",null,{"$f":"IF(AC149=\"\",\"\",MAX($AB$3:AB148)+1)","v":""},"","","",{"$f":"IF(AB149=\"\",\"\",#REF!)","v":""},{"$f":"IF(AD149=\"\",\"\",#REF!)","v":""},"","","","","","","","","","","","","","","","","","","","","",""]
[null,null,null,null,null,null,null,null,null,null,null,null,null,null,null,null,null,null,null,"",null,null,null,null,null," ",null,{"$f":"IF(AC150=\"\",\"\",MAX($AB$3:AB149)+1)","v":""},"","","",{"$f":"IF(AB150=\"\",\"\",#REF!)","v":""},{"$f":"IF(AD150=\"\",\"\",#REF!)","v":""},"","","","","","","","","","","","","","","","","","","","","",""]
[null,null,null,null,null,null,null,null,null,null,null,null,null,null,null,null,null,null,null,"",null,null,null,null,null," ",null,{"$f":"IF(AC151=\"\",\"\",MAX($AB$3:AB150)+1)","v":""},"","","",{"$f":"IF(AB151=\"\",\"\",#REF!)","v":""},{"$f":"IF(AD151=\"\",\"\",#REF!)","v":""},"","","","","","","","","","","","","","","","","","","","","",""]
[null,null,null,null,null,null,null,null,null,null,null,null,null,null,null,null,null,null,null,"",null,null,null,null,null," ",null,{"$f":"IF(AC152=\"\",\"\",MAX($AB$3:AB151)+1)","v":""},"","","",{"$f":"IF(AB152=\"\",\"\",#REF!)","v":""},{"$f":"IF(AD152=\"\",\"\",#REF!)","v":""},"","","","","","","","","","","","","","","","","","","","","",""]
[null,null,null,null,null,null,null,null,null,null,null,null,null,null,null,null,null,null,null,"",null,null,null,null,null," ",null,{"$f":"IF(AC153=\"\",\"\",MAX($AB$3:AB152)+1)","v":""},"","","",{"$f":"IF(AB153=\"\",\"\",#REF!)","v":""},{"$f":"IF(AD153=\"\",\"\",#REF!)","v":""},"","","","","","","","","","","","","","","","","","","","","",""]
[null,null,null,null,null,null,null,null,null,null,null,null,null,null,null,null,null,null,null,"",null,null,null,null,null," ",null,{"$f":"IF(AC154=\"\",\"\",MAX($AB$3:AB153)+1)","v":""},"","","",{"$f":"IF(AB154=\"\",\"\",#REF!)","v":""},{"$f":"IF(AD154=\"\",\"\",#REF!)","v":""},"","","","","","","","","","","","","","","","","","","","","",""]
[null,null,null,null,null,null,null,null,null,null,null,null,null,null,null,null,null,null,null,"",null,null,null,null,null," ",null,{"$f":"IF(AC155=\"\",\"\",MAX($AB$3:AB154)+1)","v":""},"","","",{"$f":"IF(AB155=\"\",\"\",#REF!)","v":""},{"$f":"IF(AD155=\"\",\"\",#REF!)","v":""},"","","","","","","","","","","","","","","","","","","","","",""]
[null,null,null,null,null,null,null,null,null,null,null,null,null,null,null,null,null,null,null,"",null,null,null,null,null," ",null,{"$f":"IF(AC156=\"\",\"\",MAX($AB$3:AB155)+1)","v":""},"","","",{"$f":"IF(AB156=\"\",\"\",#REF!)","v":""},{"$f":"IF(AD156=\"\",\"\",#REF!)","v":""},"","","","","","","","","","","","","","","","","","","","","",""]
[null,null,null,null,null,null,null,null,null,null,null,null,null,null,null,null,null,null,null,"",null,null,null,null,null," ",null,{"$f":"IF(AC157=\"\",\"\",MAX($AB$3:AB156)+1)","v":""},"","","",{"$f":"IF(AB157=\"\",\"\",#REF!)","v":""},{"$f":"IF(AD157=\"\",\"\",#REF!)","v":""},"","","","","","","","","","","","","","","","","","","","","",""]
[null,null,null,null,null,null,null,null,null,null,null,null,null,null,null,null,null,null,null,"",null,null,null,null,null," ",null,{"$f":"IF(AC158=\"\",\"\",MAX($AB$3:AB157)+1)","v":""},"","","",{"$f":"IF(AB158=\"\",\"\",#REF!)","v":""},{"$f":"IF(AD158=\"\",\"\",#REF!)","v":""},"","","","","","","","","","","","","","","","","","","","","",""]
[null,null,null,null,null,null,null,null,null,null,null,null,null,null,null,null,null,null,null,"",null,null,null,null,null," ",null,{"$f":"IF(AC159=\"\",\"\",MAX($AB$3:AB158)+1)","v":""},"","","",{"$f":"IF(AB159=\"\",\"\",#REF!)","v":""},{"$f":"IF(AD159=\"\",\"\",#REF!)","v":""},"","","","","","","","","","","","","","","","","","","","","",""]
[null,null,null,null,null,null,null,null,null,null,null,null,null,null,null,null,null,null,null,"",null,null,null,null,null," ",null,{"$f":"IF(AC160=\"\",\"\",MAX($AB$3:AB159)+1)","v":""},"","","",{"$f":"IF(AB160=\"\",\"\",#REF!)","v":""},{"$f":"IF(AD160=\"\",\"\",#REF!)","v":""},"","","","","","","","","","","","","","","","","","","","","",""]
[null,null,null,null,null,null,null,null,null,null,null,null,null,null,null,null,null,null,null,"",null,null,null,null,null," ",null,{"$f":"IF(AC161=\"\",\"\",MAX($AB$3:AB160)+1)","v":""},"","","",{"$f":"IF(AB161=\"\",\"\",#REF!)","v":""},{"$f":"IF(AD161=\"\",\"\",#REF!)","v":""},"","","","","","","","","","","","","","","","","","","","","",""]
[null,null,null,null,null,null,null,null,null,null,null,null,null,null,null,null,null,null,null,"",null,null,null,null,null," ",null,{"$f":"IF(AC162=\"\",\"\",MAX($AB$3:AB161)+1)","v":""},"","","",{"$f":"IF(AB162=\"\",\"\",#REF!)","v":""},{"$f":"IF(AD162=\"\",\"\",#REF!)","v":""},"","","","","","","","","","","","","","","","","","","","","",""]
[null,null,null,null,null,null,null,null,null,null,null,null,null,null,null,null,null,null,null,"",null,null,null,null,null," ",null,{"$f":"IF(AC163=\"\",\"\",MAX($AB$3:AB162)+1)","v":""},"","","",{"$f":"IF(AB163=\"\",\"\",#REF!)","v":""},{"$f":"IF(AD163=\"\",\"\",#REF!)","v":""},"","","","","","","","","","","","","","","","","","","","","",""]
[null,null,null,null,null,null,null,null,null,null,null,null,null,null,null,null,null,null,null,"",null,null,null,null,null," ",null,{"$f":"IF(AC164=\"\",\"\",MAX($AB$3:AB163)+1)","v":""},"","","",{"$f":"IF(AB164=\"\",\"\",#REF!)","v":""},{"$f":"IF(AD164=\"\",\"\",#REF!)","v":""},"","","","","","","","","","","","","","","","","","","","","",""]
[null,null,null,null,null,null,null,null,null,null,null,null,null,null,null,null,null,null,null,"",null,null,null,null,null," ",null,{"$f":"IF(AC165=\"\",\"\",MAX($AB$3:AB164)+1)","v":""},"","","",{"$f":"IF(AB165=\"\",\"\",#REF!)","v":""},{"$f":"IF(AD165=\"\",\"\",#REF!)","v":""},"","","","","","","","","","","","","","","","","","","","","",""]
[null,null,null,null,null,null,null,null,null,null,null,null,null,null,null,null,null,null,null,"",null,null,null,null,null," ",null,{"$f":"IF(AC166=\"\",\"\",MAX($AB$3:AB165)+1)","v":""},"","","",{"$f":"IF(AB166=\"\",\"\",#REF!)","v":""},{"$f":"IF(AD166=\"\",\"\",#REF!)","v":""},"","","","","","","","","","","","","","","","","","","","","",""]
[null,null,null,null,null,null,null,null,null,null,null,null,null,null,null,null,null,null,null,"",null,null,null,null,null," ",null,{"$f":"IF(AC167=\"\",\"\",MAX($AB$3:AB166)+1)","v":""},"","","",{"$f":"IF(AB167=\"\",\"\",#REF!)","v":""},{"$f":"IF(AD167=\"\",\"\",#REF!)","v":""},"","","","","","","","","","","","","","","","","","","","","",""]
[null,null,null,null,null,null,null,null,null,null,null,null,null,null,null,null,null,null,null,"",null,null,null,null,null," ",null,{"$f":"IF(AC168=\"\",\"\",MAX($AB$3:AB167)+1)","v":""},"","","",{"$f":"IF(AB168=\"\",\"\",#REF!)","v":""},{"$f":"IF(AD168=\"\",\"\",#REF!)","v":""},"","","","","","","","","","","","","","","","","","","","","",""]
[null,null,null,null,null,null,null,null,null,null,null,null,null,null,null,null,null,null,null,"",null,null,null,null,null," ",null,{"$f":"IF(AC169=\"\",\"\",MAX($AB$3:AB168)+1)","v":""},"","","",{"$f":"IF(AB169=\"\",\"\",#REF!)","v":""},{"$f":"IF(AD169=\"\",\"\",#REF!)","v":""},"","","","","","","","","","","","","","","","","","","","","",""]
[null,null,null,null,null,null,null,null,null,null,null,null,null,null,null,null,null,null,null,"",null,null,null,null,null," ",null,{"$f":"IF(AC170=\"\",\"\",MAX($AB$3:AB169)+1)","v":""},"","","",{"$f":"IF(AB170=\"\",\"\",#REF!)","v":""},{"$f":"IF(AD170=\"\",\"\",#REF!)","v":""},"","","","","","","","","","","","","","","","","","","","","",""]
[null,null,null,null,null,null,null,null,null,null,null,null,null,null,null,null,null,null,null,"",null,null,null,null,null," ",null,{"$f":"IF(AC171=\"\",\"\",MAX($AB$3:AB170)+1)","v":""},"","","",{"$f":"IF(AB171=\"\",\"\",#REF!)","v":""},{"$f":"IF(AD171=\"\",\"\",#REF!)","v":""},"","","","","","","","","","","","","","","","","","","","","",""]
[null,null,null,null,null,null,null,null,null,null,null,null,null,null,null,null,null,null,null,"",null,null,null,null,null," ",null,{"$f":"IF(AC172=\"\",\"\",MAX($AB$3:AB171)+1)","v":""},"","","",{"$f":"IF(AB172=\"\",\"\",#REF!)","v":""},{"$f":"IF(AD172=\"\",\"\",#REF!)","v":""},"","","","","","","","","","","","","","","","","","","","","",""]
[null,null,null,null,null,null,null,null,null,null,null,null,null,null,null,null,null,null,null,"",null,null,null,null,null," ",null,{"$f":"IF(AC173=\"\",\"\",MAX($AB$3:AB172)+1)","v":""},"","","",{"$f":"IF(AB173=\"\",\"\",#REF!)","v":""},{"$f":"IF(AD173=\"\",\"\",#REF!)","v":""},"","","","","","","","","","","","","","","","","","","","","",""]
[null,null,null,null,null,null,null,null,null,null,null,null,null,null,null,null,null,null,null,"",null,null,null,null,null," ",null,{"$f":"IF(AC174=\"\",\"\",MAX($AB$3:AB173)+1)","v":""},"","","",{"$f":"IF(AB174=\"\",\"\",#REF!)","v":""},{"$f":"IF(AD174=\"\",\"\",#REF!)","v":""},"","","","","","","","","","","","","","","","","","","","","",""]
[null,null,null,null,null,null,null,null,null,null,null,null,null,null,null,null,null,null,null,"",null,null,null,null,null," ",null,{"$f":"IF(AC175=\"\",\"\",MAX($AB$3:AB174)+1)","v":""},"","","",{"$f":"IF(AB175=\"\",\"\",#REF!)","v":""},{"$f":"IF(AD175=\"\",\"\",#REF!)","v":""},"","","","","","","","","","","","","","","","","","","","","",""]
[null,null,null,null,null,null,null,null,null,null,null,null,null,null,null,null,null,null,null,"",null,null,null,null,null," ",null,{"$f":"IF(AC176=\"\",\"\",MAX($AB$3:AB175)+1)","v":""},"","","",{"$f":"IF(AB176=\"\",\"\",#REF!)","v":""},{"$f":"IF(AD176=\"\",\"\",#REF!)","v":""},"","","","","","","","","","","","","","","","","","","","","",""]
[null,null,null,null,null,null,null,null,null,null,null,null,null,null,null,null,null,null,null,"",null,null,null,null,null," ",null,{"$f":"IF(AC177=\"\",\"\",MAX($AB$3:AB176)+1)","v":""},"","","",{"$f":"IF(AB177=\"\",\"\",#REF!)","v":""},{"$f":"IF(AD177=\"\",\"\",#REF!)","v":""},"","","","","","","","","","","","","","","","","","","","","",""]
[null,null,null,null,null,null,null,null,null,null,null,null,null,null,null,null,null,null,null,"",null,null,null,null,null," ",null,{"$f":"IF(AC178=\"\",\"\",MAX($AB$3:AB177)+1)","v":""},"","","",{"$f":"IF(AB178=\"\",\"\",#REF!)","v":""},{"$f":"IF(AD178=\"\",\"\",#REF!)","v":""},"","","","","","","","","","","","","","","","","","","","","",""]
[null,null,null,null,null,null,null,null,null,null,null,null,null,null,null,null,null,null,null,"",null,null,null,null,null," ",null,{"$f":"IF(AC179=\"\",\"\",MAX($AB$3:AB178)+1)","v":""},"","","",{"$f":"IF(AB179=\"\",\"\",#REF!)","v":""},{"$f":"IF(AD179=\"\",\"\",#REF!)","v":""},"","","","","","","","","","","","","","","","","","","","","",""]
[null,null,null,null,null,null,null,null,null,null,null,null,null,null,null,null,null,null,null,"",null,null,null,null,null," ",null,{"$f":"IF(AC180=\"\",\"\",MAX($AB$3:AB179)+1)","v":""},"","","",{"$f":"IF(AB180=\"\",\"\",#REF!)","v":""},{"$f":"IF(AD180=\"\",\"\",#REF!)","v":""},"","","","","","","","","","","","","","","","","","","","","",""]
[null,null,null,null,null,null,null,null,null,null,null,null,null,null,null,null,null,null,null,"",null,null,null,null,null," ",null,{"$f":"IF(AC181=\"\",\"\",MAX($AB$3:AB180)+1)","v":""},"","","",{"$f":"IF(AB181=\"\",\"\",#REF!)","v":""},{"$f":"IF(AD181=\"\",\"\",#REF!)","v":""},"","","","","","","","","","","","","","","","","","","","","",""]
[null,null,null,null,null,null,null,null,null,null,null,null,null,null,null,null,null,null,null,"",null,null,null,null,null," ",null,{"$f":"IF(AC182=\"\",\"\",MAX($AB$3:AB181)+1)","v":""},"","","",{"$f":"IF(AB182=\"\",\"\",#REF!)","v":""},{"$f":"IF(AD182=\"\",\"\",#REF!)","v":""},"","","","","","","","","","","","","","","","","","","","","",""]
[null,null,null,null,null,null,null,null,null,null,null,null,null,null,null,null,null,null,null,"",null,null,null,null,null," ",null,{"$f":"IF(AC183=\"\",\"\",MAX($AB$3:AB182)+1)","v":""},"","","",{"$f":"IF(AB183=\"\",\"\",#REF!)","v":""},{"$f":"IF(AD183=\"\",\"\",#REF!)","v":""},"","","","","","","","","","","","","","","","","","","","","",""]
[null,null,null,null,null,null,null,null,null,null,null,null,null,null,null,null,null,null,null,"",null,null,null,null,null," ",null,{"$f":"IF(AC184=\"\",\"\",MAX($AB$3:AB183)+1)","v":""},"","","",{"$f":"IF(AB184=\"\",\"\",#REF!)","v":""},{"$f":"IF(AD184=\"\",\"\",#REF!)","v":""},"","","","","","","","","","","","","","","","","","","","","",""]
[null,null,null,null,null,null,null,null,null,null,null,null,null,null,null,null,null,null,null,"",null,null,null,null,null," ",null,{"$f":"IF(AC185=\"\",\"\",MAX($AB$3:AB184)+1)","v":""},"","","",{"$f":"IF(AB185=\"\",\"\",#REF!)","v":""},{"$f":"IF(AD185=\"\",\"\",#REF!)","v":""},"","","","","","","","","","","","","","","","","","","","","",""]
[null,null,null,null,null,null,null,null,null,null,null,null,null,null,null,null,null,null,null,"",null,null,null,null,null," ",null,{"$f":"IF(AC186=\"\",\"\",MAX($AB$3:AB185)+1)","v":""},"","","",{"$f":"IF(AB186=\"\",\"\",#REF!)","v":""},{"$f":"IF(AD186=\"\",\"\",#REF!)","v":""},"","","","","","","","","","","","","","","","","","","","","",""]
[null,null,null,null,null,null,null,null,null,null,null,null,null,null,null,null,null,null,null,"",null,null,null,null,null," ",null,{"$f":"IF(AC187=\"\",\"\",MAX($AB$3:AB186)+1)","v":""},"","","",{"$f":"IF(AB187=\"\",\"\",#REF!)","v":""},{"$f":"IF(AD187=\"\",\"\",#REF!)","v":""},"","","","","","","","","","","","","","","","","","","","","",""]
[null,null,null,null,null,null,null,null,null,null,null,null,null,null,null,null,null,null,null,"",null,null,null,null,null," ",null,{"$f":"IF(AC188=\"\",\"\",MAX($AB$3:AB187)+1)","v":""},"","","",{"$f":"IF(AB188=\"\",\"\",#REF!)","v":""},{"$f":"IF(AD188=\"\",\"\",#REF!)","v":""},"","","","","","","","","","","","","","","","","","","","","",""]
[null,null,null,null,null,null,null,null,null,null,null,null,null,null,null,null,null,null,null,"",null,null,null,null,null," ",null,{"$f":"IF(AC189=\"\",\"\",MAX($AB$3:AB188)+1)","v":""},"","","",{"$f":"IF(AB189=\"\",\"\",#REF!)","v":""},{"$f":"IF(AD189=\"\",\"\",#REF!)","v":""},"","","","","","","","","","","","","","","","","","","","","",""]
[null,null,null,null,null,null,null,null,null,null,null,null,null,null,null,null,null,null,null,"",null,null,null,null,null," ",null,{"$f":"IF(AC190=\"\",\"\",MAX($AB$3:AB189)+1)","v":""},"","","",{"$f":"IF(AB190=\"\",\"\",#REF!)","v":""},{"$f":"IF(AD190=\"\",\"\",#REF!)","v":""},"","","","","","","","","","","","","","","","","","","","","",""]
[null,null,null,null,null,null,null,null,null,null,null,null,null,null,null,null,null,null,null,"",null,null,null,null,null," ",null,{"$f":"IF(AC191=\"\",\"\",MAX($AB$3:AB190)+1)","v":""},"","","",{"$f":"IF(AB191=\"\",\"\",#REF!)","v":""},{"$f":"IF(AD191=\"\",\"\",#REF!)","v":""},"","","","","","","","","","","","","","","","","","","","","",""]
[null,null,null,null,null,null,null,null,null,null,null,null,null,null,null,null,null,null,null,"",null,null,null,null,null," ",null,{"$f":"IF(AC192=\"\",\"\",MAX($AB$3:AB191)+1)","v":""},"","","",{"$f":"IF(AB192=\"\",\"\",#REF!)","v":""},{"$f":"IF(AD192=\"\",\"\",#REF!)","v":""},"","","","","","","","","","","","","","","","","","","","","",""]
[null,null,null,null,null,null,null,null,null,null,null,null,null,null,null,null,null,null,null,"",null,null,null,null,null," ",null,{"$f":"IF(AC193=\"\",\"\",MAX($AB$3:AB192)+1)","v":""},"","","",{"$f":"IF(AB193=\"\",\"\",#REF!)","v":""},{"$f":"IF(AD193=\"\",\"\",#REF!)","v":""},"","","","","","","","","","","","","","","","","","","","","",""]
[null,null,null,null,null,null,null,null,null,null,null,null,null,null,null,null,null,null,null,"",null,null,null,null,null," ",null,{"$f":"IF(AC194=\"\",\"\",MAX($AB$3:AB193)+1)","v":""},"","","",{"$f":"IF(AB194=\"\",\"\",#REF!)","v":""},{"$f":"IF(AD194=\"\",\"\",#REF!)","v":""},"","","","","","","","","","","","","","","","","","","","","",""]
[null,null,null,null,null,null,null,null,null,null,null,null,null,null,null,null,null,null,null,"",null,null,null,null,null," ",null,{"$f":"IF(AC195=\"\",\"\",MAX($AB$3:AB194)+1)","v":""},"","","",{"$f":"IF(AB195=\"\",\"\",#REF!)","v":""},{"$f":"IF(AD195=\"\",\"\",#REF!)","v":""},"","","","","","","","","","","","","","","","","","","","","",""]
[null,null,null,null,null,null,null,null,null,null,null,null,null,null,null,null,null,null,null,"",null,null,null,null,null," ",null,{"$f":"IF(AC196=\"\",\"\",MAX($AB$3:AB195)+1)","v":""},"","","",{"$f":"IF(AB196=\"\",\"\",#REF!)","v":""},{"$f":"IF(AD196=\"\",\"\",#REF!)","v":""},"","","","","","","","","","","","","","","","","","","","","",""]
[null,null,null,null,null,null,null,null,null,null,null,null,null,null,null,null,null,null,null,"",null,null,null,null,null," ",null,{"$f":"IF(AC197=\"\",\"\",MAX($AB$3:AB196)+1)","v":""},"","","",{"$f":"IF(AB197=\"\",\"\",#REF!)","v":""},{"$f":"IF(AD197=\"\",\"\",#REF!)","v":""},"","","","","","","","","","","","","","","","","","","","","",""]
[null,null,null,null,null,null,null,null,null,null,null,null,null,null,null,null,null,null,null,"",null,null,null,null,null," ",null,{"$f":"IF(AC198=\"\",\"\",MAX($AB$3:AB197)+1)","v":""},"","","",{"$f":"IF(AB198=\"\",\"\",#REF!)","v":""},{"$f":"IF(AD198=\"\",\"\",#REF!)","v":""},"","","","","","","","","","","","","","","","","","","","","",""]
[null,null,null,null,null,null,null,null,null,null,null,null,null,null,null,null,null,null,null,"",null,null,null,null,null," ",null,{"$f":"IF(AC199=\"\",\"\",MAX($AB$3:AB198)+1)","v":""},"","","",{"$f":"IF(AB199=\"\",\"\",#REF!)","v":""},{"$f":"IF(AD199=\"\",\"\",#REF!)","v":""},"","","","","","","","","","","","","","","","","","","","","",""]
[null,null,null,null,null,null,null,null,null,null,null,null,null,null,null,null,null,null,null,"",null,null,null,null,null," ",null,{"$f":"IF(AC200=\"\",\"\",MAX($AB$3:AB199)+1)","v":""},"","","",{"$f":"IF(AB200=\"\",\"\",#REF!)","v":""},{"$f":"IF(AD200=\"\",\"\",#REF!)","v":""},"","","","","","","","","","","","","","","","","","","","","",""]
[null,null,null,null,null,null,null,null,null,null,null,null,null,null,null,null,null,null,null,"",null,null,null,null,null," ",null,{"$f":"IF(AC201=\"\",\"\",MAX($AB$3:AB200)+1)","v":""},"","","",{"$f":"IF(AB201=\"\",\"\",#REF!)","v":""},{"$f":"IF(AD201=\"\",\"\",#REF!)","v":""},"","","","","","","","","","","","","","","","","","","","","",""]
[null,null,null,null,null,null,null,null,null,null,null,null,null,null,null,null,null,null,null,"",null,null,null,null,null," ",null,{"$f":"IF(AC202=\"\",\"\",MAX($AB$3:AB201)+1)","v":""},"","","",{"$f":"IF(AB202=\"\",\"\",#REF!)","v":""},{"$f":"IF(AD202=\"\",\"\",#REF!)","v":""},"","","","","","","","","","","","","","","","","","","","","",""]
[null,null,null,null,null,null,null,null,null,null,null,null,null,null,null,null,null,null,null,"",null,null,null,null,null," ",null,{"$f":"IF(AC203=\"\",\"\",MAX($AB$3:AB202)+1)","v":""},"","","",{"$f":"IF(AB203=\"\",\"\",#REF!)","v":""},{"$f":"IF(AD203=\"\",\"\",#REF!)","v":""},"","","","","","","","","","","","","","","","","","","","","",""]
[null,null,null,null,null,null,null,null,null,null,null,null,null,null,null,null,null,null,null,"",null,null,null,null,null," ",null,{"$f":"IF(AC204=\"\",\"\",MAX($AB$3:AB203)+1)","v":""},"","","",{"$f":"IF(AB204=\"\",\"\",#REF!)","v":""},{"$f":"IF(AD204=\"\",\"\",#REF!)","v":""},"","","","","","","","","","","","","","","","","","","","","",""]
[null,null,null,null,null,null,null,null,null,null,null,null,null,null,null,null,null,null,null,"",null,null,null,null,null," ",null,{"$f":"IF(AC205=\"\",\"\",MAX($AB$3:AB204)+1)","v":""},"","","",{"$f":"IF(AB205=\"\",\"\",#REF!)","v":""},{"$f":"IF(AD205=\"\",\"\",#REF!)","v":""},"","","","","","","","","","","","","","","","","","","","","",""]
[null,null,null,null,null,null,null,null,null,null,null,null,null,null,null,null,null,null,null,"",null,null,null,null,null," ",null,{"$f":"IF(AC206=\"\",\"\",MAX($AB$3:AB205)+1)","v":""},"","","",{"$f":"IF(AB206=\"\",\"\",#REF!)","v":""},{"$f":"IF(AD206=\"\",\"\",#REF!)","v":""},"","","","","","","","","","","","","","","","","","","","","",""]
[null,null,null,null,null,null,null,null,null,null,null,null,null,null,null,null,null,null,null,"",null,null,null,null,null," ",null,{"$f":"IF(AC207=\"\",\"\",MAX($AB$3:AB206)+1)","v":""},"","","",{"$f":"IF(AB207=\"\",\"\",#REF!)","v":""},{"$f":"IF(AD207=\"\",\"\",#REF!)","v":""},"","","","","","","","","","","","","","","","","","","","","",""]
[null,null,null,null,null,null,null,null,null,null,null,null,null,null,null,null,null,null,null,"",null,null,null,null,null," ",null,{"$f":"IF(AC208=\"\",\"\",MAX($AB$3:AB207)+1)","v":""},"","","",{"$f":"IF(AB208=\"\",\"\",#REF!)","v":""},{"$f":"IF(AD208=\"\",\"\",#REF!)","v":""},"","","","","","","","","","","","","","","","","","","","","",""]
[null,null,null,null,null,null,null,null,null,null,null,null,null,null,null,null,null,null,null,"",null,null,null,null,null," ",null,{"$f":"IF(AC209=\"\",\"\",MAX($AB$3:AB208)+1)","v":""},{"$f":"IF(C209=\"\",\"\",IF(B209=$AB$1,C209,\"\"))","v":""},{"$f":"IF(AB209=\"\",\"\",B209)","v":""},{"$f":"IF(AB209=\"\",\"\",E209)","v":""},{"$f":"IF(AB209=\"\",\"\",#REF!)","v":""},{"$f":"IF(AD209=\"\",\"\",#REF!)","v":""},{"$f":"IF(AD209=\"\",\"\",U209)","v":""},{"$f":"IF(AD209=\"\",\"\",V209)","v":""},{"$f":"IF(AD209=\"\",\"\",W209)","v":""},{"$f":"IF(AH209=\"\",\"\",X209)","v":""},{"$f":"IF(AI209=\"\",\"\",Y209)","v":""},{"$f":"IF(AE209=\"\",\"\",D209)","v":""},{"$f":"IF(AE209=\"\",\"\",X209)","v":""},{"$f":"IF(AE209=\"\",\"\",Y209)","v":""},{"$f":"IF(AD209=\"\",\"\",F209)","v":""},{"$f":"IF(AE209=\"\",\"\",G209)","v":""},{"$f":"IF(AD209=\"\",\"\",H209)","v":""},{"$f":"IF(AD209=\"\",\"\",I209)","v":""},{"$f":"IF(AH209=\"\",\"\",J209)","v":""},{"$f":"IF(AI209=\"\",\"\",K209)","v":""},{"$f":"IF(AJ209=\"\",\"\",L209)","v":""},{"$f":"IF(AK209=\"\",\"\",M209)","v":""},{"$f":"IF(AL209=\"\",\"\",N209)","v":""},{"$f":"IF(AM209=\"\",\"\",O209)","v":""},{"$f":"IF(AN209=\"\",\"\",P209)","v":""},{"$f":"IF(AO209=\"\",\"\",Q209)","v":""},{"$f":"IF(AP209=\"\",\"\",R209)","v":""},{"$f":"IF(AQ209=\"\",\"\",S209)","v":""}]
[null,null,null,null,null,null,null,null,null,null,null,null,null,null,null,null,null,null,null,{"$f":"IF(AND(C210=\"\",B210=\"\"),\"\",B210+1095)","v":""},null,null,null,null,null," ",null,{"$f":"IF(AC210=\"\",\"\",MAX($AB$3:AB209)+1)","v":""},"","","",{"$f":"IF(AB210=\"\",\"\",#REF!)","v":""},{"$f":"IF(AD210=\"\",\"\",#REF!)","v":""},"","","","","","","","","","","","","","","","","","","","","",""]
[null,null,null,null,null,null,null,null,null,null,null,null,null,null,null,null,null,null,null,"",null,null,null,null,null," ",null,{"$f":"IF(AC211=\"\",\"\",MAX($AB$3:AB210)+1)","v":""},"","","",{"$f":"IF(AB211=\"\",\"\",#REF!)","v":""},{"$f":"IF(AD211=\"\",\"\",#REF!)","v":""},"","","","","","","","","","","","","","","","","","","","","",""]
[null,null,null,null,null,null,null,null,null,null,null,null,null,null,null,null,null,null,null,"",null,null,null,null,null," ",null,{"$f":"IF(AC212=\"\",\"\",MAX($AB$3:AB211)+1)","v":""},"","","",{"$f":"IF(AB212=\"\",\"\",#REF!)","v":""},{"$f":"IF(AD212=\"\",\"\",#REF!)","v":""},"","","","","","","","","","","","","","","","","","","","","",""]
[null,null,null,null,null,null,null,null,null,null,null,null,null,null,null,null,null,null,null,"",null,null,null,null,null," ",null,{"$f":"IF(AC213=\"\",\"\",MAX($AB$3:AB212)+1)","v":""},"","","",{"$f":"IF(AB213=\"\",\"\",#REF!)","v":""},{"$f":"IF(AD213=\"\",\"\",#REF!)","v":""},"","","","","","","","","","","","","","","","","","","","","",""]
[null,null,null,null,null,null,null,null,null,null,null,null,null,null,null,null,null,null,null,"",null,null,null,null,null," ",null,{"$f":"IF(AC214=\"\",\"\",MAX($AB$3:AB213)+1)","v":""},"","","",{"$f":"IF(AB214=\"\",\"\",#REF!)","v":""},{"$f":"IF(AD214=\"\",\"\",#REF!)","v":""},"","","","","","","","","","","","","","","","","","","","","",""]
[null,null,null,null,null,null,null,null,null,null,null,null,null,null,null,null,null,null,null,"",null,null,null,null,null," ",null,{"$f":"IF(AC215=\"\",\"\",MAX($AB$3:AB214)+1)","v":""},"","","",{"$f":"IF(AB215=\"\",\"\",#REF!)","v":""},{"$f":"IF(AD215=\"\",\"\",#REF!)","v":""},"","","","","","","","","","","","","","","","","","","","","",""]
[null,null,null,null,null,null,null,null,null,null,null,null,null,null,null,null,null,null,null,"",null,null,null,null,null," ",null,{"$f":"IF(AC216=\"\",\"\",MAX($AB$3:AB215)+1)","v":""},"","","",{"$f":"IF(AB216=\"\",\"\",#REF!)","v":""},{"$f":"IF(AD216=\"\",\"\",#REF!)","v":""},"","","","","","","","","","","","","","","","","","","","","",""]
[null,null,null,null,null,null,null,null,null,null,null,null,null,null,null,null,null,null,null,"",null,null,null,null,null," ",null,{"$f":"IF(AC217=\"\",\"\",MAX($AB$3:AB216)+1)","v":""},"","","",{"$f":"IF(AB217=\"\",\"\",#REF!)","v":""},{"$f":"IF(AD217=\"\",\"\",#REF!)","v":""},"","","","","","","","","","","","","","","","","","","","","",""]
[null,null,null,null,null,null,null,null,null,null,null,null,null,null,null,null,null,null,null,"",null,null,null,null,null," ",null,{"$f":"IF(AC218=\"\",\"\",MAX($AB$3:AB217)+1)","v":""},"","","",{"$f":"IF(AB218=\"\",\"\",#REF!)","v":""},{"$f":"IF(AD218=\"\",\"\",#REF!)","v":""},"","","","","","","","","","","","","","","","","","","","","",""]
[null,null,null,null,null,null,null,null,null,null,null,null,null,null,null,null,null,null,null,"",null,null,null,null,null," ",null,{"$f":"IF(AC219=\"\",\"\",MAX($AB$3:AB218)+1)","v":""},"","","",{"$f":"IF(AB219=\"\",\"\",#REF!)","v":""},{"$f":"IF(AD219=\"\",\"\",#REF!)","v":""},"","","","","","","","","","","","","","","","","","","","","",""]
[null,null,null,null,null,null,null,null,null,null,null,null,null,null,null,null,null,null,null,"",null,null,null,null,null," ",null,{"$f":"IF(AC220=\"\",\"\",MAX($AB$3:AB219)+1)","v":""},"","","",{"$f":"IF(AB220=\"\",\"\",#REF!)","v":""},{"$f":"IF(AD220=\"\",\"\",#REF!)","v":""},"","","","","","","","","","","","","","","","","","","","","",""]
[null,null,null,null,null,null,null,null,null,null,null,null,null,null,null,null,null,null,null,"",null,null,null,null,null," ",null,{"$f":"IF(AC221=\"\",\"\",MAX($AB$3:AB220)+1)","v":""},"","","",{"$f":"IF(AB221=\"\",\"\",#REF!)","v":""},{"$f":"IF(AD221=\"\",\"\",#REF!)","v":""},"","","","","","","","","","","","","","","","","","","","","",""]
[null,null,null,null,null,null,null,null,null,null,null,null,null,null,null,null,null,null,null,"",null,null,null,null,null," ",null,{"$f":"IF(AC222=\"\",\"\",MAX($AB$3:AB221)+1)","v":""},"","","",{"$f":"IF(AB222=\"\",\"\",#REF!)","v":""},{"$f":"IF(AD222=\"\",\"\",#REF!)","v":""},"","","","","","","","","","","","","","","","","","","","","",""]
[null,null,null,null,null,null,null,null,null,null,null,null,null,null,null,null,null,null,null,"",null,null,null,null,null," ",null,{"$f":"IF(AC223=\"\",\"\",MAX($AB$3:AB222)+1)","v":""},"","","",{"$f":"IF(AB223=\"\",\"\",#REF!)","v":""},{"$f":"IF(AD223=\"\",\"\",#REF!)","v":""},"","","","","","","","","","","","","","","","","","","","","",""]
[null,null,null,null,null,null,null,null,null,null,null,null,null,null,null,null,null,null,null,"",null,null,null,null,null," ",null,{"$f":"IF(AC224=\"\",\"\",MAX($AB$3:AB223)+1)","v":""},"","","",{"$f":"IF(AB224=\"\",\"\",#REF!)","v":""},{"$f":"IF(AD224=\"\",\"\",#REF!)","v":""},"","","","","","","","","","","","","","","","","","","","","",""]
[null,null,null,null,null,null,null,null,null,null,null,null,null,null,null,null,null,null,null,"",null,null,null,null,null," ",null,{"$f":"IF(AC225=\"\",\"\",MAX($AB$3:AB224)+1)","v":""},"","","",{"$f":"IF(AB225=\"\",\"\",#REF!)","v":""},{"$f":"IF(AD225=\"\",\"\",#REF!)","v":""},"","","","","","","","","","","","","","","","","","","","","",""]
[null,null,null,null,null,null,null,null,null,null,null,null,null,null,null,null,null,null,null,"",null,null,null,null,null," ",null,{"$f":"IF(AC226=\"\",\"\",MAX($AB$3:AB225)+1)","v":""},"","","",{"$f":"IF(AB226=\"\",\"\",#REF!)","v":""},{"$f":"IF(AD226=\"\",\"\",#REF!)","v":""},"","","","","","","","","","","","","","","","","","","","","",""]
[null,null,null,null,null,null,null,null,null,null,null,null,null,null,null,null,null,null,null,"",null,null,null,null,null," ",null,{"$f":"IF(AC227=\"\",\"\",MAX($AB$3:AB226)+1)","v":""},"","","",{"$f":"IF(AB227=\"\",\"\",#REF!)","v":""},{"$f":"IF(AD227=\"\",\"\",#REF!)","v":""},"","","","","","","","","","","","","","","","","","","","","",""]
[null,null,null,null,null,null,null,null,null,null,null,null,null,null,null,null,null,null,null,"",null,null,null,null,null," ",null,{"$f":"IF(AC228=\"\",\"\",MAX($AB$3:AB227)+1)","v":""},"","","",{"$f":"IF(AB228=\"\",\"\",#REF!)","v":""},{"$f":"IF(AD228=\"\",\"\",#REF!)","v":""},"","","","","","","","","","","","","","","","","","","","","",""]
[null,null,null,null,null,null,null,null,null,null,null,null,null,null,null,null,null,null,null,"",null,null,null,null,null," ",null,{"$f":"IF(AC229=\"\",\"\",MAX($AB$3:AB228)+1)","v":""},"","","",{"$f":"IF(AB229=\"\",\"\",#REF!)","v":""},{"$f":"IF(AD229=\"\",\"\",#REF!)","v":""},"","","","","","","","","","","","","","","","","","","","","",""]
[null,null,null,null,null,null,null,null,null,null,null,null,null,null,null,null,null,null,null,"",null,null,null,null,null," ",null,{"$f":"IF(AC230=\"\",\"\",MAX($AB$3:AB229)+1)","v":""},"","","",{"$f":"IF(AB230=\"\",\"\",#REF!)","v":""},{"$f":"IF(AD230=\"\",\"\",#REF!)","v":""},"","","","","","","","","","","","","","","","","","","","","",""]
[null,null,null,null,null,null,null,null,null,null,null,null,null,null,null,null,null,null,null,"",null,null,null,null,null," ",null,{"$f":"IF(AC231=\"\",\"\",MAX($AB$3:AB230)+1)","v":""},"","","",{"$f":"IF(AB231=\"\",\"\",#REF!)","v":""},{"$f":"IF(AD231=\"\",\"\",#REF!)","v":""},"","","","","","","","","","","","","","","","","","","","","",""]
[null,null,null,null,null,null,null,null,null,null,null,null,null,null,null,null,null,null,null,"",null,null,null,null,null," ",null,{"$f":"IF(AC232=\"\",\"\",MAX($AB$3:AB231)+1)","v":""},"","","",{"$f":"IF(AB232=\"\",\"\",#REF!)","v":""},{"$f":"IF(AD232=\"\",\"\",#REF!)","v":""},"","","","","","","","","","","","","","","","","","","","","",""]
[null,null,null,null,null,null,null,null,null,null,null,null,null,null,null,null,null,null,null,"",null,null,null,null,null," ",null,{"$f":"IF(AC233=\"\",\"\",MAX($AB$3:AB232)+1)","v":""},"","","",{"$f":"IF(AB233=\"\",\"\",#REF!)","v":""},{"$f":"IF(AD233=\"\",\"\",#REF!)","v":""},"","","","","","","","","","","","","","","","","","","","","",""]
[null,null,null,null,null,null,null,null,null,null,null,null,null,null,null,null,null,null,null,"",null,null,null,null,null," ",null,{"$f":"IF(AC234=\"\",\"\",MAX($AB$3:AB233)+1)","v":""},"","","",{"$f":"IF(AB234=\"\",\"\",#REF!)","v":""},{"$f":"IF(AD234=\"\",\"\",#REF!)","v":""},"","","","","","","","","","","","","","","","","","","","","",""]
[null,null,null,null,null,null,null,null,null,null,null,null,null,null,null,null,null,null,null,"",null,null,null,null,null," ",null,{"$f":"IF(AC235=\"\",\"\",MAX($AB$3:AB234)+1)","v":""},"","","",{"$f":"IF(AB235=\"\",\"\",#REF!)","v":""},{"$f":"IF(AD235=\"\",\"\",#REF!)","v":""},"","","","","","","","","","","","","","","","","","","","","",""]
[null,null,null,null,null,null,null,null,null,null,null,null,null,null,null,null,null,null,null,"",null,null,null,null,null," ",null,{"$f":"IF(AC236=\"\",\"\",MAX($AB$3:AB235)+1)","v":""},"","","",{"$f":"IF(AB236=\"\",\"\",#REF!)","v":""},{"$f":"IF(AD236=\"\",\"\",#REF!)","v":""},"","","","","","","","","","","","","","","","","","","","","",""]
[null,null,null,null,null,null,null,null,null,null,null,null,null,null,null,null,null,null,null,"",null,null,null,null,null," ",null,{"$f":"IF(AC237=\"\",\"\",MAX($AB$3:AB236)+1)","v":""},"","","",{"$f":"IF(AB237=\"\",\"\",#REF!)","v":""},{"$f":"IF(AD237=\"\",\"\",#REF!)","v":""},"","","","","","","","","","","","","","","","","","","","","",""]
[null,null,null,null,null,null,null,null,null,null,null,null,null,null,null,null,null,null,null,"",null,null,null,null,null," ",null,{"$f":"IF(AC238=\"\",\"\",MAX($AB$3:AB237)+1)","v":""},"","","",{"$f":"IF(AB238=\"\",\"\",#REF!)","v":""},{"$f":"IF(AD238=\"\",\"\",#REF!)","v":""},"","","","","","","","","","","","","","","","","","","","","",""]
[null,null,null,null,null,null,null,null,null,null,null,null,null,null,null,null,null,null,null,"",null,null,null,null,null," ",null,{"$f":"IF(AC239=\"\",\"\",MAX($AB$3:AB238)+1)","v":""},"","","",{"$f":"IF(AB239=\"\",\"\",#REF!)","v":""},{"$f":"IF(AD239=\"\",\"\",#REF!)","v":""},"","","","","","","","","","","","","","","","","","","","","",""]
[null,null,null,null,null,null,null,null,null,null,null,null,null,null,null,null,null,null,null,"",null,null,null,null,null," ",null,{"$f":"IF(AC240=\"\",\"\",MAX($AB$3:AB239)+1)","v":""},"","","",{"$f":"IF(AB240=\"\",\"\",#REF!)","v":""},{"$f":"IF(AD240=\"\",\"\",#REF!)","v":""},"","","","","","","","","","","","","","","","","","","","","",""]
[null,null,null,null,null,null,null,null,null,null,null,null,null,null,null,null,null,null,null,"",null,null,null,null,null," ",null,{"$f":"IF(AC241=\"\",\"\",MAX($AB$3:AB240)+1)","v":""},"","","",{"$f":"IF(AB241=\"\",\"\",#REF!)","v":""},{"$f":"IF(AD241=\"\",\"\",#REF!)","v":""},"","","","","","","","","","","","","","","","","","","","","",""]
[null,null,null,null,null,null,null,null,null,null,null,null,null,null,null,null,null,null,null,"",null,null,null,null,null," ",null,{"$f":"IF(AC242=\"\",\"\",MAX($AB$3:AB241)+1)","v":""},"","","",{"$f":"IF(AB242=\"\",\"\",#REF!)","v":""},{"$f":"IF(AD242=\"\",\"\",#REF!)","v":""},"","","","","","","","","","","","","","","","","","","","","",""]
[null,null,null,null,null,null,null,null,null,null,null,null,null,null,null,null,null,null,null,"",null,null,null,null,null," ",null,{"$f":"IF(AC243=\"\",\"\",MAX($AB$3:AB242)+1)","v":""},"","","",{"$f":"IF(AB243=\"\",\"\",#REF!)","v":""},{"$f":"IF(AD243=\"\",\"\",#REF!)","v":""},"","","","","","","","","","","","","","","","","","","","","",""]
[null,null,null,null,null,null,null,null,null,null,null,null,null,null,null,null,null,null,null,"",null,null,null,null,null," ",null,{"$f":"IF(AC244=\"\",\"\",MAX($AB$3:AB243)+1)","v":""},"","","",{"$f":"IF(AB244=\"\",\"\",#REF!)","v":""},{"$f":"IF(AD244=\"\",\"\",#REF!)","v":""},"","","","","","","","","","","","","","","","","","","","","",""]
[null,null,null,null,null,null,null,null,null,null,null,null,null,null,null,null,null,null,null,"",null,null,null,null,null," ",null,{"$f":"IF(AC245=\"\",\"\",MAX($AB$3:AB244)+1)","v":""},"","","",{"$f":"IF(AB245=\"\",\"\",#REF!)","v":""},{"$f":"IF(AD245=\"\",\"\",#REF!)","v":""},"","","","","","","","","","","","","","","","","","","","","",""]
[null,null,null,null,null,null,null,null,null,null,null,null,null,null,null,null,null,null,null,"",null,null,null,null,null," ",null,{"$f":"IF(AC246=\"\",\"\",MAX($AB$3:AB245)+1)","v":""},"","","",{"$f":"IF(AB246=\"\",\"\",#REF!)","v":""},{"$f":"IF(AD246=\"\",\"\",#REF!)","v":""},"","","","","","","","","","","","","","","","","","","","","",""]
[null,null,null,null,null,null,null,null,null,null,null,null,null,null,null,null,null,null,null,"",null,null,null,null,null," ",null,{"$f":"IF(AC247=\"\",\"\",MAX($AB$3:AB246)+1)","v":""},"","","",{"$f":"IF(AB247=\"\",\"\",#REF!)","v":""},{"$f":"IF(AD247=\"\",\"\",#REF!)","v":""},"","","","","","","","","","","","","","","","","","","","","",""]
[null,null,null,null,null,null,null,null,null,null,null,null,null,null,null,null,null,null,null,"",null,null,null,null,null," ",null,{"$f":"IF(AC248=\"\",\"\",MAX($AB$3:AB247)+1)","v":""},"","","",{"$f":"IF(AB248=\"\",\"\",#REF!)","v":""},{"$f":"IF(AD248=\"\",\"\",#REF!)","v":""},"","","","","","","","","","","","","","","","","","","","","",""]
[null,null,null,null,null,null,null,null,null,null,null,null,null,null,null,null,null,null,null,"",null,null,null,null,null," ",null,{"$f":"IF(AC249=\"\",\"\",MAX($AB$3:AB248)+1)","v":""},"","","",{"$f":"IF(AB249=\"\",\"\",#REF!)","v":""},{"$f":"IF(AD249=\"\",\"\",#REF!)","v":""},"","","","","","","","","","","","","","","","","","","","","",""]
[null,null,null,null,null,null,null,null,null,null,null,null,null,null,null,null,null,null,null,"",null,null,null,null,null," ",null,{"$f":"IF(AC250=\"\",\"\",MAX($AB$3:AB249)+1)","v":""},"","","",{"$f":"IF(AB250=\"\",\"\",#REF!)","v":""},{"$f":"IF(AD250=\"\",\"\",#REF!)","v":""},"","","","","","","","","","","","","","","","","","","","","",""]
[null,null,null,null,null,null,null,null,null,null,null,null,null,null,null,null,null,null,null,"",null,null,null,null,null," ",null,{"$f":"IF(AC251=\"\",\"\",MAX($AB$3:AB250)+1)","v":""},"","","",{"$f":"IF(AB251=\"\",\"\",#REF!)","v":""},{"$f":"IF(AD251=\"\",\"\",#REF!)","v":""},"","","","","","","","","","","","","","","","","","","","","",""]
[null,null,null,null,null,null,null,null,null,null,null,null,null,null,null,null,null,null,null,"",null,null,null,null,null," ",null,{"$f":"IF(AC252=\"\",\"\",MAX($AB$3:AB251)+1)","v":""},"","","",{"$f":"IF(AB252=\"\",\"\",#REF!)","v":""},{"$f":"IF(AD252=\"\",\"\",#REF!)","v":""},"","","","","","","","","","","","","","","","","","","","","",""]
[null,null,null,null,null,null,null,null,null,null,null,null,null,null,null,null,null,null,null,"",null,null,null,null,null," ",null,{"$f":"IF(AC253=\"\",\"\",MAX($AB$3:AB252)+1)","v":""},"","","",{"$f":"IF(AB253=\"\",\"\",#REF!)","v":""},{"$f":"IF(AD253=\"\",\"\",#REF!)","v":""},"","","","","","","","","","","","","","","","","","","","","",""]
[null,null,null,null,null,null,null,null,null,null,null,null,null,null,null,null,null,null,null,"",null,null,null,null,null," ",null,{"$f":"IF(AC254=\"\",\"\",MAX($AB$3:AB253)+1)","v":""},"","","",{"$f":"IF(AB254=\"\",\"\",#REF!)","v":""},{"$f":"IF(AD254=\"\",\"\",#REF!)","v":""},"","","","","","","","","","","","","","","","","","","","","",""]
[null,null,null,null,null,null,null,null,null,null,null,null,null,null,null,null,null,null,null,"",null,null,null,null,null," ",null,{"$f":"IF(AC255=\"\",\"\",MAX($AB$3:AB254)+1)","v":""},"","","",{"$f":"IF(AB255=\"\",\"\",#REF!)","v":""},{"$f":"IF(AD255=\"\",\"\",#REF!)","v":""},"","","","","","","","","","","","","","","","","","","","","",""]
[null,null,null,null,null,null,null,null,null,null,null,null,null,null,null,null,null,null,null,"",null,null,null,null,null," ",null,{"$f":"IF(AC256=\"\",\"\",MAX($AB$3:AB255)+1)","v":""},"","","",{"$f":"IF(AB256=\"\",\"\",#REF!)","v":""},{"$f":"IF(AD256=\"\",\"\",#REF!)","v":""},"","","","","","","","","","","","","","","","","","","","","",""]
[null,null,null,null,null,null,null,null,null,null,null,null,null,null,null,null,null,null,null,"",null,null,null,null,null," ",null,{"$f":"IF(AC257=\"\",\"\",MAX($AB$3:AB256)+1)","v":""},"","","",{"$f":"IF(AB257=\"\",\"\",#REF!)","v":""},{"$f":"IF(AD257=\"\",\"\",#REF!)","v":""},"","","","","","","","","","","","","","","","","","","","","",""]
[null,null,null,null,null,null,null,null,null,null,null,null,null,null,null,null,null,null,null,"",null,null,null,null,null," ",null,{"$f":"IF(AC258=\"\",\"\",MAX($AB$3:AB257)+1)","v":""},"","","",{"$f":"IF(AB258=\"\",\"\",#REF!)","v":""},{"$f":"IF(AD258=\"\",\"\",#REF!)","v":""},"","","","","","","","","","","","","","","","","","","","","",""]
[null,null,null,null,null,null,null,null,null,null,null,null,null,null,null,null,null,null,null,"",null,null,null,null,null," ",null,{"$f":"IF(AC259=\"\",\"\",MAX($AB$3:AB258)+1)","v":""},"","","",{"$f":"IF(AB259=\"\",\"\",#REF!)","v":""},{"$f":"IF(AD259=\"\",\"\",#REF!)","v":""},"","","","","","","","","","","","","","","","","","","","","",""]
[null,null,null,null,null,null,null,null,null,null,null,null,null,null,null,null,null,null,null,"",null,null,null,null,null," ",null,{"$f":"IF(AC260=\"\",\"\",MAX($AB$3:AB259)+1)","v":""},"","","",{"$f":"IF(AB260=\"\",\"\",#REF!)","v":""},{"$f":"IF(AD260=\"\",\"\",#REF!)","v":""},"","","","","","","","","","","","","","","","","","","","","",""]
[null,null,null,null,null,null,null,null,null,null,null,null,null,null,null,null,null,null,null,"",null,null,null,null,null," ",null,{"$f":"IF(AC261=\"\",\"\",MAX($AB$3:AB260)+1)","v":""},"","","",{"$f":"IF(AB261=\"\",\"\",#REF!)","v":""},{"$f":"IF(AD261=\"\",\"\",#REF!)","v":""},"","","","","","","","","","","","","","","","","","","","","",""]
[null,null,null,null,null,null,null,null,null,null,null,null,null,null,null,null,null,null,null,"",null,null,null,null,null," ",null,{"$f":"IF(AC262=\"\",\"\",MAX($AB$3:AB261)+1)","v":""},"","","",{"$f":"IF(AB262=\"\",\"\",#REF!)","v":""},{"$f":"IF(AD262=\"\",\"\",#REF!)","v":""},"","","","","","","","","","","","","","","","","","","","","",""]
[null,null,null,null,null,null,null,null,null,null,null,null,null,null,null,null,null,null,null,"",null,null,null,null,null," ",null,{"$f":"IF(AC263=\"\",\"\",MAX($AB$3:AB262)+1)","v":""},"","","",{"$f":"IF(AB263=\"\",\"\",#REF!)","v":""},{"$f":"IF(AD263=\"\",\"\",#REF!)","v":""},"","","","","","","","","","","","","","","","","","","","","",""]
[null,null,null,null,null,null,null,null,null,null,null,null,null,null,null,null,null,null,null,"",null,null,null,null,null," ",null,{"$f":"IF(AC264=\"\",\"\",MAX($AB$3:AB263)+1)","v":""},"","","",{"$f":"IF(AB264=\"\",\"\",#REF!)","v":""},{"$f":"IF(AD264=\"\",\"\",#REF!)","v":""},"","","","","","","","","","","","","","","","","","","","","",""]
[null,null,null,null,null,null,null,null,null,null,null,null,null,null,null,null,null,null,null,"",null,null,null,null,null," ",null,{"$f":"IF(AC265=\"\",\"\",MAX($AB$3:AB264)+1)","v":""},"","","",{"$f":"IF(AB265=\"\",\"\",#REF!)","v":""},{"$f":"IF(AD265=\"\",\"\",#REF!)","v":""},"","","","","","","","","","","","","","","","","","","","","",""]
[null,null,null,null,null,null,null,null,null,null,null,null,null,null,null,null,null,null,null,"",null,null,null,null,null," ",null,{"$f":"IF(AC266=\"\",\"\",MAX($AB$3:AB265)+1)","v":""},"","","",{"$f":"IF(AB266=\"\",\"\",#REF!)","v":""},{"$f":"IF(AD266=\"\",\"\",#REF!)","v":""},"","","","","","","","","","","","","","","","","","","","","",""]
[null,null,null,null,null,null,null,null,null,null,null,null,null,null,null,null,null,null,null,"",null,null,null,null,null," ",null,{"$f":"IF(AC267=\"\",\"\",MAX($AB$3:AB266)+1)","v":""},"","","",{"$f":"IF(AB267=\"\",\"\",#REF!)","v":""},{"$f":"IF(AD267=\"\",\"\",#REF!)","v":""},"","","","","","","","","","","","","","","","","","","","","",""]
[null,null,null,null,null,null,null,null,null,null,null,null,null,null,null,null,null,null,null,"",null,null,null,null,null," ",null,{"$f":"IF(AC268=\"\",\"\",MAX($AB$3:AB267)+1)","v":""},"","","",{"$f":"IF(AB268=\"\",\"\",#REF!)","v":""},{"$f":"IF(AD268=\"\",\"\",#REF!)","v":""},"","","","","","","","","","","","","","","","","","","","","",""]
[null,null,null,null,null,null,null,null,null,null,null,null,null,null,null,null,null,null,null,"",null,null,null,null,null," ",null,{"$f":"IF(AC269=\"\",\"\",MAX($AB$3:AB268)+1)","v":""},"","","",{"$f":"IF(AB269=\"\",\"\",#REF!)","v":""},{"$f":"IF(AD269=\"\",\"\",#REF!)","v":""},"","","","","","","","","","","","","","","","","","","","","",""]
[null,null,null,null,null,null,null,null,null,null,null,null,null,null,null,null,null,null,null,"",null,null,null,null,null," ",null,{"$f":"IF(AC270=\"\",\"\",MAX($AB$3:AB269)+1)","v":""},"","","",{"$f":"IF(AB270=\"\",\"\",#REF!)","v":""},{"$f":"IF(AD270=\"\",\"\",#REF!)","v":""},"","","","","","","","","","","","","","","","","","","","","",""]
[null,null,null,null,null,null,null,null,null,null,null,null,null,null,null,null,null,null,null,"",null,null,null,null,null," ",null,{"$f":"IF(AC271=\"\",\"\",MAX($AB$3:AB270)+1)","v":""},"","","",{"$f":"IF(AB271=\"\",\"\",#REF!)","v":""},{"$f":"IF(AD271=\"\",\"\",#REF!)","v":""},"","","","","","","","","","","","","","","","","","","","","",""]
[null,null,null,null,null,null,null,null,null,null,null,null,null,null,null,null,null,null,null,"",null,null,null,null,null," ",null,{"$f":"IF(AC272=\"\",\"\",MAX($AB$3:AB271)+1)","v":""},"","","",{"$f":"IF(AB272=\"\",\"\",#REF!)","v":""},{"$f":"IF(AD272=\"\",\"\",#REF!)","v":""},"","","","","","","","","","","","","","","","","","","","","",""]
[null,null,null,null,null,null,null,null,null,null,null,null,null,null,null,null,null,null,null,"",null,null,null,null,null," ",null,{"$f":"IF(AC273=\"\",\"\",MAX($AB$3:AB272)+1)","v":""},{"$f":"IF(C273=\"\",\"\",IF(B273=$AB$1,C273,\"\"))","v":""},{"$f":"IF(AB273=\"\",\"\",B273)","v":""},{"$f":"IF(AB273=\"\",\"\",E273)","v":""},{"$f":"IF(AB273=\"\",\"\",#REF!)","v":""},{"$f":"IF(AD273=\"\",\"\",#REF!)","v":""},{"$f":"IF(AD273=\"\",\"\",U273)","v":""},{"$f":"IF(AD273=\"\",\"\",V273)","v":""},{"$f":"IF(AD273=\"\",\"\",W273)","v":""},{"$f":"IF(AH273=\"\",\"\",X273)","v":""},{"$f":"IF(AI273=\"\",\"\",Y273)","v":""},{"$f":"IF(AE273=\"\",\"\",D273)","v":""},{"$f":"IF(AE273=\"\",\"\",X273)","v":""},{"$f":"IF(AE273=\"\",\"\",Y273)","v":""},{"$f":"IF(AD273=\"\",\"\",F273)","v":""},{"$f":"IF(AE273=\"\",\"\",G273)","v":""},{"$f":"IF(AD273=\"\",\"\",H273)","v":""},{"$f":"IF(AD273=\"\",\"\",I273)","v":""},{"$f":"IF(AH273=\"\",\"\",J273)","v":""},{"$f":"IF(AI273=\"\",\"\",K273)","v":""},{"$f":"IF(AJ273=\"\",\"\",L273)","v":""},{"$f":"IF(AK273=\"\",\"\",M273)","v":""},{"$f":"IF(AL273=\"\",\"\",N273)","v":""},{"$f":"IF(AM273=\"\",\"\",O273)","v":""},{"$f":"IF(AN273=\"\",\"\",P273)","v":""},{"$f":"IF(AO273=\"\",\"\",Q273)","v":""},{"$f":"IF(AP273=\"\",\"\",R273)","v":""},{"$f":"IF(AQ273=\"\",\"\",S273)","v":""}]
[null,null,null,null,null,null,null,null,null,null,null,null,null,null,null,null,null,null,null,{"$f":"IF(AND(C274=\"\",B274=\"\"),\"\",B274+1095)","v":""},null,null,null,null,null," ",null,{"$f":"IF(AC274=\"\",\"\",MAX($AB$3:AB273)+1)","v":""},"","","",{"$f":"IF(AB274=\"\",\"\",#REF!)","v":""},{"$f":"IF(AD274=\"\",\"\",#REF!)","v":""},"","","","","","","","","","","","","","","","","","","","","",""]
[null,null,null,null,null,null,null,null,null,null,null,null,null,null,null,null,null,null,null,"",null,null,null,null,null," ",null,{"$f":"IF(AC275=\"\",\"\",MAX($AB$3:AB274)+1)","v":""},"","","",{"$f":"IF(AB275=\"\",\"\",#REF!)","v":""},{"$f":"IF(AD275=\"\",\"\",#REF!)","v":""},"","","","","","","","","","","","","","","","","","","","","",""]
[null,null,null,null,null,null,null,null,null,null,null,null,null,null,null,null,null,null,null,"",null,null,null,null,null," ",null,{"$f":"IF(AC276=\"\",\"\",MAX($AB$3:AB275)+1)","v":""},"","","",{"$f":"IF(AB276=\"\",\"\",#REF!)","v":""},{"$f":"IF(AD276=\"\",\"\",#REF!)","v":""},"","","","","","","","","","","","","","","","","","","","","",""]
[null,null,null,null,null,null,null,null,null,null,null,null,null,null,null,null,null,null,null,"",null,null,null,null,null," ",null,{"$f":"IF(AC277=\"\",\"\",MAX($AB$3:AB276)+1)","v":""},"","","",{"$f":"IF(AB277=\"\",\"\",#REF!)","v":""},{"$f":"IF(AD277=\"\",\"\",#REF!)","v":""},"","","","","","","","","","","","","","","","","","","","","",""]
[null,null,null,null,null,null,null,null,null,null,null,null,null,null,null,null,null,null,null,"",null,null,null,null,null," ",null,{"$f":"IF(AC278=\"\",\"\",MAX($AB$3:AB277)+1)","v":""},"","","",{"$f":"IF(AB278=\"\",\"\",#REF!)","v":""},{"$f":"IF(AD278=\"\",\"\",#REF!)","v":""},"","","","","","","","","","","","","","","","","","","","","",""]
[null,null,null,null,null,null,null,null,null,null,null,null,null,null,null,null,null,null,null,"",null,null,null,null,null," ",null,{"$f":"IF(AC279=\"\",\"\",MAX($AB$3:AB278)+1)","v":""},"","","",{"$f":"IF(AB279=\"\",\"\",#REF!)","v":""},{"$f":"IF(AD279=\"\",\"\",#REF!)","v":""},"","","","","","","","","","","","","","","","","","","","","",""]
[null,null,null,null,null,null,null,null,null,null,null,null,null,null,null,null,null,null,null,"",null,null,null,null,null," ",null,{"$f":"IF(AC280=\"\",\"\",MAX($AB$3:AB279)+1)","v":""},"","","",{"$f":"IF(AB280=\"\",\"\",#REF!)","v":""},{"$f":"IF(AD280=\"\",\"\",#REF!)","v":""},"","","","","","","","","","","","","","","","","","","","","",""]
[null,null,null,null,null,null,null,null,null,null,null,null,null,null,null,null,null,null,null,"",null,null,null,null,null," ",null,{"$f":"IF(AC281=\"\",\"\",MAX($AB$3:AB280)+1)","v":""},"","","",{"$f":"IF(AB281=\"\",\"\",#REF!)","v":""},{"$f":"IF(AD281=\"\",\"\",#REF!)","v":""},"","","","","","","","","","","","","","","","","","","","","",""]
[null,null,null,null,null,null,null,null,null,null,null,null,null,null,null,null,null,null,null,"",null,null,null,null,null," ",null,{"$f":"IF(AC282=\"\",\"\",MAX($AB$3:AB281)+1)","v":""},"","","",{"$f":"IF(AB282=\"\",\"\",#REF!)","v":""},{"$f":"IF(AD282=\"\",\"\",#REF!)","v":""},"","","","","","","","","","","","","","","","","","","","","",""]
[null,null,null,null,null,null,null,null,null,null,null,null,null,null,null,null,null,null,null,"",null,null,null,null,null," ",null,{"$f":"IF(AC283=\"\",\"\",MAX($AB$3:AB282)+1)","v":""},"","","",{"$f":"IF(AB283=\"\",\"\",#REF!)","v":""},{"$f":"IF(AD283=\"\",\"\",#REF!)","v":""},"","","","","","","","","","","","","","","","","","","","","",""]
[null,null,null,null,null,null,null,null,null,null,null,null,null,null,null,null,null,null,null,"",null,null,null,null,null," ",null,{"$f":"IF(AC284=\"\",\"\",MAX($AB$3:AB283)+1)","v":""},"","","",{"$f":"IF(AB284=\"\",\"\",#REF!)","v":""},{"$f":"IF(AD284=\"\",\"\",#REF!)","v":""},"","","","","","","","","","","","","","","","","","","","","",""]
[null,null,null,null,null,null,null,null,null,null,null,null,null,null,null,null,null,null,null,"",null,null,null,null,null," ",null,{"$f":"IF(AC285=\"\",\"\",MAX($AB$3:AB284)+1)","v":""},"","","",{"$f":"IF(AB285=\"\",\"\",#REF!)","v":""},{"$f":"IF(AD285=\"\",\"\",#REF!)","v":""},"","","","","","","","","","","","","","","","","","","","","",""]
[null,null,null,null,null,null,null,null,null,null,null,null,null,null,null,null,null,null,null,"",null,null,null,null,null," ",null,{"$f":"IF(AC286=\"\",\"\",MAX($AB$3:AB285)+1)","v":""},"","","",{"$f":"IF(AB286=\"\",\"\",#REF!)","v":""},{"$f":"IF(AD286=\"\",\"\",#REF!)","v":""},"","","","","","","","","","","","","","","","","","","","","",""]
[null,null,null,null,null,null,null,null,null,null,null,null,null,null,null,null,null,null,null,"",null,null,null,null,null," ",null,{"$f":"IF(AC287=\"\",\"\",MAX($AB$3:AB286)+1)","v":""},"","","",{"$f":"IF(AB287=\"\",\"\",#REF!)","v":""},{"$f":"IF(AD287=\"\",\"\",#REF!)","v":""},"","","","","","","","","","","","","","","","","","","","","",""]
[null,null,null,null,null,null,null,null,null,null,null,null,null,null,null,null,null,null,null,"",null,null,null,null,null," ",null,{"$f":"IF(AC288=\"\",\"\",MAX($AB$3:AB287)+1)","v":""},"","","",{"$f":"IF(AB288=\"\",\"\",#REF!)","v":""},{"$f":"IF(AD288=\"\",\"\",#REF!)","v":""},"","","","","","","","","","","","","","","","","","","","","",""]
[null,null,null,null,null,null,null,null,null,null,null,null,null,null,null,null,null,null,null,"",null,null,null,null,null," ",null,{"$f":"IF(AC289=\"\",\"\",MAX($AB$3:AB288)+1)","v":""},"","","",{"$f":"IF(AB289=\"\",\"\",#REF!)","v":""},{"$f":"IF(AD289=\"\",\"\",#REF!)","v":""},"","","","","","","","","","","","","","","","","","","","","",""]
[null,null,null,null,null,null,null,null,null,null,null,null,null,null,null,null,null,null,null,"",null,null,null,null,null," ",null,{"$f":"IF(AC290=\"\",\"\",MAX($AB$3:AB289)+1)","v":""},"","","",{"$f":"IF(AB290=\"\",\"\",#REF!)","v":""},{"$f":"IF(AD290=\"\",\"\",#REF!)","v":""},"","","","","","","","","","","","","","","","","","","","","",""]
[null,null,null,null,null,null,null,null,null,null,null,null,null,null,null,null,null,null,null,"",null,null,null,null,null," ",null,{"$f":"IF(AC291=\"\",\"\",MAX($AB$3:AB290)+1)","v":""},"","","",{"$f":"IF(AB291=\"\",\"\",#REF!)","v":""},{"$f":"IF(AD291=\"\",\"\",#REF!)","v":""},"","","","","","","","","","","","","","","","","","","","","",""]
[null,null,null,null,null,null,null,null,null,null,null,null,null,null,null,null,null,null,null,"",null,null,null,null,null," ",null,{"$f":"IF(AC292=\"\",\"\",MAX($AB$3:AB291)+1)","v":""},"","","",{"$f":"IF(AB292=\"\",\"\",#REF!)","v":""},{"$f":"IF(AD292=\"\",\"\",#REF!)","v":""},"","","","","","","","","","","","","","","","","","","","","",""]
[null,null,null,null,null,null,null,null,null,null,null,null,null,null,null,null,null,null,null,"",null,null,null,null,null," ",null,{"$f":"IF(AC293=\"\",\"\",MAX($AB$3:AB292)+1)","v":""},"","","",{"$f":"IF(AB293=\"\",\"\",#REF!)","v":""},{"$f":"IF(AD293=\"\",\"\",#REF!)","v":""},"","","","","","","","","","","","","","","","","","","","","",""]
[null,null,null,null,null,null,null,null,null,null,null,null,null,null,null,null,null,null,null,"",null,null,null,null,null," ",null,{"$f":"IF(AC294=\"\",\"\",MAX($AB$3:AB293)+1)","v":""},"","","",{"$f":"IF(AB294=\"\",\"\",#REF!)","v":""},{"$f":"IF(AD294=\"\",\"\",#REF!)","v":""},"","","","","","","","","","","","","","","","","","","","","",""]
[null,null,null,null,null,null,null,null,null,null,null,null,null,null,null,null,null,null,null,"",null,null,null,null,null," ",null,{"$f":"IF(AC295=\"\",\"\",MAX($AB$3:AB294)+1)","v":""},"","","",{"$f":"IF(AB295=\"\",\"\",#REF!)","v":""},{"$f":"IF(AD295=\"\",\"\",#REF!)","v":""},"","","","","","","","","","","","","","","","","","","","","",""]
[null,null,null,null,null,null,null,null,null,null,null,null,null,null,null,null,null,null,null,"",null,null,null,null,null," ",null,{"$f":"IF(AC296=\"\",\"\",MAX($AB$3:AB295)+1)","v":""},"","","",{"$f":"IF(AB296=\"\",\"\",#REF!)","v":""},{"$f":"IF(AD296=\"\",\"\",#REF!)","v":""},"","","","","","","","","","","","","","","","","","","","","",""]
[null,null,null,null,null,null,null,null,null,null,null,null,null,null,null,null,null,null,null,"",null,null,null,null,null," ",null,{"$f":"IF(AC297=\"\",\"\",MAX($AB$3:AB296)+1)","v":""},"","","",{"$f":"IF(AB297=\"\",\"\",#REF!)","v":""},{"$f":"IF(AD297=\"\",\"\",#REF!)","v":""},"","","","","","","","","","","","","","","","","","","","","",""]
[null,null,null,null,null,null,null,null,null,null,null,null,null,null,null,null,null,null,null,"",null,null,null,null,null," ",null,{"$f":"IF(AC298=\"\",\"\",MAX($AB$3:AB297)+1)","v":""},"","","",{"$f":"IF(AB298=\"\",\"\",#REF!)","v":""},{"$f":"IF(AD298=\"\",\"\",#REF!)","v":""},"","","","","","","","","","","","","","","","","","","","","",""]
[null,null,null,null,null,null,null,null,null,null,null,null,null,null,null,null,null,null,null,"",null,null,null,null,null," ",null,{"$f":"IF(AC299=\"\",\"\",MAX($AB$3:AB298)+1)","v":""},"","","",{"$f":"IF(AB299=\"\",\"\",#REF!)","v":""},{"$f":"IF(AD299=\"\",\"\",#REF!)","v":""},"","","","","","","","","","","","","","","","","","","","","",""]
[null,null,null,null,null,null,null,null,null,null,null,null,null,null,null,null,null,null,null,"",null,null,null,null,null," ",null,{"$f":"IF(AC300=\"\",\"\",MAX($AB$3:AB299)+1)","v":""},"","","",{"$f":"IF(AB300=\"\",\"\",#REF!)","v":""},{"$f":"IF(AD300=\"\",\"\",#REF!)","v":""},"","","","","","","","","","","","","","","","","","","","","",""]
[null,null,null,null,null,null,null,null,null,null,null,null,null,null,null,null,null,null,null,"",null,null,null,null,null," ",null,{"$f":"IF(AC301=\"\",\"\",MAX($AB$3:AB300)+1)","v":""},"","","",{"$f":"IF(AB301=\"\",\"\",#REF!)","v":""},{"$f":"IF(AD301=\"\",\"\",#REF!)","v":""},"","","","","","","","","","","","","","","","","","","","","",""]
[null,null,null,null,null,null,null,null,null,null,null,null,null,null,null,null,null,null,null,"",null,null,null,null,null," ",null,{"$f":"IF(AC302=\"\",\"\",MAX($AB$3:AB301)+1)","v":""},"","","",{"$f":"IF(AB302=\"\",\"\",#REF!)","v":""},{"$f":"IF(AD302=\"\",\"\",#REF!)","v":""},"","","","","","","","","","","","","","","","","","","","","",""]
[null,null,null,null,null,null,null,null,null,null,null,null,null,null,null,null,null,null,null,"",null,null,null,null,null," ",null,{"$f":"IF(AC303=\"\",\"\",MAX($AB$3:AB302)+1)","v":""},"","","",{"$f":"IF(AB303=\"\",\"\",#REF!)","v":""},{"$f":"IF(AD303=\"\",\"\",#REF!)","v":""},"","","","","","","","","","","","","","","","","","","","","",""]
[null,null,null,null,null,null,null,null,null,null,null,null,null,null,null,null,null,null,null,"",null,null,null,null,null," ",null,{"$f":"IF(AC304=\"\",\"\",MAX($AB$3:AB303)+1)","v":""},"","","",{"$f":"IF(AB304=\"\",\"\",#REF!)","v":""},{"$f":"IF(AD304=\"\",\"\",#REF!)","v":""},"","","","","","","","","","","","","","","","","","","","","",""]
[null,null,null,null,null,null,null,null,null,null,null,null,null,null,null,null,null,null,null,"",null,null,null,null,null," ",null,{"$f":"IF(AC305=\"\",\"\",MAX($AB$3:AB304)+1)","v":""},"","","",{"$f":"IF(AB305=\"\",\"\",#REF!)","v":""},{"$f":"IF(AD305=\"\",\"\",#REF!)","v":""},"","","","","","","","","","","","","","","","","","","","","",""]
[null,null,null,null,null,null,null,null,null,null,null,null,null,null,null,null,null,null,null,"",null,null,null,null,null," ",null,{"$f":"IF(AC306=\"\",\"\",MAX($AB$3:AB305)+1)","v":""},"","","",{"$f":"IF(AB306=\"\",\"\",#REF!)","v":""},{"$f":"IF(AD306=\"\",\"\",#REF!)","v":""},"","","","","","","","","","","","","","","","","","","","","",""]
[null,null,null,null,null,null,null,null,null,null,null,null,null,null,null,null,null,null,null,"",null,null,null,null,null," ",null,{"$f":"IF(AC307=\"\",\"\",MAX($AB$3:AB306)+1)","v":""},"","","",{"$f":"IF(AB307=\"\",\"\",#REF!)","v":""},{"$f":"IF(AD307=\"\",\"\",#REF!)","v":""},"","","","","","","","","","","","","","","","","","","","","",""]
[null,null,null,null,null,null,null,null,null,null,null,null,null,null,null,null,null,null,null,"",null,null,null,null,null," ",null,{"$f":"IF(AC308=\"\",\"\",MAX($AB$3:AB307)+1)","v":""},"","","",{"$f":"IF(AB308=\"\",\"\",#REF!)","v":""},{"$f":"IF(AD308=\"\",\"\",#REF!)","v":""},"","","","","","","","","","","","","","","","","","","","","",""]
[null,null,null,null,null,null,null,null,null,null,null,null,null,null,null,null,null,null,null,"",null,null,null,null,null," ",null,{"$f":"IF(AC309=\"\",\"\",MAX($AB$3:AB308)+1)","v":""},"","","",{"$f":"IF(AB309=\"\",\"\",#REF!)","v":""},{"$f":"IF(AD309=\"\",\"\",#REF!)","v":""},"","","","","","","","","","","","","","","","","","","","","",""]
[null,null,null,null,null,null,null,null,null,null,null,null,null,null,null,null,null,null,null,"",null,null,null,null,null," ",null,{"$f":"IF(AC310=\"\",\"\",MAX($AB$3:AB309)+1)","v":""},"","","",{"$f":"IF(AB310=\"\",\"\",#REF!)","v":""},{"$f":"IF(AD310=\"\",\"\",#REF!)","v":""},"","","","","","","","","","","","","","","","","","","","","",""]
[null,null,null,null,null,null,null,null,null,null,null,null,null,null,null,null,null,null,null,"",null,null,null,null,null," ",null,{"$f":"IF(AC311=\"\",\"\",MAX($AB$3:AB310)+1)","v":""},"","","",{"$f":"IF(AB311=\"\",\"\",#REF!)","v":""},{"$f":"IF(AD311=\"\",\"\",#REF!)","v":""},"","","","","","","","","","","","","","","","","","","","","",""]
[null,null,null,null,null,null,null,null,null,null,null,null,null,null,null,null,null,null,null,"",null,null,null,null,null," ",null,{"$f":"IF(AC312=\"\",\"\",MAX($AB$3:AB311)+1)","v":""},"","","",{"$f":"IF(AB312=\"\",\"\",#REF!)","v":""},{"$f":"IF(AD312=\"\",\"\",#REF!)","v":""},"","","","","","","","","","","","","","","","","","","","","",""]
[null,null,null,null,null,null,null,null,null,null,null,null,null,null,null,null,null,null,null,"",null,null,null,null,null," ",null,{"$f":"IF(AC313=\"\",\"\",MAX($AB$3:AB312)+1)","v":""},"","","",{"$f":"IF(AB313=\"\",\"\",#REF!)","v":""},{"$f":"IF(AD313=\"\",\"\",#REF!)","v":""},"","","","","","","","","","","","","","","","","","","","","",""]
[null,null,null,null,null,null,null,null,null,null,null,null,null,null,null,null,null,null,null,"",null,null,null,null,null," ",null,{"$f":"IF(AC314=\"\",\"\",MAX($AB$3:AB313)+1)","v":""},"","","",{"$f":"IF(AB314=\"\",\"\",#REF!)","v":""},{"$f":"IF(AD314=\"\",\"\",#REF!)","v":""},"","","","","","","","","","","","","","","","","","","","","",""]
[null,null,null,null,null,null,null,null,null,null,null,null,null,null,null,null,null,null,null,"",null,null,null,null,null," ",null,{"$f":"IF(AC315=\"\",\"\",MAX($AB$3:AB314)+1)","v":""},"","","",{"$f":"IF(AB315=\"\",\"\",#REF!)","v":""},{"$f":"IF(AD315=\"\",\"\",#REF!)","v":""},"","","","","","","","","","","","","","","","","","","","","",""]
[null,null,null,null,null,null,null,null,null,null,null,null,null,null,null,null,null,null,null,"",null,null,null,null,null," ",null,{"$f":"IF(AC316=\"\",\"\",MAX($AB$3:AB315)+1)","v":""},"","","",{"$f":"IF(AB316=\"\",\"\",#REF!)","v":""},{"$f":"IF(AD316=\"\",\"\",#REF!)","v":""},"","","","","","","","","","","","","","","","","","","","","",""]
[null,null,null,null,null,null,null,null,null,null,null,null,null,null,null,null,null,null,null,"",null,null,null,null,null," ",null,{"$f":"IF(AC317=\"\",\"\",MAX($AB$3:AB316)+1)","v":""},"","","",{"$f":"IF(AB317=\"\",\"\",#REF!)","v":""},{"$f":"IF(AD317=\"\",\"\",#REF!)","v":""},"","","","","","","","","","","","","","","","","","","","","",""]
[null,null,null,null,null,null,null,null,null,null,null,null,null,null,null,null,null,null,null,"",null,null,null,null,null," ",null,{"$f":"IF(AC318=\"\",\"\",MAX($AB$3:AB317)+1)","v":""},"","","",{"$f":"IF(AB318=\"\",\"\",#REF!)","v":""},{"$f":"IF(AD318=\"\",\"\",#REF!)","v":""},"","","","","","","","","","","","","","","","","","","","","",""]
[null,null,null,null,null,null,null,null,null,null,null,null,null,null,null,null,null,null,null,"",null,null,null,null,null," ",null,{"$f":"IF(AC319=\"\",\"\",MAX($AB$3:AB318)+1)","v":""},"","","",{"$f":"IF(AB319=\"\",\"\",#REF!)","v":""},{"$f":"IF(AD319=\"\",\"\",#REF!)","v":""},"","","","","","","","","","","","","","","","","","","","","",""]
[null,null,null,null,null,null,null,null,null,null,null,null,null,null,null,null,null,null,null,"",null,null,null,null,null," ",null,{"$f":"IF(AC320=\"\",\"\",MAX($AB$3:AB319)+1)","v":""},"","","",{"$f":"IF(AB320=\"\",\"\",#REF!)","v":""},{"$f":"IF(AD320=\"\",\"\",#REF!)","v":""},"","","","","","","","","","","","","","","","","","","","","",""]
[null,null,null,null,null,null,null,null,null,null,null,null,null,null,null,null,null,null,null,"",null,null,null,null,null," ",null,{"$f":"IF(AC321=\"\",\"\",MAX($AB$3:AB320)+1)","v":""},"","","",{"$f":"IF(AB321=\"\",\"\",#REF!)","v":""},{"$f":"IF(AD321=\"\",\"\",#REF!)","v":""},"","","","","","","","","","","","","","","","","","","","","",""]
[null,null,null,null,null,null,null,null,null,null,null,null,null,null,null,null,null,null,null,"",null,null,null,null,null," ",null,{"$f":"IF(AC322=\"\",\"\",MAX($AB$3:AB321)+1)","v":""},"","","",{"$f":"IF(AB322=\"\",\"\",#REF!)","v":""},{"$f":"IF(AD322=\"\",\"\",#REF!)","v":""},"","","","","","","","","","","","","","","","","","","","","",""]
[null,null,null,null,null,null,null,null,null,null,null,null,null,null,null,null,null,null,null,"",null,null,null,null,null," ",null,{"$f":"IF(AC323=\"\",\"\",MAX($AB$3:AB322)+1)","v":""},"","","",{"$f":"IF(AB323=\"\",\"\",#REF!)","v":""},{"$f":"IF(AD323=\"\",\"\",#REF!)","v":""},"","","","","","","","","","","","","","","","","","","","","",""]
[null,null,null,null,null,null,null,null,null,null,null,null,null,null,null,null,null,null,null,"",null,null,null,null,null," ",null,{"$f":"IF(AC324=\"\",\"\",MAX($AB$3:AB323)+1)","v":""},"","","",{"$f":"IF(AB324=\"\",\"\",#REF!)","v":""},{"$f":"IF(AD324=\"\",\"\",#REF!)","v":""},"","","","","","","","","","","","","","","","","","","","","",""]
[null,null,null,null,null,null,null,null,null,null,null,null,null,null,null,null,null,null,null,"",null,null,null,null,null," ",null,{"$f":"IF(AC325=\"\",\"\",MAX($AB$3:AB324)+1)","v":""},"","","",{"$f":"IF(AB325=\"\",\"\",#REF!)","v":""},{"$f":"IF(AD325=\"\",\"\",#REF!)","v":""},"","","","","","","","","","","","","","","","","","","","","",""]
[null,null,null,null,null,null,null,null,null,null,null,null,null,null,null,null,null,null,null,"",null,null,null,null,null," ",null,{"$f":"IF(AC326=\"\",\"\",MAX($AB$3:AB325)+1)","v":""},"","","",{"$f":"IF(AB326=\"\",\"\",#REF!)","v":""},{"$f":"IF(AD326=\"\",\"\",#REF!)","v":""},"","","","","","","","","","","","","","","","","","","","","",""]
[null,null,null,null,null,null,null,null,null,null,null,null,null,null,null,null,null,null,null,"",null,null,null,null,null," ",null,{"$f":"IF(AC327=\"\",\"\",MAX($AB$3:AB326)+1)","v":""},"","","",{"$f":"IF(AB327=\"\",\"\",#REF!)","v":""},{"$f":"IF(AD327=\"\",\"\",#REF!)","v":""},"","","","","","","","","","","","","","","","","","","","","",""]
[null,null,null,null,null,null,null,null,null,null,null,null,null,null,null,null,null,null,null,"",null,null,null,null,null," ",null,{"$f":"IF(AC328=\"\",\"\",MAX($AB$3:AB327)+1)","v":""},"","","",{"$f":"IF(AB328=\"\",\"\",#REF!)","v":""},{"$f":"IF(AD328=\"\",\"\",#REF!)","v":""},"","","","","","","","","","","","","","","","","","","","","",""]
[null,null,null,null,null,null,null,null,null,null,null,null,null,null,null,null,null,null,null,"",null,null,null,null,null," ",null,{"$f":"IF(AC329=\"\",\"\",MAX($AB$3:AB328)+1)","v":""},"","","",{"$f":"IF(AB329=\"\",\"\",#REF!)","v":""},{"$f":"IF(AD329=\"\",\"\",#REF!)","v":""},"","","","","","","","","","","","","","","","","","","","","",""]
[null,null,null,null,null,null,null,null,null,null,null,null,null,null,null,null,null,null,null,"",null,null,null,null,null," ",null,{"$f":"IF(AC330=\"\",\"\",MAX($AB$3:AB329)+1)","v":""},"","","",{"$f":"IF(AB330=\"\",\"\",#REF!)","v":""},{"$f":"IF(AD330=\"\",\"\",#REF!)","v":""},"","","","","","","","","","","","","","","","","","","","","",""]
[null,null,null,null,null,null,null,null,null,null,null,null,null,null,null,null,null,null,null,"",null,null,null,null,null," ",null,{"$f":"IF(AC331=\"\",\"\",MAX($AB$3:AB330)+1)","v":""},"","","",{"$f":"IF(AB331=\"\",\"\",#REF!)","v":""},{"$f":"IF(AD331=\"\",\"\",#REF!)","v":""},"","","","","","","","","","","","","","","","","","","","","",""]
[null,null,null,null,null,null,null,null,null,null,null,null,null,null,null,null,null,null,null,"",null,null,null,null,null," ",null,{"$f":"IF(AC332=\"\",\"\",MAX($AB$3:AB331)+1)","v":""},"","","",{"$f":"IF(AB332=\"\",\"\",#REF!)","v":""},{"$f":"IF(AD332=\"\",\"\",#REF!)","v":""},"","","","","","","","","","","","","","","","","","","","","",""]
[null,null,null,null,null,null,null,null,null,null,null,null,null,null,null,null,null,null,null,"",null,null,null,null,null," ",null,{"$f":"IF(AC333=\"\",\"\",MAX($AB$3:AB332)+1)","v":""},"","","",{"$f":"IF(AB333=\"\",\"\",#REF!)","v":""},{"$f":"IF(AD333=\"\",\"\",#REF!)","v":""},"","","","","","","","","","","","","","","","","","","","","",""]
[null,null,null,null,null,null,null,null,null,null,null,null,null,null,null,null,null,null,null,"",null,null,null,null,null," ",null,{"$f":"IF(AC334=\"\",\"\",MAX($AB$3:AB333)+1)","v":""},"","","",{"$f":"IF(AB334=\"\",\"\",#REF!)","v":""},{"$f":"IF(AD334=\"\",\"\",#REF!)","v":""},"","","","","","","","","","","","","","","","","","","","","",""]
[null,null,null,null,null,null,null,null,null,null,null,null,null,null,null,null,null,null,null,"",null,null,null,null,null," ",null,{"$f":"IF(AC335=\"\",\"\",MAX($AB$3:AB334)+1)","v":""},"","","",{"$f":"IF(AB335=\"\",\"\",#REF!)","v":""},{"$f":"IF(AD335=\"\",\"\",#REF!)","v":""},"","","","","","","","","","","","","","","","","","","","","",""]
[null,null,null,null,null,null,null,null,null,null,null,null,null,null,null,null,null,null,null,"",null,null,null,null,null," ",null,{"$f":"IF(AC336=\"\",\"\",MAX($AB$3:AB335)+1)","v":""},"","","",{"$f":"IF(AB336=\"\",\"\",#REF!)","v":""},{"$f":"IF(AD336=\"\",\"\",#REF!)","v":""},"","","","","","","","","","","","","","","","","","","","","",""]
[null,null,null,null,null,null,null,null,null,null,null,null,null,null,null,null,null,null,null,"",null,null,null,null,null," ",null,{"$f":"IF(AC337=\"\",\"\",MAX($AB$3:AB336)+1)","v":""},{"$f":"IF(C337=\"\",\"\",IF(B337=$AB$1,C337,\"\"))","v":""},{"$f":"IF(AB337=\"\",\"\",B337)","v":""},{"$f":"IF(AB337=\"\",\"\",E337)","v":""},{"$f":"IF(AB337=\"\",\"\",#REF!)","v":""},{"$f":"IF(AD337=\"\",\"\",#REF!)","v":""},{"$f":"IF(AD337=\"\",\"\",U337)","v":""},{"$f":"IF(AD337=\"\",\"\",V337)","v":""},{"$f":"IF(AD337=\"\",\"\",W337)","v":""},{"$f":"IF(AH337=\"\",\"\",X337)","v":""},{"$f":"IF(AI337=\"\",\"\",Y337)","v":""},{"$f":"IF(AE337=\"\",\"\",D337)","v":""},{"$f":"IF(AE337=\"\",\"\",X337)","v":""},{"$f":"IF(AE337=\"\",\"\",Y337)","v":""},{"$f":"IF(AD337=\"\",\"\",F337)","v":""},{"$f":"IF(AE337=\"\",\"\",G337)","v":""},{"$f":"IF(AD337=\"\",\"\",H337)","v":""},{"$f":"IF(AD337=\"\",\"\",I337)","v":""},{"$f":"IF(AH337=\"\",\"\",J337)","v":""},{"$f":"IF(AI337=\"\",\"\",K337)","v":""},{"$f":"IF(AJ337=\"\",\"\",L337)","v":""},{"$f":"IF(AK337=\"\",\"\",M337)","v":""},{"$f":"IF(AL337=\"\",\"\",N337)","v":""},{"$f":"IF(AM337=\"\",\"\",O337)","v":""},{"$f":"IF(AN337=\"\",\"\",P337)","v":""},{"$f":"IF(AO337=\"\",\"\",Q337)","v":""},{"$f":"IF(AP337=\"\",\"\",R337)","v":""},{"$f":"IF(AQ337=\"\",\"\",S337)","v":""}]
[null,null,null,null,null,null,null,null,null,null,null,null,null,null,null,null,null,null,null,{"$f":"IF(AND(C338=\"\",B338=\"\"),\"\",B338+1095)","v":""},null,null,null,null,null," ",null,{"$f":"IF(AC338=\"\",\"\",MAX($AB$3:AB337)+1)","v":""},"","","",{"$f":"IF(AB338=\"\",\"\",#REF!)","v":""},{"$f":"IF(AD338=\"\",\"\",#REF!)","v":""},"","","","","","","","","","","","","","","","","","","","","",""]
[null,null,null,null,null,null,null,null,null,null,null,null,null,null,null,null,null,null,null,"",null,null,null,null,null," ",null,{"$f":"IF(AC339=\"\",\"\",MAX($AB$3:AB338)+1)","v":""},"","","",{"$f":"IF(AB339=\"\",\"\",#REF!)","v":""},{"$f":"IF(AD339=\"\",\"\",#REF!)","v":""},"","","","","","","","","","","","","","","","","","","","","",""]
[null,null,null,null,null,null,null,null,null,null,null,null,null,null,null,null,null,null,null,"",null,null,null,null,null," ",null,{"$f":"IF(AC340=\"\",\"\",MAX($AB$3:AB339)+1)","v":""},"","","",{"$f":"IF(AB340=\"\",\"\",#REF!)","v":""},{"$f":"IF(AD340=\"\",\"\",#REF!)","v":""},"","","","","","","","","","","","","","","","","","","","","",""]
[null,null,null,null,null,null,null,null,null,null,null,null,null,null,null,null,null,null,null,"",null,null,null,null,null," ",null,{"$f":"IF(AC341=\"\",\"\",MAX($AB$3:AB340)+1)","v":""},"","","",{"$f":"IF(AB341=\"\",\"\",#REF!)","v":""},{"$f":"IF(AD341=\"\",\"\",#REF!)","v":""},"","","","","","","","","","","","","","","","","","","","","",""]
[null,null,null,null,null,null,null,null,null,null,null,null,null,null,null,null,null,null,null,"",null,null,null,null,null," ",null,{"$f":"IF(AC342=\"\",\"\",MAX($AB$3:AB341)+1)","v":""},"","","",{"$f":"IF(AB342=\"\",\"\",#REF!)","v":""},{"$f":"IF(AD342=\"\",\"\",#REF!)","v":""},"","","","","","","","","","","","","","","","","","","","","",""]
[null,null,null,null,null,null,null,null,null,null,null,null,null,null,null,null,null,null,null,"",null,null,null,null,null," ",null,{"$f":"IF(AC343=\"\",\"\",MAX($AB$3:AB342)+1)","v":""},"","","",{"$f":"IF(AB343=\"\",\"\",#REF!)","v":""},{"$f":"IF(AD343=\"\",\"\",#REF!)","v":""},"","","","","","","","","","","","","","","","","","","","","",""]
[null,null,null,null,null,null,null,null,null,null,null,null,null,null,null,null,null,null,null,"",null,null,null,null,null," ",null,{"$f":"IF(AC344=\"\",\"\",MAX($AB$3:AB343)+1)","v":""},"","","",{"$f":"IF(AB344=\"\",\"\",#REF!)","v":""},{"$f":"IF(AD344=\"\",\"\",#REF!)","v":""},"","","","","","","","","","","","","","","","","","","","","",""]
[null,null,null,null,null,null,null,null,null,null,null,null,null,null,null,null,null,null,null,"",null,null,null,null,null," ",null,{"$f":"IF(AC345=\"\",\"\",MAX($AB$3:AB344)+1)","v":""},"","","",{"$f":"IF(AB345=\"\",\"\",#REF!)","v":""},{"$f":"IF(AD345=\"\",\"\",#REF!)","v":""},"","","","","","","","","","","","","","","","","","","","","",""]
[null,null,null,null,null,null,null,null,null,null,null,null,null,null,null,null,null,null,null,"",null,null,null,null,null," ",null,{"$f":"IF(AC346=\"\",\"\",MAX($AB$3:AB345)+1)","v":""},"","","",{"$f":"IF(AB346=\"\",\"\",#REF!)","v":""},{"$f":"IF(AD346=\"\",\"\",#REF!)","v":""},"","","","","","","","","","","","","","","","","","","","","",""]
[null,null,null,null,null,null,null,null,null,null,null,null,null,null,null,null,null,null,null,"",null,null,null,null,null," ",null,{"$f":"IF(AC347=\"\",\"\",MAX($AB$3:AB346)+1)","v":""},"","","",{"$f":"IF(AB347=\"\",\"\",#REF!)","v":""},{"$f":"IF(AD347=\"\",\"\",#REF!)","v":""},"","","","","","","","","","","","","","","","","","","","","",""]
[null,null,null,null,null,null,null,null,null,null,null,null,null,null,null,null,null,null,null,"",null,null,null,null,null," ",null,{"$f":"IF(AC348=\"\",\"\",MAX($AB$3:AB347)+1)","v":""},"","","",{"$f":"IF(AB348=\"\",\"\",#REF!)","v":""},{"$f":"IF(AD348=\"\",\"\",#REF!)","v":""},"","","","","","","","","","","","","","","","","","","","","",""]
[null,null,null,null,null,null,null,null,null,null,null,null,null,null,null,null,null,null,null,"",null,null,null,null,null," ",null,{"$f":"IF(AC349=\"\",\"\",MAX($AB$3:AB348)+1)","v":""},"","","",{"$f":"IF(AB349=\"\",\"\",#REF!)","v":""},{"$f":"IF(AD349=\"\",\"\",#REF!)","v":""},"","","","","","","","","","","","","","","","","","","","","",""]
[null,null,null,null,null,null,null,null,null,null,null,null,null,null,null,null,null,null,null,"",null,null,null,null,null," ",null,{"$f":"IF(AC350=\"\",\"\",MAX($AB$3:AB349)+1)","v":""},"","","",{"$f":"IF(AB350=\"\",\"\",#REF!)","v":""},{"$f":"IF(AD350=\"\",\"\",#REF!)","v":""},"","","","","","","","","","","","","","","","","","","","","",""]
[null,null,null,null,null,null,null,null,null,null,null,null,null,null,null,null,null,null,null,"",null,null,null,null,null," ",null,{"$f":"IF(AC351=\"\",\"\",MAX($AB$3:AB350)+1)","v":""},"","","",{"$f":"IF(AB351=\"\",\"\",#REF!)","v":""},{"$f":"IF(AD351=\"\",\"\",#REF!)","v":""},"","","","","","","","","","","","","","","","","","","","","",""]
[null,null,null,null,null,null,null,null,null,null,null,null,null,null,null,null,null,null,null,"",null,null,null,null,null," ",null,{"$f":"IF(AC352=\"\",\"\",MAX($AB$3:AB351)+1)","v":""},"","","",{"$f":"IF(AB352=\"\",\"\",#REF!)","v":""},{"$f":"IF(AD352=\"\",\"\",#REF!)","v":""},"","","","","","","","","","","","","","","","","","","","","",""]
[null,null,null,null,null,null,null,null,null,null,null,null,null,null,null,null,null,null,null,"",null,null,null,null,null," ",null,{"$f":"IF(AC353=\"\",\"\",MAX($AB$3:AB352)+1)","v":""},"","","",{"$f":"IF(AB353=\"\",\"\",#REF!)","v":""},{"$f":"IF(AD353=\"\",\"\",#REF!)","v":""},"","","","","","","","","","","","","","","","","","","","","",""]
[null,null,null,null,null,null,null,null,null,null,null,null,null,null,null,null,null,null,null,"",null,null,null,null,null," ",null,{"$f":"IF(AC354=\"\",\"\",MAX($AB$3:AB353)+1)","v":""},"","","",{"$f":"IF(AB354=\"\",\"\",#REF!)","v":""},{"$f":"IF(AD354=\"\",\"\",#REF!)","v":""},"","","","","","","","","","","","","","","","","","","","","",""]
[null,null,null,null,null,null,null,null,null,null,null,null,null,null,null,null,null,null,null,"",null,null,null,null,null," ",null,{"$f":"IF(AC355=\"\",\"\",MAX($AB$3:AB354)+1)","v":""},"","","",{"$f":"IF(AB355=\"\",\"\",#REF!)","v":""},{"$f":"IF(AD355=\"\",\"\",#REF!)","v":""},"","","","","","","","","","","","","","","","","","","","","",""]
[null,null,null,null,null,null,null,null,null,null,null,null,null,null,null,null,null,null,null,"",null,null,null,null,null," ",null,{"$f":"IF(AC356=\"\",\"\",MAX($AB$3:AB355)+1)","v":""},"","","",{"$f":"IF(AB356=\"\",\"\",#REF!)","v":""},{"$f":"IF(AD356=\"\",\"\",#REF!)","v":""},"","","","","","","","","","","","","","","","","","","","","",""]
[null,null,null,null,null,null,null,null,null,null,null,null,null,null,null,null,null,null,null,"",null,null,null,null,null," ",null,{"$f":"IF(AC357=\"\",\"\",MAX($AB$3:AB356)+1)","v":""},"","","",{"$f":"IF(AB357=\"\",\"\",#REF!)","v":""},{"$f":"IF(AD357=\"\",\"\",#REF!)","v":""},"","","","","","","","","","","","","","","","","","","","","",""]
[null,null,null,null,null,null,null,null,null,null,null,null,null,null,null,null,null,null,null,"",null,null,null,null,null," ",null,{"$f":"IF(AC358=\"\",\"\",MAX($AB$3:AB357)+1)","v":""},"","","",{"$f":"IF(AB358=\"\",\"\",#REF!)","v":""},{"$f":"IF(AD358=\"\",\"\",#REF!)","v":""},"","","","","","","","","","","","","","","","","","","","","",""]
[null,null,null,null,null,null,null,null,null,null,null,null,null,null,null,null,null,null,null,"",null,null,null,null,null," ",null,{"$f":"IF(AC359=\"\",\"\",MAX($AB$3:AB358)+1)","v":""},"","","",{"$f":"IF(AB359=\"\",\"\",#REF!)","v":""},{"$f":"IF(AD359=\"\",\"\",#REF!)","v":""},"","","","","","","","","","","","","","","","","","","","","",""]
[null,null,null,null,null,null,null,null,null,null,null,null,null,null,null,null,null,null,null,"",null,null,null,null,null," ",null,{"$f":"IF(AC360=\"\",\"\",MAX($AB$3:AB359)+1)","v":""},"","","",{"$f":"IF(AB360=\"\",\"\",#REF!)","v":""},{"$f":"IF(AD360=\"\",\"\",#REF!)","v":""},"","","","","","","","","","","","","","","","","","","","","",""]
[null,null,null,null,null,null,null,null,null,null,null,null,null,null,null,null,null,null,null,"",null,null,null,null,null," ",null,{"$f":"IF(AC361=\"\",\"\",MAX($AB$3:AB360)+1)","v":""},"","","",{"$f":"IF(AB361=\"\",\"\",#REF!)","v":""},{"$f":"IF(AD361=\"\",\"\",#REF!)","v":""},"","","","","","","","","","","","","","","","","","","","","",""]
[null,null,null,null,null,null,null,null,null,null,null,null,null,null,null,null,null,null,null,"",null,null,null,null,null," ",null,{"$f":"IF(AC362=\"\",\"\",MAX($AB$3:AB361)+1)","v":""},"","","",{"$f":"IF(AB362=\"\",\"\",#REF!)","v":""},{"$f":"IF(AD362=\"\",\"\",#REF!)","v":""},"","","","","","","","","","","","","","","","","","","","","",""]
[null,null,null,null,null,null,null,null,null,null,null,null,null,null,null,null,null,null,null,"",null,null,null,null,null," ",null,{"$f":"IF(AC363=\"\",\"\",MAX($AB$3:AB362)+1)","v":""},"","","",{"$f":"IF(AB363=\"\",\"\",#REF!)","v":""},{"$f":"IF(AD363=\"\",\"\",#REF!)","v":""},"","","","","","","","","","","","","","","","","","","","","",""]
[null,null,null,null,null,null,null,null,null,null,null,null,null,null,null,null,null,null,null,"",null,null,null,null,null," ",null,{"$f":"IF(AC364=\"\",\"\",MAX($AB$3:AB363)+1)","v":""},"","","",{"$f":"IF(AB364=\"\",\"\",#REF!)","v":""},{"$f":"IF(AD364=\"\",\"\",#REF!)","v":""},"","","","","","","","","","","","","","","","","","","","","",""]
[null,null,null,null,null,null,null,null,null,null,null,null,null,null,null,null,null,null,null,"",null,null,null,null,null," ",null,{"$f":"IF(AC365=\"\",\"\",MAX($AB$3:AB364)+1)","v":""},"","","",{"$f":"IF(AB365=\"\",\"\",#REF!)","v":""},{"$f":"IF(AD365=\"\",\"\",#REF!)","v":""},"","","","","","","","","","","","","","","","","","","","","",""]
[null,null,null,null,null,null,null,null,null,null,null,null,null,null,null,null,null,null,null,"",null,null,null,null,null," ",null,{"$f":"IF(AC366=\"\",\"\",MAX($AB$3:AB365)+1)","v":""},"","","",{"$f":"IF(AB366=\"\",\"\",#REF!)","v":""},{"$f":"IF(AD366=\"\",\"\",#REF!)","v":""},"","","","","","","","","","","","","","","","","","","","","",""]
[null,null,null,null,null,null,null,null,null,null,null,null,null,null,null,null,null,null,null,"",null,null,null,null,null," ",null,{"$f":"IF(AC367=\"\",\"\",MAX($AB$3:AB366)+1)","v":""},"","","",{"$f":"IF(AB367=\"\",\"\",#REF!)","v":""},{"$f":"IF(AD367=\"\",\"\",#REF!)","v":""},"","","","","","","","","","","","","","","","","","","","","",""]
[null,null,null,null,null,null,null,null,null,null,null,null,null,null,null,null,null,null,null,"",null,null,null,null,null," ",null,{"$f":"IF(AC368=\"\",\"\",MAX($AB$3:AB367)+1)","v":""},"","","",{"$f":"IF(AB368=\"\",\"\",#REF!)","v":""},{"$f":"IF(AD368=\"\",\"\",#REF!)","v":""},"","","","","","","","","","","","","","","","","","","","","",""]
[null,null,null,null,null,null,null,null,null,null,null,null,null,null,null,null,null,null,null,"",null,null,null,null,null," ",null,{"$f":"IF(AC369=\"\",\"\",MAX($AB$3:AB368)+1)","v":""},"","","",{"$f":"IF(AB369=\"\",\"\",#REF!)","v":""},{"$f":"IF(AD369=\"\",\"\",#REF!)","v":""},"","","","","","","","","","","","","","","","","","","","","",""]
[null,null,null,null,null,null,null,null,null,null,null,null,null,null,null,null,null,null,null,"",null,null,null,null,null," ",null,{"$f":"IF(AC370=\"\",\"\",MAX($AB$3:AB369)+1)","v":""},"","","",{"$f":"IF(AB370=\"\",\"\",#REF!)","v":""},{"$f":"IF(AD370=\"\",\"\",#REF!)","v":""},"","","","","","","","","","","","","","","","","","","","","",""]
[null,null,null,null,null,null,null,null,null,null,null,null,null,null,null,null,null,null,null,"",null,null,null,null,null," ",null,{"$f":"IF(AC371=\"\",\"\",MAX($AB$3:AB370)+1)","v":""},"","","",{"$f":"IF(AB371=\"\",\"\",#REF!)","v":""},{"$f":"IF(AD371=\"\",\"\",#REF!)","v":""},"","","","","","","","","","","","","","","","","","","","","",""]
[null,null,null,null,null,null,null,null,null,null,null,null,null,null,null,null,null,null,null,"",null,null,null,null,null," ",null,{"$f":"IF(AC372=\"\",\"\",MAX($AB$3:AB371)+1)","v":""},"","","",{"$f":"IF(AB372=\"\",\"\",#REF!)","v":""},{"$f":"IF(AD372=\"\",\"\",#REF!)","v":""},"","","","","","","","","","","","","","","","","","","","","",""]
[null,null,null,null,null,null,null,null,null,null,null,null,null,null,null,null,null,null,null,"",null,null,null,null,null," ",null,{"$f":"IF(AC373=\"\",\"\",MAX($AB$3:AB372)+1)","v":""},"","","",{"$f":"IF(AB373=\"\",\"\",#REF!)","v":""},{"$f":"IF(AD373=\"\",\"\",#REF!)","v":""},"","","","","","","","","","","","","","","","","","","","","",""]
[null,null,null,null,null,null,null,null,null,null,null,null,null,null,null,null,null,null,null,"",null,null,null,null,null," ",null,{"$f":"IF(AC374=\"\",\"\",MAX($AB$3:AB373)+1)","v":""},"","","",{"$f":"IF(AB374=\"\",\"\",#REF!)","v":""},{"$f":"IF(AD374=\"\",\"\",#REF!)","v":""},"","","","","","","","","","","","","","","","","","","","","",""]
[null,null,null,null,null,null,null,null,null,null,null,null,null,null,null,null,null,null,null,"",null,null,null,null,null," ",null,{"$f":"IF(AC375=\"\",\"\",MAX($AB$3:AB374)+1)","v":""},"","","",{"$f":"IF(AB375=\"\",\"\",#REF!)","v":""},{"$f":"IF(AD375=\"\",\"\",#REF!)","v":""},"","","","","","","","","","","","","","","","","","","","","",""]
[null,null,null,null,null,null,null,null,null,null,null,null,null,null,null,null,null,null,null,"",null,null,null,null,null," ",null,{"$f":"IF(AC376=\"\",\"\",MAX($AB$3:AB375)+1)","v":""},"","","",{"$f":"IF(AB376=\"\",\"\",#REF!)","v":""},{"$f":"IF(AD376=\"\",\"\",#REF!)","v":""},"","","","","","","","","","","","","","","","","","","","","",""]
[null,null,null,null,null,null,null,null,null,null,null,null,null,null,null,null,null,null,null,"",null,null,null,null,null," ",null,{"$f":"IF(AC377=\"\",\"\",MAX($AB$3:AB376)+1)","v":""},"","","",{"$f":"IF(AB377=\"\",\"\",#REF!)","v":""},{"$f":"IF(AD377=\"\",\"\",#REF!)","v":""},"","","","","","","","","","","","","","","","","","","","","",""]
[null,null,null,null,null,null,null,null,null,null,null,null,null,null,null,null,null,null,null,"",null,null,null,null,null," ",null,{"$f":"IF(AC378=\"\",\"\",MAX($AB$3:AB377)+1)","v":""},"","","",{"$f":"IF(AB378=\"\",\"\",#REF!)","v":""},{"$f":"IF(AD378=\"\",\"\",#REF!)","v":""},"","","","","","","","","","","","","","","","","","","","","",""]
[null,null,null,null,null,null,null,null,null,null,null,null,null,null,null,null,null,null,null,"",null,null,null,null,null," ",null,{"$f":"IF(AC379=\"\",\"\",MAX($AB$3:AB378)+1)","v":""},"","","",{"$f":"IF(AB379=\"\",\"\",#REF!)","v":""},{"$f":"IF(AD379=\"\",\"\",#REF!)","v":""},"","","","","","","","","","","","","","","","","","","","","",""]
[null,null,null,null,null,null,null,null,null,null,null,null,null,null,null,null,null,null,null,"",null,null,null,null,null," ",null,{"$f":"IF(AC380=\"\",\"\",MAX($AB$3:AB379)+1)","v":""},"","","",{"$f":"IF(AB380=\"\",\"\",#REF!)","v":""},{"$f":"IF(AD380=\"\",\"\",#REF!)","v":""},"","","","","","","","","","","","","","","","","","","","","",""]
[null,null,null,null,null,null,null,null,null,null,null,null,null,null,null,null,null,null,null,"",null,null,null,null,null," ",null,{"$f":"IF(AC381=\"\",\"\",MAX($AB$3:AB380)+1)","v":""},"","","",{"$f":"IF(AB381=\"\",\"\",#REF!)","v":""},{"$f":"IF(AD381=\"\",\"\",#REF!)","v":""},"","","","","","","","","","","","","","","","","","","","","",""]
[null,null,null,null,null,null,null,null,null,null,null,null,null,null,null,null,null,null,null,"",null,null,null,null,null," ",null,{"$f":"IF(AC382=\"\",\"\",MAX($AB$3:AB381)+1)","v":""},"","","",{"$f":"IF(AB382=\"\",\"\",#REF!)","v":""},{"$f":"IF(AD382=\"\",\"\",#REF!)","v":""},"","","","","","","","","","","","","","","","","","","","","",""]
[null,null,null,null,null,null,null,null,null,null,null,null,null,null,null,null,null,null,null,"",null,null,null,null,null," ",null,{"$f":"IF(AC383=\"\",\"\",MAX($AB$3:AB382)+1)","v":""},"","","",{"$f":"IF(AB383=\"\",\"\",#REF!)","v":""},{"$f":"IF(AD383=\"\",\"\",#REF!)","v":""},"","","","","","","","","","","","","","","","","","","","","",""]
[null,null,null,null,null,null,null,null,null,null,null,null,null,null,null,null,null,null,null,"",null,null,null,null,null," ",null,{"$f":"IF(AC384=\"\",\"\",MAX($AB$3:AB383)+1)","v":""},"","","",{"$f":"IF(AB384=\"\",\"\",#REF!)","v":""},{"$f":"IF(AD384=\"\",\"\",#REF!)","v":""},"","","","","","","","","","","","","","","","","","","","","",""]
[null,null,null,null,null,null,null,null,null,null,null,null,null,null,null,null,null,null,null,"",null,null,null,null,null," ",null,{"$f":"IF(AC385=\"\",\"\",MAX($AB$3:AB384)+1)","v":""},"","","",{"$f":"IF(AB385=\"\",\"\",#REF!)","v":""},{"$f":"IF(AD385=\"\",\"\",#REF!)","v":""},"","","","","","","","","","","","","","","","","","","","","",""]
[null,null,null,null,null,null,null,null,null,null,null,null,null,null,null,null,null,null,null,"",null,null,null,null,null," ",null,{"$f":"IF(AC386=\"\",\"\",MAX($AB$3:AB385)+1)","v":""},"","","",{"$f":"IF(AB386=\"\",\"\",#REF!)","v":""},{"$f":"IF(AD386=\"\",\"\",#REF!)","v":""},"","","","","","","","","","","","","","","","","","","","","",""]
[null,null,null,null,null,null,null,null,null,null,null,null,null,null,null,null,null,null,null,"",null,null,null,null,null," ",null,{"$f":"IF(AC387=\"\",\"\",MAX($AB$3:AB386)+1)","v":""},"","","",{"$f":"IF(AB387=\"\",\"\",#REF!)","v":""},{"$f":"IF(AD387=\"\",\"\",#REF!)","v":""},"","","","","","","","","","","","","","","","","","","","","",""]
[null,null,null,null,null,null,null,null,null,null,null,null,null,null,null,null,null,null,null,"",null,null,null,null,null," ",null,{"$f":"IF(AC388=\"\",\"\",MAX($AB$3:AB387)+1)","v":""},"","","",{"$f":"IF(AB388=\"\",\"\",#REF!)","v":""},{"$f":"IF(AD388=\"\",\"\",#REF!)","v":""},"","","","","","","","","","","","","","","","","","","","","",""]
[null,null,null,null,null,null,null,null,null,null,null,null,null,null,null,null,null,null,null,"",null,null,null,null,null," ",null,{"$f":"IF(AC389=\"\",\"\",MAX($AB$3:AB388)+1)","v":""},"","","",{"$f":"IF(AB389=\"\",\"\",#REF!)","v":""},{"$f":"IF(AD389=\"\",\"\",#REF!)","v":""},"","","","","","","","","","","","","","","","","","","","","",""]
[null,null,null,null,null,null,null,null,null,null,null,null,null,null,null,null,null,null,null,"",null,null,null,null,null," ",null,{"$f":"IF(AC390=\"\",\"\",MAX($AB$3:AB389)+1)","v":""},"","","",{"$f":"IF(AB390=\"\",\"\",#REF!)","v":""},{"$f":"IF(AD390=\"\",\"\",#REF!)","v":""},"","","","","","","","","","","","","","","","","","","","","",""]
[null,null,null,null,null,null,null,null,null,null,null,null,null,null,null,null,null,null,null,"",null,null,null,null,null," ",null,{"$f":"IF(AC391=\"\",\"\",MAX($AB$3:AB390)+1)","v":""},"","","",{"$f":"IF(AB391=\"\",\"\",#REF!)","v":""},{"$f":"IF(AD391=\"\",\"\",#REF!)","v":""},"","","","","","","","","","","","","","","","","","","","","",""]
[null,null,null,null,null,null,null,null,null,null,null,null,null,null,null,null,null,null,null,"",null,null,null,null,null," ",null,{"$f":"IF(AC392=\"\",\"\",MAX($AB$3:AB391)+1)","v":""},"","","",{"$f":"IF(AB392=\"\",\"\",#REF!)","v":""},{"$f":"IF(AD392=\"\",\"\",#REF!)","v":""},"","","","","","","","","","","","","","","","","","","","","",""]
[null,null,null,null,null,null,null,null,null,null,null,null,null,null,null,null,null,null,null,"",null,null,null,null,null," ",null,{"$f":"IF(AC393=\"\",\"\",MAX($AB$3:AB392)+1)","v":""},"","","",{"$f":"IF(AB393=\"\",\"\",#REF!)","v":""},{"$f":"IF(AD393=\"\",\"\",#REF!)","v":""},"","","","","","","","","","","","","","","","","","","","","",""]
[null,null,null,null,null,null,null,null,null,null,null,null,null,null,null,null,null,null,null,"",null,null,null,null,null," ",null,{"$f":"IF(AC394=\"\",\"\",MAX($AB$3:AB393)+1)","v":""},"","","",{"$f":"IF(AB394=\"\",\"\",#REF!)","v":""},{"$f":"IF(AD394=\"\",\"\",#REF!)","v":""},"","","","","","","","","","","","","","","","","","","","","",""]
[null,null,null,null,null,null,null,null,null,null,null,null,null,null,null,null,null,null,null,"",null,null,null,null,null," ",null,{"$f":"IF(AC395=\"\",\"\",MAX($AB$3:AB394)+1)","v":""},"","","",{"$f":"IF(AB395=\"\",\"\",#REF!)","v":""},{"$f":"IF(AD395=\"\",\"\",#REF!)","v":""},"","","","","","","","","","","","","","","","","","","","","",""]
[null,null,null,null,null,null,null,null,null,null,null,null,null,null,null,null,null,null,null,"",null,null,null,null,null," ",null,{"$f":"IF(AC396=\"\",\"\",MAX($AB$3:AB395)+1)","v":""},"","","",{"$f":"IF(AB396=\"\",\"\",#REF!)","v":""},{"$f":"IF(AD396=\"\",\"\",#REF!)","v":""},"","","","","","","","","","","","","","","","","","","","","",""]
[null,null,null,null,null,null,null,null,null,null,null,null,null,null,null,null,null,null,null,"",null,null,null,null,null," ",null,{"$f":"IF(AC397=\"\",\"\",MAX($AB$3:AB396)+1)","v":""},"","","",{"$f":"IF(AB397=\"\",\"\",#REF!)","v":""},{"$f":"IF(AD397=\"\",\"\",#REF!)","v":""},"","","","","","","","","","","","","","","","","","","","","",""]
[null,null,null,null,null,null,null,null,null,null,null,null,null,null,null,null,null,null,null,"",null,null,null,null,null," ",null,{"$f":"IF(AC398=\"\",\"\",MAX($AB$3:AB397)+1)","v":""},"","","",{"$f":"IF(AB398=\"\",\"\",#REF!)","v":""},{"$f":"IF(AD398=\"\",\"\",#REF!)","v":""},"","","","","","","","","","","","","","","","","","","","","",""]
[null,null,null,null,null,null,null,null,null,null,null,null,null,null,null,null,null,null,null,"",null,null,null,null,null," ",null,{"$f":"IF(AC399=\"\",\"\",MAX($AB$3:AB398)+1)","v":""},"","","",{"$f":"IF(AB399=\"\",\"\",#REF!)","v":""},{"$f":"IF(AD399=\"\",\"\",#REF!)","v":""},"","","","","","","","","","","","","","","","","","","","","",""]
[null,null,null,null,null,null,null,null,null,null,null,null,null,null,null,null,null,null,null,"",null,null,null,null,null," ",null,{"$f":"IF(AC400=\"\",\"\",MAX($AB$3:AB399)+1)","v":""},"","","",{"$f":"IF(AB400=\"\",\"\",#REF!)","v":""},{"$f":"IF(AD400=\"\",\"\",#REF!)","v":""},"","","","","","","","","","","","","","","","","","","","","",""]
[null,null,null,null,null,null,null,null,null,null,null,null,null,null,null,null,null,null,null,"",null,null,null,null,null," ",null,{"$f":"IF(AC401=\"\",\"\",MAX($AB$3:AB400)+1)","v":""},{"$f":"IF(C401=\"\",\"\",IF(B401=$AB$1,C401,\"\"))","v":""},{"$f":"IF(AB401=\"\",\"\",B401)","v":""},{"$f":"IF(AB401=\"\",\"\",E401)","v":""},{"$f":"IF(AB401=\"\",\"\",#REF!)","v":""},{"$f":"IF(AD401=\"\",\"\",#REF!)","v":""},{"$f":"IF(AD401=\"\",\"\",U401)","v":""},{"$f":"IF(AD401=\"\",\"\",V401)","v":""},{"$f":"IF(AD401=\"\",\"\",W401)","v":""},{"$f":"IF(AH401=\"\",\"\",X401)","v":""},{"$f":"IF(AI401=\"\",\"\",Y401)","v":""},{"$f":"IF(AE401=\"\",\"\",D401)","v":""},{"$f":"IF(AE401=\"\",\"\",X401)","v":""},{"$f":"IF(AE401=\"\",\"\",Y401)","v":""},{"$f":"IF(AD401=\"\",\"\",F401)","v":""},{"$f":"IF(AE401=\"\",\"\",G401)","v":""},{"$f":"IF(AD401=\"\",\"\",H401)","v":""},{"$f":"IF(AD401=\"\",\"\",I401)","v":""},{"$f":"IF(AH401=\"\",\"\",J401)","v":""},{"$f":"IF(AI401=\"\",\"\",K401)","v":""},{"$f":"IF(AJ401=\"\",\"\",L401)","v":""},{"$f":"IF(AK401=\"\",\"\",M401)","v":""},{"$f":"IF(AL401=\"\",\"\",N401)","v":""},{"$f":"IF(AM401=\"\",\"\",O401)","v":""},{"$f":"IF(AN401=\"\",\"\",P401)","v":""},{"$f":"IF(AO401=\"\",\"\",Q401)","v":""},{"$f":"IF(AP401=\"\",\"\",R401)","v":""},{"$f":"IF(AQ401=\"\",\"\",S401)","v":""}]
[null,null,null,null,null,null,null,null,null,null,null,null,null,null,null,null,null,null,null,{"$f":"IF(AND(C402=\"\",B402=\"\"),\"\",B402+1095)","v":""},null,null,null,null,null," ",null,{"$f":"IF(AC402=\"\",\"\",MAX($AB$3:AB401)+1)","v":""},"","","",{"$f":"IF(AB402=\"\",\"\",#REF!)","v":""},{"$f":"IF(AD402=\"\",\"\",#REF!)","v":""},"","","","","","","","","","","","","","","","","","","","","",""]
[null,null,null,null,null,null,null,null,null,null,null,null,null,null,null,null,null,null,null,"",null,null,null,null,null," ",null,{"$f":"IF(AC403=\"\",\"\",MAX($AB$3:AB402)+1)","v":""},"","","",{"$f":"IF(AB403=\"\",\"\",#REF!)","v":""},{"$f":"IF(AD403=\"\",\"\",#REF!)","v":""},"","","","","","","","","","","","","","","","","","","","","",""]
[null,null,null,null,null,null,null,null,null,null,null,null,null,null,null,null,null,null,null,"",null,null,null,null,null," ",null,{"$f":"IF(AC404=\"\",\"\",MAX($AB$3:AB403)+1)","v":""},"","","",{"$f":"IF(AB404=\"\",\"\",#REF!)","v":""},{"$f":"IF(AD404=\"\",\"\",#REF!)","v":""},"","","","","","","","","","","","","","","","","","","","","",""]
[null,null,null,null,null,null,null,null,null,null,null,null,null,null,null,null,null,null,null,"",null,null,null,null,null," ",null,{"$f":"IF(AC405=\"\",\"\",MAX($AB$3:AB404)+1)","v":""},"","","",{"$f":"IF(AB405=\"\",\"\",#REF!)","v":""},{"$f":"IF(AD405=\"\",\"\",#REF!)","v":""},"","","","","","","","","","","","","","","","","","","","","",""]
[null,null,null,null,null,null,null,null,null,null,null,null,null,null,null,null,null,null,null,"",null,null,null,null,null," ",null,{"$f":"IF(AC406=\"\",\"\",MAX($AB$3:AB405)+1)","v":""},"","","",{"$f":"IF(AB406=\"\",\"\",#REF!)","v":""},{"$f":"IF(AD406=\"\",\"\",#REF!)","v":""},"","","","","","","","","","","","","","","","","","","","","",""]
[null,null,null,null,null,null,null,null,null,null,null,null,null,null,null,null,null,null,null,"",null,null,null,null,null," ",null,{"$f":"IF(AC407=\"\",\"\",MAX($AB$3:AB406)+1)","v":""},"","","",{"$f":"IF(AB407=\"\",\"\",#REF!)","v":""},{"$f":"IF(AD407=\"\",\"\",#REF!)","v":""},"","","","","","","","","","","","","","","","","","","","","",""]
[null,null,null,null,null,null,null,null,null,null,null,null,null,null,null,null,null,null,null,"",null,null,null,null,null," ",null,{"$f":"IF(AC408=\"\",\"\",MAX($AB$3:AB407)+1)","v":""},"","","",{"$f":"IF(AB408=\"\",\"\",#REF!)","v":""},{"$f":"IF(AD408=\"\",\"\",#REF!)","v":""},"","","","","","","","","","","","","","","","","","","","","",""]
[null,null,null,null,null,null,null,null,null,null,null,null,null,null,null,null,null,null,null,"",null,null,null,null,null," ",null,{"$f":"IF(AC409=\"\",\"\",MAX($AB$3:AB408)+1)","v":""},"","","",{"$f":"IF(AB409=\"\",\"\",#REF!)","v":""},{"$f":"IF(AD409=\"\",\"\",#REF!)","v":""},"","","","","","","","","","","","","","","","","","","","","",""]
[null,null,null,null,null,null,null,null,null,null,null,null,null,null,null,null,null,null,null,"",null,null,null,null,null," ",null,{"$f":"IF(AC410=\"\",\"\",MAX($AB$3:AB409)+1)","v":""},"","","",{"$f":"IF(AB410=\"\",\"\",#REF!)","v":""},{"$f":"IF(AD410=\"\",\"\",#REF!)","v":""},"","","","","","","","","","","","","","","","","","","","","",""]
[null,null,null,null,null,null,null,null,null,null,null,null,null,null,null,null,null,null,null,"",null,null,null,null,null," ",null,{"$f":"IF(AC411=\"\",\"\",MAX($AB$3:AB410)+1)","v":""},"","","",{"$f":"IF(AB411=\"\",\"\",#REF!)","v":""},{"$f":"IF(AD411=\"\",\"\",#REF!)","v":""},"","","","","","","","","","","","","","","","","","","","","",""]
[null,null,null,null,null,null,null,null,null,null,null,null,null,null,null,null,null,null,null,"",null,null,null,null,null," ",null,{"$f":"IF(AC412=\"\",\"\",MAX($AB$3:AB411)+1)","v":""},"","","",{"$f":"IF(AB412=\"\",\"\",#REF!)","v":""},{"$f":"IF(AD412=\"\",\"\",#REF!)","v":""},"","","","","","","","","","","","","","","","","","","","","",""]
[null,null,null,null,null,null,null,null,null,null,null,null,null,null,null,null,null,null,null,"",null,null,null,null,null," ",null,{"$f":"IF(AC413=\"\",\"\",MAX($AB$3:AB412)+1)","v":""},"","","",{"$f":"IF(AB413=\"\",\"\",#REF!)","v":""},{"$f":"IF(AD413=\"\",\"\",#REF!)","v":""},"","","","","","","","","","","","","","","","","","","","","",""]
[null,null,null,null,null,null,null,null,null,null,null,null,null,null,null,null,null,null,null,"",null,null,null,null,null," ",null,{"$f":"IF(AC414=\"\",\"\",MAX($AB$3:AB413)+1)","v":""},"","","",{"$f":"IF(AB414=\"\",\"\",#REF!)","v":""},{"$f":"IF(AD414=\"\",\"\",#REF!)","v":""},"","","","","","","","","","","","","","","","","","","","","",""]
[null,null,null,null,null,null,null,null,null,null,null,null,null,null,null,null,null,null,null,"",null,null,null,null,null," ",null,{"$f":"IF(AC415=\"\",\"\",MAX($AB$3:AB414)+1)","v":""},"","","",{"$f":"IF(AB415=\"\",\"\",#REF!)","v":""},{"$f":"IF(AD415=\"\",\"\",#REF!)","v":""},"","","","","","","","","","","","","","","","","","","","","",""]
[null,null,null,null,null,null,null,null,null,null,null,null,null,null,null,null,null,null,null,"",null,null,null,null,null," ",null,{"$f":"IF(AC416=\"\",\"\",MAX($AB$3:AB415)+1)","v":""},"","","",{"$f":"IF(AB416=\"\",\"\",#REF!)","v":""},{"$f":"IF(AD416=\"\",\"\",#REF!)","v":""},"","","","","","","","","","","","","","","","","","","","","",""]
[null,null,null,null,null,null,null,null,null,null,null,null,null,null,null,null,null,null,null,"",null,null,null,null,null," ",null,{"$f":"IF(AC417=\"\",\"\",MAX($AB$3:AB416)+1)","v":""},"","","",{"$f":"IF(AB417=\"\",\"\",#REF!)","v":""},{"$f":"IF(AD417=\"\",\"\",#REF!)","v":""},"","","","","","","","","","","","","","","","","","","","","",""]
[null,null,null,null,null,null,null,null,null,null,null,null,null,null,null,null,null,null,null,"",null,null,null,null,null," ",null,{"$f":"IF(AC418=\"\",\"\",MAX($AB$3:AB417)+1)","v":""},"","","",{"$f":"IF(AB418=\"\",\"\",#REF!)","v":""},{"$f":"IF(AD418=\"\",\"\",#REF!)","v":""},"","","","","","","","","","","","","","","","","","","","","",""]
[null,null,null,null,null,null,null,null,null,null,null,null,null,null,null,null,null,null,null,"",null,null,null,null,null," ",null,{"$f":"IF(AC419=\"\",\"\",MAX($AB$3:AB418)+1)","v":""},"","","",{"$f":"IF(AB419=\"\",\"\",#REF!)","v":""},{"$f":"IF(AD419=\"\",\"\",#REF!)","v":""},"","","","","","","","","","","","","","","","","","","","","",""]
[null,null,null,null,null,null,null,null,null,null,null,null,null,null,null,null,null,null,null,"",null,null,null,null,null," ",null,{"$f":"IF(AC420=\"\",\"\",MAX($AB$3:AB419)+1)","v":""},"","","",{"$f":"IF(AB420=\"\",\"\",#REF!)","v":""},{"$f":"IF(AD420=\"\",\"\",#REF!)","v":""},"","","","","","","","","","","","","","","","","","","","","",""]
[null,null,null,null,null,null,null,null,null,null,null,null,null,null,null,null,null,null,null,"",null,null,null,null,null," ",null,{"$f":"IF(AC421=\"\",\"\",MAX($AB$3:AB420)+1)","v":""},"","","",{"$f":"IF(AB421=\"\",\"\",#REF!)","v":""},{"$f":"IF(AD421=\"\",\"\",#REF!)","v":""},"","","","","","","","","","","","","","","","","","","","","",""]
[null,null,null,null,null,null,null,null,null,null,null,null,null,null,null,null,null,null,null,"",null,null,null,null,null," ",null,{"$f":"IF(AC422=\"\",\"\",MAX($AB$3:AB421)+1)","v":""},"","","",{"$f":"IF(AB422=\"\",\"\",#REF!)","v":""},{"$f":"IF(AD422=\"\",\"\",#REF!)","v":""},"","","","","","","","","","","","","","","","","","","","","",""]
[null,null,null,null,null,null,null,null,null,null,null,null,null,null,null,null,null,null,null,"",null,null,null,null,null," ",null,{"$f":"IF(AC423=\"\",\"\",MAX($AB$3:AB422)+1)","v":""},"","","",{"$f":"IF(AB423=\"\",\"\",#REF!)","v":""},{"$f":"IF(AD423=\"\",\"\",#REF!)","v":""},"","","","","","","","","","","","","","","","","","","","","",""]
[null,null,null,null,null,null,null,null,null,null,null,null,null,null,null,null,null,null,null,"",null,null,null,null,null," ",null,{"$f":"IF(AC424=\"\",\"\",MAX($AB$3:AB423)+1)","v":""},"","","",{"$f":"IF(AB424=\"\",\"\",#REF!)","v":""},{"$f":"IF(AD424=\"\",\"\",#REF!)","v":""},"","","","","","","","","","","","","","","","","","","","","",""]
[null,null,null,null,null,null,null,null,null,null,null,null,null,null,null,null,null,null,null,"",null,null,null,null,null," ",null,{"$f":"IF(AC425=\"\",\"\",MAX($AB$3:AB424)+1)","v":""},"","","",{"$f":"IF(AB425=\"\",\"\",#REF!)","v":""},{"$f":"IF(AD425=\"\",\"\",#REF!)","v":""},"","","","","","","","","","","","","","","","","","","","","",""]
[null,null,null,null,null,null,null,null,null,null,null,null,null,null,null,null,null,null,null,"",null,null,null,null,null," ",null,{"$f":"IF(AC426=\"\",\"\",MAX($AB$3:AB425)+1)","v":""},"","","",{"$f":"IF(AB426=\"\",\"\",#REF!)","v":""},{"$f":"IF(AD426=\"\",\"\",#REF!)","v":""},"","","","","","","","","","","","","","","","","","","","","",""]
[null,null,null,null,null,null,null,null,null,null,null,null,null,null,null,null,null,null,null,"",null,null,null,null,null," ",null,{"$f":"IF(AC427=\"\",\"\",MAX($AB$3:AB426)+1)","v":""},"","","",{"$f":"IF(AB427=\"\",\"\",#REF!)","v":""},{"$f":"IF(AD427=\"\",\"\",#REF!)","v":""},"","","","","","","","","","","","","","","","","","","","","",""]
[null,null,null,null,null,null,null,null,null,null,null,null,null,null,null,null,null,null,null,"",null,null,null,null,null," ",null,{"$f":"IF(AC428=\"\",\"\",MAX($AB$3:AB427)+1)","v":""},"","","",{"$f":"IF(AB428=\"\",\"\",#REF!)","v":""},{"$f":"IF(AD428=\"\",\"\",#REF!)","v":""},"","","","","","","","","","","","","","","","","","","","","",""]
[null,null,null,null,null,null,null,null,null,null,null,null,null,null,null,null,null,null,null,"",null,null,null,null,null," ",null,{"$f":"IF(AC429=\"\",\"\",MAX($AB$3:AB428)+1)","v":""},"","","",{"$f":"IF(AB429=\"\",\"\",#REF!)","v":""},{"$f":"IF(AD429=\"\",\"\",#REF!)","v":""},"","","","","","","","","","","","","","","","","","","","","",""]
[null,null,null,null,null,null,null,null,null,null,null,null,null,null,null,null,null,null,null,"",null,null,null,null,null," ",null,{"$f":"IF(AC430=\"\",\"\",MAX($AB$3:AB429)+1)","v":""},"","","",{"$f":"IF(AB430=\"\",\"\",#REF!)","v":""},{"$f":"IF(AD430=\"\",\"\",#REF!)","v":""},"","","","","","","","","","","","","","","","","","","","","",""]
[null,null,null,null,null,null,null,null,null,null,null,null,null,null,null,null,null,null,null,"",null,null,null,null,null," ",null,{"$f":"IF(AC431=\"\",\"\",MAX($AB$3:AB430)+1)","v":""},"","","",{"$f":"IF(AB431=\"\",\"\",#REF!)","v":""},{"$f":"IF(AD431=\"\",\"\",#REF!)","v":""},"","","","","","","","","","","","","","","","","","","","","",""]
[null,null,null,null,null,null,null,null,null,null,null,null,null,null,null,null,null,null,null,"",null,null,null,null,null," ",null,{"$f":"IF(AC432=\"\",\"\",MAX($AB$3:AB431)+1)","v":""},"","","",{"$f":"IF(AB432=\"\",\"\",#REF!)","v":""},{"$f":"IF(AD432=\"\",\"\",#REF!)","v":""},"","","","","","","","","","","","","","","","","","","","","",""]
[null,null,null,null,null,null,null,null,null,null,null,null,null,null,null,null,null,null,null,"",null,null,null,null,null," ",null,{"$f":"IF(AC433=\"\",\"\",MAX($AB$3:AB432)+1)","v":""},"","","",{"$f":"IF(AB433=\"\",\"\",#REF!)","v":""},{"$f":"IF(AD433=\"\",\"\",#REF!)","v":""},"","","","","","","","","","","","","","","","","","","","","",""]
[null,null,null,null,null,null,null,null,null,null,null,null,null,null,null,null,null,null,null,"",null,null,null,null,null," ",null,{"$f":"IF(AC434=\"\",\"\",MAX($AB$3:AB433)+1)","v":""},"","","",{"$f":"IF(AB434=\"\",\"\",#REF!)","v":""},{"$f":"IF(AD434=\"\",\"\",#REF!)","v":""},"","","","","","","","","","","","","","","","","","","","","",""]
[null,null,null,null,null,null,null,null,null,null,null,null,null,null,null,null,null,null,null,"",null,null,null,null,null," ",null,{"$f":"IF(AC435=\"\",\"\",MAX($AB$3:AB434)+1)","v":""},"","","",{"$f":"IF(AB435=\"\",\"\",#REF!)","v":""},{"$f":"IF(AD435=\"\",\"\",#REF!)","v":""},"","","","","","","","","","","","","","","","","","","","","",""]
[null,null,null,null,null,null,null,null,null,null,null,null,null,null,null,null,null,null,null,"",null,null,null,null,null," ",null,{"$f":"IF(AC436=\"\",\"\",MAX($AB$3:AB435)+1)","v":""},"","","",{"$f":"IF(AB436=\"\",\"\",#REF!)","v":""},{"$f":"IF(AD436=\"\",\"\",#REF!)","v":""},"","","","","","","","","","","","","","","","","","","","","",""]
[null,null,null,null,null,null,null,null,null,null,null,null,null,null,null,null,null,null,null,"",null,null,null,null,null," ",null,{"$f":"IF(AC437=\"\",\"\",MAX($AB$3:AB436)+1)","v":""},"","","",{"$f":"IF(AB437=\"\",\"\",#REF!)","v":""},{"$f":"IF(AD437=\"\",\"\",#REF!)","v":""},"","","","","","","","","","","","","","","","","","","","","",""]
[null,null,null,null,null,null,null,null,null,null,null,null,null,null,null,null,null,null,null,"",null,null,null,null,null," ",null,{"$f":"IF(AC438=\"\",\"\",MAX($AB$3:AB437)+1)","v":""},"","","",{"$f":"IF(AB438=\"\",\"\",#REF!)","v":""},{"$f":"IF(AD438=\"\",\"\",#REF!)","v":""},"","","","","","","","","","","","","","","","","","","","","",""]
[null,null,null,null,null,null,null,null,null,null,null,null,null,null,null,null,null,null,null,"",null,null,null,null,null," ",null,{"$f":"IF(AC439=\"\",\"\",MAX($AB$3:AB438)+1)","v":""},"","","",{"$f":"IF(AB439=\"\",\"\",#REF!)","v":""},{"$f":"IF(AD439=\"\",\"\",#REF!)","v":""},"","","","","","","","","","","","","","","","","","","","","",""]
[null,null,null,null,null,null,null,null,null,null,null,null,null,null,null,null,null,null,null,"",null,null,null,null,null," ",null,{"$f":"IF(AC440=\"\",\"\",MAX($AB$3:AB439)+1)","v":""},"","","",{"$f":"IF(AB440=\"\",\"\",#REF!)","v":""},{"$f":"IF(AD440=\"\",\"\",#REF!)","v":""},"","","","","","","","","","","","","","","","","","","","","",""]
[null,null,null,null,null,null,null,null,null,null,null,null,null,null,null,null,null,null,null,"",null,null,null,null,null," ",null,{"$f":"IF(AC441=\"\",\"\",MAX($AB$3:AB440)+1)","v":""},"","","",{"$f":"IF(AB441=\"\",\"\",#REF!)","v":""},{"$f":"IF(AD441=\"\",\"\",#REF!)","v":""},"","","","","","","","","","","","","","","","","","","","","",""]
[null,null,null,null,null,null,null,null,null,null,null,null,null,null,null,null,null,null,null,"",null,null,null,null,null," ",null,{"$f":"IF(AC442=\"\",\"\",MAX($AB$3:AB441)+1)","v":""},"","","",{"$f":"IF(AB442=\"\",\"\",#REF!)","v":""},{"$f":"IF(AD442=\"\",\"\",#REF!)","v":""},"","","","","","","","","","","","","","","","","","","","","",""]
[null,null,null,null,null,null,null,null,null,null,null,null,null,null,null,null,null,null,null,"",null,null,null,null,null," ",null,{"$f":"IF(AC443=\"\",\"\",MAX($AB$3:AB442)+1)","v":""},"","","",{"$f":"IF(AB443=\"\",\"\",#REF!)","v":""},{"$f":"IF(AD443=\"\",\"\",#REF!)","v":""},"","","","","","","","","","","","","","","","","","","","","",""]
[null,null,null,null,null,null,null,null,null,null,null,null,null,null,null,null,null,null,null,"",null,null,null,null,null," ",null,{"$f":"IF(AC444=\"\",\"\",MAX($AB$3:AB443)+1)","v":""},"","","",{"$f":"IF(AB444=\"\",\"\",#REF!)","v":""},{"$f":"IF(AD444=\"\",\"\",#REF!)","v":""},"","","","","","","","","","","","","","","","","","","","","",""]
[null,null,null,null,null,null,null,null,null,null,null,null,null,null,null,null,null,null,null,"",null,null,null,null,null," ",null,{"$f":"IF(AC445=\"\",\"\",MAX($AB$3:AB444)+1)","v":""},"","","",{"$f":"IF(AB445=\"\",\"\",#REF!)","v":""},{"$f":"IF(AD445=\"\",\"\",#REF!)","v":""},"","","","","","","","","","","","","","","","","","","","","",""]
[null,null,null,null,null,null,null,null,null,null,null,null,null,null,null,null,null,null,null,"",null,null,null,null,null," ",null,{"$f":"IF(AC446=\"\",\"\",MAX($AB$3:AB445)+1)","v":""},"","","",{"$f":"IF(AB446=\"\",\"\",#REF!)","v":""},{"$f":"IF(AD446=\"\",\"\",#REF!)","v":""},"","","","","","","","","","","","","","","","","","","","","",""]
[null,null,null,null,null,null,null,null,null,null,null,null,null,null,null,null,null,null,null,"",null,null,null,null,null," ",null,{"$f":"IF(AC447=\"\",\"\",MAX($AB$3:AB446)+1)","v":""},"","","",{"$f":"IF(AB447=\"\",\"\",#REF!)","v":""},{"$f":"IF(AD447=\"\",\"\",#REF!)","v":""},"","","","","","","","","","","","","","","","","","","","","",""]
[null,null,null,null,null,null,null,null,null,null,null,null,null,null,null,null,null,null,null,"",null,null,null,null,null," ",null,{"$f":"IF(AC448=\"\",\"\",MAX($AB$3:AB447)+1)","v":""},"","","",{"$f":"IF(AB448=\"\",\"\",#REF!)","v":""},{"$f":"IF(AD448=\"\",\"\",#REF!)","v":""},"","","","","","","","","","","","","","","","","","","","","",""]
[null,null,null,null,null,null,null,null,null,null,null,null,null,null,null,null,null,null,null,"",null,null,null,null,null," ",null,{"$f":"IF(AC449=\"\",\"\",MAX($AB$3:AB448)+1)","v":""},"","","",{"$f":"IF(AB449=\"\",\"\",#REF!)","v":""},{"$f":"IF(AD449=\"\",\"\",#REF!)","v":""},"","","","","","","","","","","","","","","","","","","","","",""]
[null,null,null,null,null,null,null,null,null,null,null,null,null,null,null,null,null,null,null,"",null,null,null,null,null," ",null,{"$f":"IF(AC450=\"\",\"\",MAX($AB$3:AB449)+1)","v":""},"","","",{"$f":"IF(AB450=\"\",\"\",#REF!)","v":""},{"$f":"IF(AD450=\"\",\"\",#REF!)","v":""},"","","","","","","","","","","","","","","","","","","","","",""]
[null,null,null,null,null,null,null,null,null,null,null,null,null,null,null,null,null,null,null,"",null,null,null,null,null," ",null,{"$f":"IF(AC451=\"\",\"\",MAX($AB$3:AB450)+1)","v":""},"","","",{"$f":"IF(AB451=\"\",\"\",#REF!)","v":""},{"$f":"IF(AD451=\"\",\"\",#REF!)","v":""},"","","","","","","","","","","","","","","","","","","","","",""]
[null,null,null,null,null,null,null,null,null,null,null,null,null,null,null,null,null,null,null,"",null,null,null,null,null," ",null,{"$f":"IF(AC452=\"\",\"\",MAX($AB$3:AB451)+1)","v":""},"","","",{"$f":"IF(AB452=\"\",\"\",#REF!)","v":""},{"$f":"IF(AD452=\"\",\"\",#REF!)","v":""},"","","","","","","","","","","","","","","","","","","","","",""]
[null,null,null,null,null,null,null,null,null,null,null,null,null,null,null,null,null,null,null,"",null,null,null,null,null," ",null,{"$f":"IF(AC453=\"\",\"\",MAX($AB$3:AB452)+1)","v":""},"","","",{"$f":"IF(AB453=\"\",\"\",#REF!)","v":""},{"$f":"IF(AD453=\"\",\"\",#REF!)","v":""},"","","","","","","","","","","","","","","","","","","","","",""]
[null,null,null,null,null,null,null,null,null,null,null,null,null,null,null,null,null,null,null,"",null,null,null,null,null," ",null,{"$f":"IF(AC454=\"\",\"\",MAX($AB$3:AB453)+1)","v":""},"","","",{"$f":"IF(AB454=\"\",\"\",#REF!)","v":""},{"$f":"IF(AD454=\"\",\"\",#REF!)","v":""},"","","","","","","","","","","","","","","","","","","","","",""]
[null,null,null,null,null,null,null,null,null,null,null,null,null,null,null,null,null,null,null,"",null,null,null,null,null," ",null,{"$f":"IF(AC455=\"\",\"\",MAX($AB$3:AB454)+1)","v":""},"","","",{"$f":"IF(AB455=\"\",\"\",#REF!)","v":""},{"$f":"IF(AD455=\"\",\"\",#REF!)","v":""},"","","","","","","","","","","","","","","","","","","","","",""]
[null,null,null,null,null,null,null,null,null,null,null,null,null,null,null,null,null,null,null,"",null,null,null,null,null," ",null,{"$f":"IF(AC456=\"\",\"\",MAX($AB$3:AB455)+1)","v":""},"","","",{"$f":"IF(AB456=\"\",\"\",#REF!)","v":""},{"$f":"IF(AD456=\"\",\"\",#REF!)","v":""},"","","","","","","","","","","","","","","","","","","","","",""]
[null,null,null,null,null,null,null,null,null,null,null,null,null,null,null,null,null,null,null,"",null,null,null,null,null," ",null,{"$f":"IF(AC457=\"\",\"\",MAX($AB$3:AB456)+1)","v":""},"","","",{"$f":"IF(AB457=\"\",\"\",#REF!)","v":""},{"$f":"IF(AD457=\"\",\"\",#REF!)","v":""},"","","","","","","","","","","","","","","","","","","","","",""]
[null,null,null,null,null,null,null,null,null,null,null,null,null,null,null,null,null,null,null,"",null,null,null,null,null," ",null,{"$f":"IF(AC458=\"\",\"\",MAX($AB$3:AB457)+1)","v":""},"","","",{"$f":"IF(AB458=\"\",\"\",#REF!)","v":""},{"$f":"IF(AD458=\"\",\"\",#REF!)","v":""},"","","","","","","","","","","","","","","","","","","","","",""]
[null,null,null,null,null,null,null,null,null,null,null,null,null,null,null,null,null,null,null,"",null,null,null,null,null," ",null,{"$f":"IF(AC459=\"\",\"\",MAX($AB$3:AB458)+1)","v":""},"","","",{"$f":"IF(AB459=\"\",\"\",#REF!)","v":""},{"$f":"IF(AD459=\"\",\"\",#REF!)","v":""},"","","","","","","","","","","","","","","","","","","","","",""]
[null,null,null,null,null,null,null,null,null,null,null,null,null,null,null,null,null,null,null,"",null,null,null,null,null," ",null,{"$f":"IF(AC460=\"\",\"\",MAX($AB$3:AB459)+1)","v":""},"","","",{"$f":"IF(AB460=\"\",\"\",#REF!)","v":""},{"$f":"IF(AD460=\"\",\"\",#REF!)","v":""},"","","","","","","","","","","","","","","","","","","","","",""]
[null,null,null,null,null,null,null,null,null,null,null,null,null,null,null,null,null,null,null,"",null,null,null,null,null," ",null,{"$f":"IF(AC461=\"\",\"\",MAX($AB$3:AB460)+1)","v":""},"","","",{"$f":"IF(AB461=\"\",\"\",#REF!)","v":""},{"$f":"IF(AD461=\"\",\"\",#REF!)","v":""},"","","","","","","","","","","","","","","","","","","","","",""]
[null,null,null,null,null,null,null,null,null,null,null,null,null,null,null,null,null,null,null,"",null,null,null,null,null," ",null,{"$f":"IF(AC462=\"\",\"\",MAX($AB$3:AB461)+1)","v":""},"","","",{"$f":"IF(AB462=\"\",\"\",#REF!)","v":""},{"$f":"IF(AD462=\"\",\"\",#REF!)","v":""},"","","","","","","","","","","","","","","","","","","","","",""]
[null,null,null,null,null,null,null,null,null,null,null,null,null,null,null,null,null,null,null,"",null,null,null,null,null," ",null,{"$f":"IF(AC463=\"\",\"\",MAX($AB$3:AB462)+1)","v":""},"","","",{"$f":"IF(AB463=\"\",\"\",#REF!)","v":""},{"$f":"IF(AD463=\"\",\"\",#REF!)","v":""},"","","","","","","","","","","","","","","","","","","","","",""]
[null,null,null,null,null,null,null,null,null,null,null,null,null,null,null,null,null,null,null,"",null,null,null,null,null," ",null,{"$f":"IF(AC464=\"\",\"\",MAX($AB$3:AB463)+1)","v":""},"","","",{"$f":"IF(AB464=\"\",\"\",#REF!)","v":""},{"$f":"IF(AD464=\"\",\"\",#REF!)","v":""},"","","","","","","","","","","","","","","","","","","","","",""]
[null,null,null,null,null,null,null,null,null,null,null,null,null,null,null,null,null,null,null,"",null,null,null,null,null," ",null,{"$f":"IF(AC465=\"\",\"\",MAX($AB$3:AB464)+1)","v":""},{"$f":"IF(C465=\"\",\"\",IF(B465=$AB$1,C465,\"\"))","v":""},{"$f":"IF(AB465=\"\",\"\",B465)","v":""},{"$f":"IF(AB465=\"\",\"\",E465)","v":""},{"$f":"IF(AB465=\"\",\"\",#REF!)","v":""},{"$f":"IF(AD465=\"\",\"\",#REF!)","v":""},{"$f":"IF(AD465=\"\",\"\",U465)","v":""},{"$f":"IF(AD465=\"\",\"\",V465)","v":""},{"$f":"IF(AD465=\"\",\"\",W465)","v":""},{"$f":"IF(AH465=\"\",\"\",X465)","v":""},{"$f":"IF(AI465=\"\",\"\",Y465)","v":""},{"$f":"IF(AE465=\"\",\"\",D465)","v":""},{"$f":"IF(AE465=\"\",\"\",X465)","v":""},{"$f":"IF(AE465=\"\",\"\",Y465)","v":""},{"$f":"IF(AD465=\"\",\"\",F465)","v":""},{"$f":"IF(AE465=\"\",\"\",G465)","v":""},{"$f":"IF(AD465=\"\",\"\",H465)","v":""},{"$f":"IF(AD465=\"\",\"\",I465)","v":""},{"$f":"IF(AH465=\"\",\"\",J465)","v":""},{"$f":"IF(AI465=\"\",\"\",K465)","v":""},{"$f":"IF(AJ465=\"\",\"\",L465)","v":""},{"$f":"IF(AK465=\"\",\"\",M465)","v":""},{"$f":"IF(AL465=\"\",\"\",N465)","v":""},{"$f":"IF(AM465=\"\",\"\",O465)","v":""},{"$f":"IF(AN465=\"\",\"\",P465)","v":""},{"$f":"IF(AO465=\"\",\"\",Q465)","v":""},{"$f":"IF(AP465=\"\",\"\",R465)","v":""},{"$f":"IF(AQ465=\"\",\"\",S465)","v":""}]
[null,null,null,null,null,null,null,null,null,null,null,null,null,null,null,null,null,null,null,{"$f":"IF(AND(C466=\"\",B466=\"\"),\"\",B466+1095)","v":""},null,null,null,null,null," ",null,{"$f":"IF(AC466=\"\",\"\",MAX($AB$3:AB465)+1)","v":""},"","","",{"$f":"IF(AB466=\"\",\"\",#REF!)","v":""},{"$f":"IF(AD466=\"\",\"\",#REF!)","v":""},"","","","","","","","","","","","","","","","","","","","","",""]
[null,null,null,null,null,null,null,null,null,null,null,null,null,null,null,null,null,null,null,"",null,null,null,null,null," ",null,{"$f":"IF(AC467=\"\",\"\",MAX($AB$3:AB466)+1)","v":""},"","","",{"$f":"IF(AB467=\"\",\"\",#REF!)","v":""},{"$f":"IF(AD467=\"\",\"\",#REF!)","v":""},"","","","","","","","","","","","","","","","","","","","","",""]
[null,null,null,null,null,null,null,null,null,null,null,null,null,null,null,null,null,null,null,"",null,null,null,null,null," ",null,{"$f":"IF(AC468=\"\",\"\",MAX($AB$3:AB467)+1)","v":""},"","","",{"$f":"IF(AB468=\"\",\"\",#REF!)","v":""},{"$f":"IF(AD468=\"\",\"\",#REF!)","v":""},"","","","","","","","","","","","","","","","","","","","","",""]
[null,null,null,null,null,null,null,null,null,null,null,null,null,null,null,null,null,null,null,"",null,null,null,null,null," ",null,{"$f":"IF(AC469=\"\",\"\",MAX($AB$3:AB468)+1)","v":""},"","","",{"$f":"IF(AB469=\"\",\"\",#REF!)","v":""},{"$f":"IF(AD469=\"\",\"\",#REF!)","v":""},"","","","","","","","","","","","","","","","","","","","","",""]
[null,null,null,null,null,null,null,null,null,null,null,null,null,null,null,null,null,null,null,"",null,null,null,null,null," ",null,{"$f":"IF(AC470=\"\",\"\",MAX($AB$3:AB469)+1)","v":""},"","","",{"$f":"IF(AB470=\"\",\"\",#REF!)","v":""},{"$f":"IF(AD470=\"\",\"\",#REF!)","v":""},"","","","","","","","","","","","","","","","","","","","","",""]
[null,null,null,null,null,null,null,null,null,null,null,null,null,null,null,null,null,null,null,"",null,null,null,null,null," ",null,{"$f":"IF(AC471=\"\",\"\",MAX($AB$3:AB470)+1)","v":""},"","","",{"$f":"IF(AB471=\"\",\"\",#REF!)","v":""},{"$f":"IF(AD471=\"\",\"\",#REF!)","v":""},"","","","","","","","","","","","","","","","","","","","","",""]
[null,null,null,null,null,null,null,null,null,null,null,null,null,null,null,null,null,null,null,"",null,null,null,null,null," ",null,{"$f":"IF(AC472=\"\",\"\",MAX($AB$3:AB471)+1)","v":""},"","","",{"$f":"IF(AB472=\"\",\"\",#REF!)","v":""},{"$f":"IF(AD472=\"\",\"\",#REF!)","v":""},"","","","","","","","","","","","","","","","","","","","","",""]
[null,null,null,null,null,null,null,null,null,null,null,null,null,null,null,null,null,null,null,"",null,null,null,null,null," ",null,{"$f":"IF(AC473=\"\",\"\",MAX($AB$3:AB472)+1)","v":""},"","","",{"$f":"IF(AB473=\"\",\"\",#REF!)","v":""},{"$f":"IF(AD473=\"\",\"\",#REF!)","v":""},"","","","","","","","","","","","","","","","","","","","","",""]
[null,null,null,null,null,null,null,null,null,null,null,null,null,null,null,null,null,null,null,"",null,null,null,null,null," ",null,{"$f":"IF(AC474=\"\",\"\",MAX($AB$3:AB473)+1)","v":""},"","","",{"$f":"IF(AB474=\"\",\"\",#REF!)","v":""},{"$f":"IF(AD474=\"\",\"\",#REF!)","v":""},"","","","","","","","","","","","","","","","","","","","","",""]
[null,null,null,null,null,null,null,null,null,null,null,null,null,null,null,null,null,null,null,"",null,null,null,null,null," ",null,{"$f":"IF(AC475=\"\",\"\",MAX($AB$3:AB474)+1)","v":""},"","","",{"$f":"IF(AB475=\"\",\"\",#REF!)","v":""},{"$f":"IF(AD475=\"\",\"\",#REF!)","v":""},"","","","","","","","","","","","","","","","","","","","","",""]
[null,null,null,null,null,null,null,null,null,null,null,null,null,null,null,null,null,null,null,"",null,null,null,null,null," ",null,{"$f":"IF(AC476=\"\",\"\",MAX($AB$3:AB475)+1)","v":""},"","","",{"$f":"IF(AB476=\"\",\"\",#REF!)","v":""},{"$f":"IF(AD476=\"\",\"\",#REF!)","v":""},"","","","","","","","","","","","","","","","","","","","","",""]
[null,null,null,null,null,null,null,null,null,null,null,null,null,null,null,null,null,null,null,"",null,null,null,null,null," ",null,{"$f":"IF(AC477=\"\",\"\",MAX($AB$3:AB476)+1)","v":""},"","","",{"$f":"IF(AB477=\"\",\"\",#REF!)","v":""},{"$f":"IF(AD477=\"\",\"\",#REF!)","v":""},"","","","","","","","","","","","","","","","","","","","","",""]
[null,null,null,null,null,null,null,null,null,null,null,null,null,null,null,null,null,null,null,"",null,null,null,null,null," ",null,{"$f":"IF(AC478=\"\",\"\",MAX($AB$3:AB477)+1)","v":""},"","","",{"$f":"IF(AB478=\"\",\"\",#REF!)","v":""},{"$f":"IF(AD478=\"\",\"\",#REF!)","v":""},"","","","","","","","","","","","","","","","","","","","","",""]
[null,null,null,null,null,null,null,null,null,null,null,null,null,null,null,null,null,null,null,"",null,null,null,null,null," ",null,{"$f":"IF(AC479=\"\",\"\",MAX($AB$3:AB478)+1)","v":""},"","","",{"$f":"IF(AB479=\"\",\"\",#REF!)","v":""},{"$f":"IF(AD479=\"\",\"\",#REF!)","v":""},"","","","","","","","","","","","","","","","","","","","","",""]
[null,null,null,null,null,null,null,null,null,null,null,null,null,null,null,null,null,null,null,"",null,null,null,null,null," ",null,{"$f":"IF(AC480=\"\",\"\",MAX($AB$3:AB479)+1)","v":""},"","","",{"$f":"IF(AB480=\"\",\"\",#REF!)","v":""},{"$f":"IF(AD480=\"\",\"\",#REF!)","v":""},"","","","","","","","","","","","","","","","","","","","","",""]
[null,null,null,null,null,null,null,null,null,null,null,null,null,null,null,null,null,null,null,"",null,null,null,null,null," ",null,{"$f":"IF(AC481=\"\",\"\",MAX($AB$3:AB480)+1)","v":""},"","","",{"$f":"IF(AB481=\"\",\"\",#REF!)","v":""},{"$f":"IF(AD481=\"\",\"\",#REF!)","v":""},"","","","","","","","","","","","","","","","","","","","","",""]
[null,null,null,null,null,null,null,null,null,null,null,null,null,null,null,null,null,null,null,"",null,null,null,null,null," ",null,{"$f":"IF(AC482=\"\",\"\",MAX($AB$3:AB481)+1)","v":""},"","","",{"$f":"IF(AB482=\"\",\"\",#REF!)","v":""},{"$f":"IF(AD482=\"\",\"\",#REF!)","v":""},"","","","","","","","","","","","","","","","","","","","","",""]
[null,null,null,null,null,null,null,null,null,null,null,null,null,null,null,null,null,null,null,"",null,null,null,null,null," ",null,{"$f":"IF(AC483=\"\",\"\",MAX($AB$3:AB482)+1)","v":""},"","","",{"$f":"IF(AB483=\"\",\"\",#REF!)","v":""},{"$f":"IF(AD483=\"\",\"\",#REF!)","v":""},"","","","","","","","","","","","","","","","","","","","","",""]
[null,null,null,null,null,null,null,null,null,null,null,null,null,null,null,null,null,null,null,"",null,null,null,null,null," ",null,{"$f":"IF(AC484=\"\",\"\",MAX($AB$3:AB483)+1)","v":""},"","","",{"$f":"IF(AB484=\"\",\"\",#REF!)","v":""},{"$f":"IF(AD484=\"\",\"\",#REF!)","v":""},"","","","","","","","","","","","","","","","","","","","","",""]
[null,null,null,null,null,null,null,null,null,null,null,null,null,null,null,null,null,null,null,"",null,null,null,null,null," ",null,{"$f":"IF(AC485=\"\",\"\",MAX($AB$3:AB484)+1)","v":""},"","","",{"$f":"IF(AB485=\"\",\"\",#REF!)","v":""},{"$f":"IF(AD485=\"\",\"\",#REF!)","v":""},"","","","","","","","","","","","","","","","","","","","","",""]
[null,null,null,null,null,null,null,null,null,null,null,null,null,null,null,null,null,null,null,"",null,null,null,null,null," ",null,{"$f":"IF(AC486=\"\",\"\",MAX($AB$3:AB485)+1)","v":""},"","","",{"$f":"IF(AB486=\"\",\"\",#REF!)","v":""},{"$f":"IF(AD486=\"\",\"\",#REF!)","v":""},"","","","","","","","","","","","","","","","","","","","","",""]
[null,null,null,null,null,null,null,null,null,null,null,null,null,null,null,null,null,null,null,"",null,null,null,null,null," ",null,{"$f":"IF(AC487=\"\",\"\",MAX($AB$3:AB486)+1)","v":""},"","","",{"$f":"IF(AB487=\"\",\"\",#REF!)","v":""},{"$f":"IF(AD487=\"\",\"\",#REF!)","v":""},"","","","","","","","","","","","","","","","","","","","","",""]
[null,null,null,null,null,null,null,null,null,null,null,null,null,null,null,null,null,null,null,"",null,null,null,null,null," ",null,{"$f":"IF(AC488=\"\",\"\",MAX($AB$3:AB487)+1)","v":""},"","","",{"$f":"IF(AB488=\"\",\"\",#REF!)","v":""},{"$f":"IF(AD488=\"\",\"\",#REF!)","v":""},"","","","","","","","","","","","","","","","","","","","","",""]
[null,null,null,null,null,null,null,null,null,null,null,null,null,null,null,null,null,null,null,"",null,null,null,null,null," ",null,{"$f":"IF(AC489=\"\",\"\",MAX($AB$3:AB488)+1)","v":""},"","","",{"$f":"IF(AB489=\"\",\"\",#REF!)","v":""},{"$f":"IF(AD489=\"\",\"\",#REF!)","v":""},"","","","","","","","","","","","","","","","","","","","","",""]
[null,null,null,null,null,null,null,null,null,null,null,null,null,null,null,null,null,null,null,"",null,null,null,null,null," ",null,{"$f":"IF(AC490=\"\",\"\",MAX($AB$3:AB489)+1)","v":""},"","","",{"$f":"IF(AB490=\"\",\"\",#REF!)","v":""},{"$f":"IF(AD490=\"\",\"\",#REF!)","v":""},"","","","","","","","","","","","","","","","","","","","","",""]
[null,null,null,null,null,null,null,null,null,null,null,null,null,null,null,null,null,null,null,"",null,null,null,null,null," ",null,{"$f":"IF(AC491=\"\",\"\",MAX($AB$3:AB490)+1)","v":""},"","","",{"$f":"IF(AB491=\"\",\"\",#REF!)","v":""},{"$f":"IF(AD491=\"\",\"\",#REF!)","v":""},"","","","","","","","","","","","","","","","","","","","","",""]
[null,null,null,null,null,null,null,null,null,null,null,null,null,null,null,null,null,null,null,"",null,null,null,null,null," ",null,{"$f":"IF(AC492=\"\",\"\",MAX($AB$3:AB491)+1)","v":""},"","","",{"$f":"IF(AB492=\"\",\"\",#REF!)","v":""},{"$f":"IF(AD492=\"\",\"\",#REF!)","v":""},"","","","","","","","","","","","","","","","","","","","","",""]
[null,null,null,null,null,null,null,null,null,null,null,null,null,null,null,null,null,null,null,"",null,null,null,null,null," ",null,{"$f":"IF(AC493=\"\",\"\",MAX($AB$3:AB492)+1)","v":""},"","","",{"$f":"IF(AB493=\"\",\"\",#REF!)","v":""},{"$f":"IF(AD493=\"\",\"\",#REF!)","v":""},"","","","","","","","","","","","","","","","","","","","","",""]
[null,null,null,null,null,null,null,null,null,null,null,null,null,null,null,null,null,null,null,"",null,null,null,null,null," ",null,{"$f":"IF(AC494=\"\",\"\",MAX($AB$3:AB493)+1)","v":""},"","","",{"$f":"IF(AB494=\"\",\"\",#REF!)","v":""},{"$f":"IF(AD494=\"\",\"\",#REF!)","v":""},"","","","","","","","","","","","","","","","","","","","","",""]
[null,null,null,null,null,null,null,null,null,null,null,null,null,null,null,null,null,null,null,"",null,null,null,null,null," ",null,{"$f":"IF(AC495=\"\",\"\",MAX($AB$3:AB494)+1)","v":""},"","","",{"$f":"IF(AB495=\"\",\"\",#REF!)","v":""},{"$f":"IF(AD495=\"\",\"\",#REF!)","v":""},"","","","","","","","","","","","","","","","","","","","","",""]
[null,null,null,null,null,null,null,null,null,null,null,null,null,null,null,null,null,null,null,"",null,null,null,null,null," ",null,{"$f":"IF(AC496=\"\",\"\",MAX($AB$3:AB495)+1)","v":""},"","","",{"$f":"IF(AB496=\"\",\"\",#REF!)","v":""},{"$f":"IF(AD496=\"\",\"\",#REF!)","v":""},"","","","","","","","","","","","","","","","","","","","","",""]
[null,null,null,null,null,null,null,null,null,null,null,null,null,null,null,null,null,null,null,"",null,null,null,null,null," ",null,{"$f":"IF(AC497=\"\",\"\",MAX($AB$3:AB496)+1)","v":""},"","","",{"$f":"IF(AB497=\"\",\"\",#REF!)","v":""},{"$f":"IF(AD497=\"\",\"\",#REF!)","v":""},"","","","","","","","","","","","","","","","","","","","","",""]
[null,null,null,null,null,null,null,null,null,null,null,null,null,null,null,null,null,null,null,"",null,null,null,null,null," ",null,{"$f":"IF(AC498=\"\",\"\",MAX($AB$3:AB497)+1)","v":""},"","","",{"$f":"IF(AB498=\"\",\"\",#REF!)","v":""},{"$f":"IF(AD498=\"\",\"\",#REF!)","v":""},"","","","","","","","","","","","","","","","","","","","","",""]
[null,null,null,null,null,null,null,null,null,null,null,null,null,null,null,null,null,null,null,"",null,null,null,null,null," ",null,{"$f":"IF(AC499=\"\",\"\",MAX($AB$3:AB498)+1)","v":""},"","","",{"$f":"IF(AB499=\"\",\"\",#REF!)","v":""},{"$f":"IF(AD499=\"\",\"\",#REF!)","v":""},"","","","","","","","","","","","","","","","","","","","","",""]
[null,null,null,null,null,null,null,null,null,null,null,null,null,null,null,null,null,null,null,"",null,null,null,null,null," ",null,{"$f":"IF(AC500=\"\",\"\",MAX($AB$3:AB499)+1)","v":""},"","","",{"$f":"IF(AB500=\"\",\"\",#REF!)","v":""},{"$f":"IF(AD500=\"\",\"\",#REF!)","v":""},"","","","","","","","","","","","","","","","","","","","","",""]
[null,null,null,null,null,null,null,null,null,null,null,null,null,null,null,null,null,null,null,"",null,null,null,null,null," ",null,{"$f":"IF(AC501=\"\",\"\",MAX($AB$3:AB500)+1)","v":""},"","","",{"$f":"IF(AB501=\"\",\"\",#REF!)","v":""},{"$f":"IF(AD501=\"\",\"\",#REF!)","v":""},"","","","","","","","","","","","","","","","","","","","","",""]
[null,null,null,null,null,null,null,null,null,null,null,null,null,null,null,null,null,null,null,"",null,null,null,null,null," ",null,{"$f":"IF(AC502=\"\",\"\",MAX($AB$3:AB501)+1)","v":""},"","","",{"$f":"IF(AB502=\"\",\"\",#REF!)","v":""},{"$f":"IF(AD502=\"\",\"\",#REF!)","v":""},"","","","","","","","","","","","","","","","","","","","","",""]
[null,null,null,null,null,null,null,null,null,null,null,null,null,null,null,null,null,null,null,"",null,null,null,null,null," ",null,{"$f":"IF(AC503=\"\",\"\",MAX($AB$3:AB502)+1)","v":""},"","","",{"$f":"IF(AB503=\"\",\"\",#REF!)","v":""},{"$f":"IF(AD503=\"\",\"\",#REF!)","v":""},"","","","","","","","","","","","","","","","","","","","","",""]
[null,null,null,null,null,null,null,null,null,null,null,null,null,null,null,null,null,null,null,"",null,null,null,null,null," ",null,{"$f":"IF(AC504=\"\",\"\",MAX($AB$3:AB503)+1)","v":""},"","","",{"$f":"IF(AB504=\"\",\"\",#REF!)","v":""},{"$f":"IF(AD504=\"\",\"\",#REF!)","v":""},"","","","","","","","","","","","","","","","","","","","","",""]
[null,null,null,null,null,null,null,null,null,null,null,null,null,null,null,null,null,null,null,"",null,null,null,null,null," ",null,{"$f":"IF(AC505=\"\",\"\",MAX($AB$3:AB504)+1)","v":""},"","","",{"$f":"IF(AB505=\"\",\"\",#REF!)","v":""},{"$f":"IF(AD505=\"\",\"\",#REF!)","v":""},"","","","","","","","","","","","","","","","","","","","","",""]
[null,null,null,null,null,null,null,null,null,null,null,null,null,null,null,null,null,null,null,"",null,null,null,null,null," ",null,{"$f":"IF(AC506=\"\",\"\",MAX($AB$3:AB505)+1)","v":""},"","","",{"$f":"IF(AB506=\"\",\"\",#REF!)","v":""},{"$f":"IF(AD506=\"\",\"\",#REF!)","v":""},"","","","","","","","","","","","","","","","","","","","","",""]
[null,null,null,null,null,null,null,null,null,null,null,null,null,null,null,null,null,null,null,"",null,null,null,null,null," ",null,{"$f":"IF(AC507=\"\",\"\",MAX($AB$3:AB506)+1)","v":""},"","","",{"$f":"IF(AB507=\"\",\"\",#REF!)","v":""},{"$f":"IF(AD507=\"\",\"\",#REF!)","v":""},"","","","","","","","","","","","","","","","","","","","","",""]
[null,null,null,null,null,null,null,null,null,null,null,null,null,null,null,null,null,null,null,"",null,null,null,null,null," ",null,{"$f":"IF(AC508=\"\",\"\",MAX($AB$3:AB507)+1)","v":""},"","","",{"$f":"IF(AB508=\"\",\"\",#REF!)","v":""},{"$f":"IF(AD508=\"\",\"\",#REF!)","v":""},"","","","","","","","","","","","","","","","","","","","","",""]
[null,null,null,null,null,null,null,null,null,null,null,null,null,null,null,null,null,null,null,"",null,null,null,null,null," ",null,{"$f":"IF(AC509=\"\",\"\",MAX($AB$3:AB508)+1)","v":""},"","","",{"$f":"IF(AB509=\"\",\"\",#REF!)","v":""},{"$f":"IF(AD509=\"\",\"\",#REF!)","v":""},"","","","","","","","","","","","","","","","","","","","","",""]
[null,null,null,null,null,null,null,null,null,null,null,null,null,null,null,null,null,null,null,"",null,null,null,null,null," ",null,{"$f":"IF(AC510=\"\",\"\",MAX($AB$3:AB509)+1)","v":""},"","","",{"$f":"IF(AB510=\"\",\"\",#REF!)","v":""},{"$f":"IF(AD510=\"\",\"\",#REF!)","v":""},"","","","","","","","","","","","","","","","","","","","","",""]
[null,null,null,null,null,null,null,null,null,null,null,null,null,null,null,null,null,null,null,"",null,null,null,null,null," ",null,{"$f":"IF(AC511=\"\",\"\",MAX($AB$3:AB510)+1)","v":""},"","","",{"$f":"IF(AB511=\"\",\"\",#REF!)","v":""},{"$f":"IF(AD511=\"\",\"\",#REF!)","v":""},"","","","","","","","","","","","","","","","","","","","","",""]
[null,null,null,null,null,null,null,null,null,null,null,null,null,null,null,null,null,null,null,"",null,null,null,null,null," ",null,{"$f":"IF(AC512=\"\",\"\",MAX($AB$3:AB511)+1)","v":""},"","","",{"$f":"IF(AB512=\"\",\"\",#REF!)","v":""},{"$f":"IF(AD512=\"\",\"\",#REF!)","v":""},"","","","","","","","","","","","","","","","","","","","","",""]
[null,null,null,null,null,null,null,null,null,null,null,null,null,null,null,null,null,null,null,"",null,null,null,null,null," ",null,{"$f":"IF(AC513=\"\",\"\",MAX($AB$3:AB512)+1)","v":""},"","","",{"$f":"IF(AB513=\"\",\"\",#REF!)","v":""},{"$f":"IF(AD513=\"\",\"\",#REF!)","v":""},"","","","","","","","","","","","","","","","","","","","","",""]
[null,null,null,null,null,null,null,null,null,null,null,null,null,null,null,null,null,null,null,"",null,null,null,null,null," ",null,{"$f":"IF(AC514=\"\",\"\",MAX($AB$3:AB513)+1)","v":""},"","","",{"$f":"IF(AB514=\"\",\"\",#REF!)","v":""},{"$f":"IF(AD514=\"\",\"\",#REF!)","v":""},"","","","","","","","","","","","","","","","","","","","","",""]
[null,null,null,null,null,null,null,null,null,null,null,null,null,null,null,null,null,null,null,"",null,null,null,null,null," ",null,{"$f":"IF(AC515=\"\",\"\",MAX($AB$3:AB514)+1)","v":""},"","","",{"$f":"IF(AB515=\"\",\"\",#REF!)","v":""},{"$f":"IF(AD515=\"\",\"\",#REF!)","v":""},"","","","","","","","","","","","","","","","","","","","","",""]
[null,null,null,null,null,null,null,null,null,null,null,null,null,null,null,null,null,null,null,"",null,null,null,null,null," ",null,{"$f":"IF(AC516=\"\",\"\",MAX($AB$3:AB515)+1)","v":""},"","","",{"$f":"IF(AB516=\"\",\"\",#REF!)","v":""},{"$f":"IF(AD516=\"\",\"\",#REF!)","v":""},"","","","","","","","","","","","","","","","","","","","","",""]
[null,null,null,null,null,null,null,null,null,null,null,null,null,null,null,null,null,null,null,"",null,null,null,null,null," ",null,{"$f":"IF(AC517=\"\",\"\",MAX($AB$3:AB516)+1)","v":""},"","","",{"$f":"IF(AB517=\"\",\"\",#REF!)","v":""},{"$f":"IF(AD517=\"\",\"\",#REF!)","v":""},"","","","","","","","","","","","","","","","","","","","","",""]
[null,null,null,null,null,null,null,null,null,null,null,null,null,null,null,null,null,null,null,"",null,null,null,null,null," ",null,{"$f":"IF(AC518=\"\",\"\",MAX($AB$3:AB517)+1)","v":""},"","","",{"$f":"IF(AB518=\"\",\"\",#REF!)","v":""},{"$f":"IF(AD518=\"\",\"\",#REF!)","v":""},"","","","","","","","","","","","","","","","","","","","","",""]
[null,null,null,null,null,null,null,null,null,null,null,null,null,null,null,null,null,null,null,"",null,null,null,null,null," ",null,{"$f":"IF(AC519=\"\",\"\",MAX($AB$3:AB518)+1)","v":""},"","","",{"$f":"IF(AB519=\"\",\"\",#REF!)","v":""},{"$f":"IF(AD519=\"\",\"\",#REF!)","v":""},"","","","","","","","","","","","","","","","","","","","","",""]
[null,null,null,null,null,null,null,null,null,null,null,null,null,null,null,null,null,null,null,"",null,null,null,null,null," ",null,{"$f":"IF(AC520=\"\",\"\",MAX($AB$3:AB519)+1)","v":""},"","","",{"$f":"IF(AB520=\"\",\"\",#REF!)","v":""},{"$f":"IF(AD520=\"\",\"\",#REF!)","v":""},"","","","","","","","","","","","","","","","","","","","","",""]
[null,null,null,null,null,null,null,null,null,null,null,null,null,null,null,null,null,null,null,"",null,null,null,null,null," ",null,{"$f":"IF(AC521=\"\",\"\",MAX($AB$3:AB520)+1)","v":""},"","","",{"$f":"IF(AB521=\"\",\"\",#REF!)","v":""},{"$f":"IF(AD521=\"\",\"\",#REF!)","v":""},"","","","","","","","","","","","","","","","","","","","","",""]
[null,null,null,null,null,null,null,null,null,null,null,null,null,null,null,null,null,null,null,"",null,null,null,null,null," ",null,{"$f":"IF(AC522=\"\",\"\",MAX($AB$3:AB521)+1)","v":""},"","","",{"$f":"IF(AB522=\"\",\"\",#REF!)","v":""},{"$f":"IF(AD522=\"\",\"\",#REF!)","v":""},"","","","","","","","","","","","","","","","","","","","","",""]
[null,null,null,null,null,null,null,null,null,null,null,null,null,null,null,null,null,null,null,"",null,null,null,null,null," ",null,{"$f":"IF(AC523=\"\",\"\",MAX($AB$3:AB522)+1)","v":""},"","","",{"$f":"IF(AB523=\"\",\"\",#REF!)","v":""},{"$f":"IF(AD523=\"\",\"\",#REF!)","v":""},"","","","","","","","","","","","","","","","","","","","","",""]
[null,null,null,null,null,null,null,null,null,null,null,null,null,null,null,null,null,null,null,"",null,null,null,null,null," ",null,{"$f":"IF(AC524=\"\",\"\",MAX($AB$3:AB523)+1)","v":""},"","","",{"$f":"IF(AB524=\"\",\"\",#REF!)","v":""},{"$f":"IF(AD524=\"\",\"\",#REF!)","v":""},"","","","","","","","","","","","","","","","","","","","","",""]
[null,null,null,null,null,null,null,null,null,null,null,null,null,null,null,null,null,null,null,"",null,null,null,null,null," ",null,{"$f":"IF(AC525=\"\",\"\",MAX($AB$3:AB524)+1)","v":""},"","","",{"$f":"IF(AB525=\"\",\"\",#REF!)","v":""},{"$f":"IF(AD525=\"\",\"\",#REF!)","v":""},"","","","","","","","","","","","","","","","","","","","","",""]
[null,null,null,null,null,null,null,null,null,null,null,null,null,null,null,null,null,null,null,"",null,null,null,null,null," ",null,{"$f":"IF(AC526=\"\",\"\",MAX($AB$3:AB525)+1)","v":""},"","","",{"$f":"IF(AB526=\"\",\"\",#REF!)","v":""},{"$f":"IF(AD526=\"\",\"\",#REF!)","v":""},"","","","","","","","","","","","","","","","","","","","","",""]
[null,null,null,null,null,null,null,null,null,null,null,null,null,null,null,null,null,null,null,"",null,null,null,null,null," ",null,{"$f":"IF(AC527=\"\",\"\",MAX($AB$3:AB526)+1)","v":""},"","","",{"$f":"IF(AB527=\"\",\"\",#REF!)","v":""},{"$f":"IF(AD527=\"\",\"\",#REF!)","v":""},"","","","","","","","","","","","","","","","","","","","","",""]
[null,null,null,null,null,null,null,null,null,null,null,null,null,null,null,null,null,null,null,"",null,null,null,null,null," ",null,{"$f":"IF(AC528=\"\",\"\",MAX($AB$3:AB527)+1)","v":""},"","","",{"$f":"IF(AB528=\"\",\"\",#REF!)","v":""},{"$f":"IF(AD528=\"\",\"\",#REF!)","v":""},"","","","","","","","","","","","","","","","","","","","","",""]
[null,null,null,null,null,null,null,null,null,null,null,null,null,null,null,null,null,null,null,"",null,null,null,null,null," ",null,{"$f":"IF(AC529=\"\",\"\",MAX($AB$3:AB528)+1)","v":""},{"$f":"IF(C529=\"\",\"\",IF(B529=$AB$1,C529,\"\"))","v":""},{"$f":"IF(AB529=\"\",\"\",B529)","v":""},{"$f":"IF(AB529=\"\",\"\",E529)","v":""},{"$f":"IF(AB529=\"\",\"\",#REF!)","v":""},{"$f":"IF(AD529=\"\",\"\",#REF!)","v":""},{"$f":"IF(AD529=\"\",\"\",U529)","v":""},{"$f":"IF(AD529=\"\",\"\",V529)","v":""},{"$f":"IF(AD529=\"\",\"\",W529)","v":""},{"$f":"IF(AH529=\"\",\"\",X529)","v":""},{"$f":"IF(AI529=\"\",\"\",Y529)","v":""},{"$f":"IF(AE529=\"\",\"\",D529)","v":""},{"$f":"IF(AE529=\"\",\"\",X529)","v":""},{"$f":"IF(AE529=\"\",\"\",Y529)","v":""},{"$f":"IF(AD529=\"\",\"\",F529)","v":""},{"$f":"IF(AE529=\"\",\"\",G529)","v":""},{"$f":"IF(AD529=\"\",\"\",H529)","v":""},{"$f":"IF(AD529=\"\",\"\",I529)","v":""},{"$f":"IF(AH529=\"\",\"\",J529)","v":""},{"$f":"IF(AI529=\"\",\"\",K529)","v":""},{"$f":"IF(AJ529=\"\",\"\",L529)","v":""},{"$f":"IF(AK529=\"\",\"\",M529)","v":""},{"$f":"IF(AL529=\"\",\"\",N529)","v":""},{"$f":"IF(AM529=\"\",\"\",O529)","v":""},{"$f":"IF(AN529=\"\",\"\",P529)","v":""},{"$f":"IF(AO529=\"\",\"\",Q529)","v":""},{"$f":"IF(AP529=\"\",\"\",R529)","v":""},{"$f":"IF(AQ529=\"\",\"\",S529)","v":""}]
[null,null,null,null,null,null,null,null,null,null,null,null,null,null,null,null,null,null,null,{"$f":"IF(AND(C530=\"\",B530=\"\"),\"\",B530+1095)","v":""},null,null,null,null,null," ",null,{"$f":"IF(AC530=\"\",\"\",MAX($AB$3:AB529)+1)","v":""},"","","",{"$f":"IF(AB530=\"\",\"\",#REF!)","v":""},{"$f":"IF(AD530=\"\",\"\",#REF!)","v":""},"","","","","","","","","","","","","","","","","","","","","",""]
[null,null,null,null,null,null,null,null,null,null,null,null,null,null,null,null,null,null,null,"",null,null,null,null,null," ",null,{"$f":"IF(AC531=\"\",\"\",MAX($AB$3:AB530)+1)","v":""},"","","",{"$f":"IF(AB531=\"\",\"\",#REF!)","v":""},{"$f":"IF(AD531=\"\",\"\",#REF!)","v":""},"","","","","","","","","","","","","","","","","","","","","",""]
[null,null,null,null,null,null,null,null,null,null,null,null,null,null,null,null,null,null,null,"",null,null,null,null,null," ",null,{"$f":"IF(AC532=\"\",\"\",MAX($AB$3:AB531)+1)","v":""},"","","",{"$f":"IF(AB532=\"\",\"\",#REF!)","v":""},{"$f":"IF(AD532=\"\",\"\",#REF!)","v":""},"","","","","","","","","","","","","","","","","","","","","",""]
[null,null,null,null,null,null,null,null,null,null,null,null,null,null,null,null,null,null,null,"",null,null,null,null,null," ",null,{"$f":"IF(AC533=\"\",\"\",MAX($AB$3:AB532)+1)","v":""},"","","",{"$f":"IF(AB533=\"\",\"\",#REF!)","v":""},{"$f":"IF(AD533=\"\",\"\",#REF!)","v":""},"","","","","","","","","","","","","","","","","","","","","",""]
[null,null,null,null,null,null,null,null,null,null,null,null,null,null,null,null,null,null,null,"",null,null,null,null,null," ",null,{"$f":"IF(AC534=\"\",\"\",MAX($AB$3:AB533)+1)","v":""},"","","",{"$f":"IF(AB534=\"\",\"\",#REF!)","v":""},{"$f":"IF(AD534=\"\",\"\",#REF!)","v":""},"","","","","","","","","","","","","","","","","","","","","",""]
[null,null,null,null,null,null,null,null,null,null,null,null,null,null,null,null,null,null,null,"",null,null,null,null,null," ",null,{"$f":"IF(AC535=\"\",\"\",MAX($AB$3:AB534)+1)","v":""},"","","",{"$f":"IF(AB535=\"\",\"\",#REF!)","v":""},{"$f":"IF(AD535=\"\",\"\",#REF!)","v":""},"","","","","","","","","","","","","","","","","","","","","",""]
[null,null,null,null,null,null,null,null,null,null,null,null,null,null,null,null,null,null,null,"",null,null,null,null,null," ",null,{"$f":"IF(AC536=\"\",\"\",MAX($AB$3:AB535)+1)","v":""},"","","",{"$f":"IF(AB536=\"\",\"\",#REF!)","v":""},{"$f":"IF(AD536=\"\",\"\",#REF!)","v":""},"","","","","","","","","","","","","","","","","","","","","",""]
[null,null,null,null,null,null,null,null,null,null,null,null,null,null,null,null,null,null,null,"",null,null,null,null,null," ",null,{"$f":"IF(AC537=\"\",\"\",MAX($AB$3:AB536)+1)","v":""},"","","",{"$f":"IF(AB537=\"\",\"\",#REF!)","v":""},{"$f":"IF(AD537=\"\",\"\",#REF!)","v":""},"","","","","","","","","","","","","","","","","","","","","",""]
[null,null,null,null,null,null,null,null,null,null,null,null,null,null,null,null,null,null,null,"",null,null,null,null,null," ",null,{"$f":"IF(AC538=\"\",\"\",MAX($AB$3:AB537)+1)","v":""},"","","",{"$f":"IF(AB538=\"\",\"\",#REF!)","v":""},{"$f":"IF(AD538=\"\",\"\",#REF!)","v":""},"","","","","","","","","","","","","","","","","","","","","",""]
[null,null,null,null,null,null,null,null,null,null,null,null,null,null,null,null,null,null,null,"",null,null,null,null,null," ",null,{"$f":"IF(AC539=\"\",\"\",MAX($AB$3:AB538)+1)","v":""},"","","",{"$f":"IF(AB539=\"\",\"\",#REF!)","v":""},{"$f":"IF(AD539=\"\",\"\",#REF!)","v":""},"","","","","","","","","","","","","","","","","","","","","",""]
[null,null,null,null,null,null,null,null,null,null,null,null,null,null,null,null,null,null,null,"",null,null,null,null,null," ",null,{"$f":"IF(AC540=\"\",\"\",MAX($AB$3:AB539)+1)","v":""},"","","",{"$f":"IF(AB540=\"\",\"\",#REF!)","v":""},{"$f":"IF(AD540=\"\",\"\",#REF!)","v":""},"","","","","","","","","","","","","","","","","","","","","",""]
[null,null,null,null,null,null,null,null,null,null,null,null,null,null,null,null,null,null,null,"",null,null,null,null,null," ",null,{"$f":"IF(AC541=\"\",\"\",MAX($AB$3:AB540)+1)","v":""},"","","",{"$f":"IF(AB541=\"\",\"\",#REF!)","v":""},{"$f":"IF(AD541=\"\",\"\",#REF!)","v":""},"","","","","","","","","","","","","","","","","","","","","",""]
[null,null,null,null,null,null,null,null,null,null,null,null,null,null,null,null,null,null,null,"",null,null,null,null,null," ",null,{"$f":"IF(AC542=\"\",\"\",MAX($AB$3:AB541)+1)","v":""},"","","",{"$f":"IF(AB542=\"\",\"\",#REF!)","v":""},{"$f":"IF(AD542=\"\",\"\",#REF!)","v":""},"","","","","","","","","","","","","","","","","","","","","",""]
[null,null,null,null,null,null,null,null,null,null,null,null,null,null,null,null,null,null,null,"",null,null,null,null,null," ",null,{"$f":"IF(AC543=\"\",\"\",MAX($AB$3:AB542)+1)","v":""},"","","",{"$f":"IF(AB543=\"\",\"\",#REF!)","v":""},{"$f":"IF(AD543=\"\",\"\",#REF!)","v":""},"","","","","","","","","","","","","","","","","","","","","",""]
[null,null,null,null,null,null,null,null,null,null,null,null,null,null,null,null,null,null,null,"",null,null,null,null,null," ",null,{"$f":"IF(AC544=\"\",\"\",MAX($AB$3:AB543)+1)","v":""},"","","",{"$f":"IF(AB544=\"\",\"\",#REF!)","v":""},{"$f":"IF(AD544=\"\",\"\",#REF!)","v":""},"","","","","","","","","","","","","","","","","","","","","",""]
[null,null,null,null,null,null,null,null,null,null,null,null,null,null,null,null,null,null,null,"",null,null,null,null,null," ",null,{"$f":"IF(AC545=\"\",\"\",MAX($AB$3:AB544)+1)","v":""},"","","",{"$f":"IF(AB545=\"\",\"\",#REF!)","v":""},{"$f":"IF(AD545=\"\",\"\",#REF!)","v":""},"","","","","","","","","","","","","","","","","","","","","",""]
[null,null,null,null,null,null,null,null,null,null,null,null,null,null,null,null,null,null,null,"",null,null,null,null,null," ",null,{"$f":"IF(AC546=\"\",\"\",MAX($AB$3:AB545)+1)","v":""},"","","",{"$f":"IF(AB546=\"\",\"\",#REF!)","v":""},{"$f":"IF(AD546=\"\",\"\",#REF!)","v":""},"","","","","","","","","","","","","","","","","","","","","",""]
[null,null,null,null,null,null,null,null,null,null,null,null,null,null,null,null,null,null,null,"",null,null,null,null,null," ",null,{"$f":"IF(AC547=\"\",\"\",MAX($AB$3:AB546)+1)","v":""},"","","",{"$f":"IF(AB547=\"\",\"\",#REF!)","v":""},{"$f":"IF(AD547=\"\",\"\",#REF!)","v":""},"","","","","","","","","","","","","","","","","","","","","",""]
[null,null,null,null,null,null,null,null,null,null,null,null,null,null,null,null,null,null,null,"",null,null,null,null,null," ",null,{"$f":"IF(AC548=\"\",\"\",MAX($AB$3:AB547)+1)","v":""},"","","",{"$f":"IF(AB548=\"\",\"\",#REF!)","v":""},{"$f":"IF(AD548=\"\",\"\",#REF!)","v":""},"","","","","","","","","","","","","","","","","","","","","",""]
[null,null,null,null,null,null,null,null,null,null,null,null,null,null,null,null,null,null,null,"",null,null,null,null,null," ",null,{"$f":"IF(AC549=\"\",\"\",MAX($AB$3:AB548)+1)","v":""},"","","",{"$f":"IF(AB549=\"\",\"\",#REF!)","v":""},{"$f":"IF(AD549=\"\",\"\",#REF!)","v":""},"","","","","","","","","","","","","","","","","","","","","",""]
[null,null,null,null,null,null,null,null,null,null,null,null,null,null,null,null,null,null,null,"",null,null,null,null,null," ",null,{"$f":"IF(AC550=\"\",\"\",MAX($AB$3:AB549)+1)","v":""},"","","",{"$f":"IF(AB550=\"\",\"\",#REF!)","v":""},{"$f":"IF(AD550=\"\",\"\",#REF!)","v":""},"","","","","","","","","","","","","","","","","","","","","",""]
[null,null,null,null,null,null,null,null,null,null,null,null,null,null,null,null,null,null,null,"",null,null,null,null,null," ",null,{"$f":"IF(AC551=\"\",\"\",MAX($AB$3:AB550)+1)","v":""},"","","",{"$f":"IF(AB551=\"\",\"\",#REF!)","v":""},{"$f":"IF(AD551=\"\",\"\",#REF!)","v":""},"","","","","","","","","","","","","","","","","","","","","",""]
[null,null,null,null,null,null,null,null,null,null,null,null,null,null,null,null,null,null,null,"",null,null,null,null,null," ",null,{"$f":"IF(AC552=\"\",\"\",MAX($AB$3:AB551)+1)","v":""},"","","",{"$f":"IF(AB552=\"\",\"\",#REF!)","v":""},{"$f":"IF(AD552=\"\",\"\",#REF!)","v":""},"","","","","","","","","","","","","","","","","","","","","",""]
[null,null,null,null,null,null,null,null,null,null,null,null,null,null,null,null,null,null,null,"",null,null,null,null,null," ",null,{"$f":"IF(AC553=\"\",\"\",MAX($AB$3:AB552)+1)","v":""},"","","",{"$f":"IF(AB553=\"\",\"\",#REF!)","v":""},{"$f":"IF(AD553=\"\",\"\",#REF!)","v":""},"","","","","","","","","","","","","","","","","","","","","",""]
[null,null,null,null,null,null,null,null,null,null,null,null,null,null,null,null,null,null,null,"",null,null,null,null,null," ",null,{"$f":"IF(AC554=\"\",\"\",MAX($AB$3:AB553)+1)","v":""},"","","",{"$f":"IF(AB554=\"\",\"\",#REF!)","v":""},{"$f":"IF(AD554=\"\",\"\",#REF!)","v":""},"","","","","","","","","","","","","","","","","","","","","",""]
[null,null,null,null,null,null,null,null,null,null,null,null,null,null,null,null,null,null,null,"",null,null,null,null,null," ",null,{"$f":"IF(AC555=\"\",\"\",MAX($AB$3:AB554)+1)","v":""},"","","",{"$f":"IF(AB555=\"\",\"\",#REF!)","v":""},{"$f":"IF(AD555=\"\",\"\",#REF!)","v":""},"","","","","","","","","","","","","","","","","","","","","",""]
[null,null,null,null,null,null,null,null,null,null,null,null,null,null,null,null,null,null,null,"",null,null,null,null,null," ",null,{"$f":"IF(AC556=\"\",\"\",MAX($AB$3:AB555)+1)","v":""},"","","",{"$f":"IF(AB556=\"\",\"\",#REF!)","v":""},{"$f":"IF(AD556=\"\",\"\",#REF!)","v":""},"","","","","","","","","","","","","","","","","","","","","",""]
[null,null,null,null,null,null,null,null,null,null,null,null,null,null,null,null,null,null,null,"",null,null,null,null,null," ",null,{"$f":"IF(AC557=\"\",\"\",MAX($AB$3:AB556)+1)","v":""},"","","",{"$f":"IF(AB557=\"\",\"\",#REF!)","v":""},{"$f":"IF(AD557=\"\",\"\",#REF!)","v":""},"","","","","","","","","","","","","","","","","","","","","",""]
[null,null,null,null,null,null,null,null,null,null,null,null,null,null,null,null,null,null,null,"",null,null,null,null,null," ",null,{"$f":"IF(AC558=\"\",\"\",MAX($AB$3:AB557)+1)","v":""},"","","",{"$f":"IF(AB558=\"\",\"\",#REF!)","v":""},{"$f":"IF(AD558=\"\",\"\",#REF!)","v":""},"","","","","","","","","","","","","","","","","","","","","",""]
[null,null,null,null,null,null,null,null,null,null,null,null,null,null,null,null,null,null,null,"",null,null,null,null,null," ",null,{"$f":"IF(AC559=\"\",\"\",MAX($AB$3:AB558)+1)","v":""},"","","",{"$f":"IF(AB559=\"\",\"\",#REF!)","v":""},{"$f":"IF(AD559=\"\",\"\",#REF!)","v":""},"","","","","","","","","","","","","","","","","","","","","",""]
[null,null,null,null,null,null,null,null,null,null,null,null,null,null,null,null,null,null,null,"",null,null,null,null,null," ",null,{"$f":"IF(AC560=\"\",\"\",MAX($AB$3:AB559)+1)","v":""},"","","",{"$f":"IF(AB560=\"\",\"\",#REF!)","v":""},{"$f":"IF(AD560=\"\",\"\",#REF!)","v":""},"","","","","","","","","","","","","","","","","","","","","",""]
[null,null,null,null,null,null,null,null,null,null,null,null,null,null,null,null,null,null,null,"",null,null,null,null,null," ",null,{"$f":"IF(AC561=\"\",\"\",MAX($AB$3:AB560)+1)","v":""},"","","",{"$f":"IF(AB561=\"\",\"\",#REF!)","v":""},{"$f":"IF(AD561=\"\",\"\",#REF!)","v":""},"","","","","","","","","","","","","","","","","","","","","",""]
[null,null,null,null,null,null,null,null,null,null,null,null,null,null,null,null,null,null,null,"",null,null,null,null,null," ",null,{"$f":"IF(AC562=\"\",\"\",MAX($AB$3:AB561)+1)","v":""},"","","",{"$f":"IF(AB562=\"\",\"\",#REF!)","v":""},{"$f":"IF(AD562=\"\",\"\",#REF!)","v":""},"","","","","","","","","","","","","","","","","","","","","",""]
[null,null,null,null,null,null,null,null,null,null,null,null,null,null,null,null,null,null,null,"",null,null,null,null,null," ",null,{"$f":"IF(AC563=\"\",\"\",MAX($AB$3:AB562)+1)","v":""},"","","",{"$f":"IF(AB563=\"\",\"\",#REF!)","v":""},{"$f":"IF(AD563=\"\",\"\",#REF!)","v":""},"","","","","","","","","","","","","","","","","","","","","",""]
[null,null,null,null,null,null,null,null,null,null,null,null,null,null,null,null,null,null,null,"",null,null,null,null,null," ",null,{"$f":"IF(AC564=\"\",\"\",MAX($AB$3:AB563)+1)","v":""},"","","",{"$f":"IF(AB564=\"\",\"\",#REF!)","v":""},{"$f":"IF(AD564=\"\",\"\",#REF!)","v":""},"","","","","","","","","","","","","","","","","","","","","",""]
[null,null,null,null,null,null,null,null,null,null,null,null,null,null,null,null,null,null,null,"",null,null,null,null,null," ",null,{"$f":"IF(AC565=\"\",\"\",MAX($AB$3:AB564)+1)","v":""},"","","",{"$f":"IF(AB565=\"\",\"\",#REF!)","v":""},{"$f":"IF(AD565=\"\",\"\",#REF!)","v":""},"","","","","","","","","","","","","","","","","","","","","",""]
[null,null,null,null,null,null,null,null,null,null,null,null,null,null,null,null,null,null,null,"",null,null,null,null,null," ",null,{"$f":"IF(AC566=\"\",\"\",MAX($AB$3:AB565)+1)","v":""},"","","",{"$f":"IF(AB566=\"\",\"\",#REF!)","v":""},{"$f":"IF(AD566=\"\",\"\",#REF!)","v":""},"","","","","","","","","","","","","","","","","","","","","",""]
[null,null,null,null,null,null,null,null,null,null,null,null,null,null,null,null,null,null,null,"",null,null,null,null,null," ",null,{"$f":"IF(AC567=\"\",\"\",MAX($AB$3:AB566)+1)","v":""},"","","",{"$f":"IF(AB567=\"\",\"\",#REF!)","v":""},{"$f":"IF(AD567=\"\",\"\",#REF!)","v":""},"","","","","","","","","","","","","","","","","","","","","",""]
[null,null,null,null,null,null,null,null,null,null,null,null,null,null,null,null,null,null,null,"",null,null,null,null,null," ",null,{"$f":"IF(AC568=\"\",\"\",MAX($AB$3:AB567)+1)","v":""},"","","",{"$f":"IF(AB568=\"\",\"\",#REF!)","v":""},{"$f":"IF(AD568=\"\",\"\",#REF!)","v":""},"","","","","","","","","","","","","","","","","","","","","",""]
[null,null,null,null,null,null,null,null,null,null,null,null,null,null,null,null,null,null,null,"",null,null,null,null,null," ",null,{"$f":"IF(AC569=\"\",\"\",MAX($AB$3:AB568)+1)","v":""},"","","",{"$f":"IF(AB569=\"\",\"\",#REF!)","v":""},{"$f":"IF(AD569=\"\",\"\",#REF!)","v":""},"","","","","","","","","","","","","","","","","","","","","",""]
[null,null,null,null,null,null,null,null,null,null,null,null,null,null,null,null,null,null,null,"",null,null,null,null,null," ",null,{"$f":"IF(AC570=\"\",\"\",MAX($AB$3:AB569)+1)","v":""},"","","",{"$f":"IF(AB570=\"\",\"\",#REF!)","v":""},{"$f":"IF(AD570=\"\",\"\",#REF!)","v":""},"","","","","","","","","","","","","","","","","","","","","",""]
[null,null,null,null,null,null,null,null,null,null,null,null,null,null,null,null,null,null,null,"",null,null,null,null,null," ",null,{"$f":"IF(AC571=\"\",\"\",MAX($AB$3:AB570)+1)","v":""},"","","",{"$f":"IF(AB571=\"\",\"\",#REF!)","v":""},{"$f":"IF(AD571=\"\",\"\",#REF!)","v":""},"","","","","","","","","","","","","","","","","","","","","",""]
[null,null,null,null,null,null,null,null,null,null,null,null,null,null,null,null,null,null,null,"",null,null,null,null,null," ",null,{"$f":"IF(AC572=\"\",\"\",MAX($AB$3:AB571)+1)","v":""},"","","",{"$f":"IF(AB572=\"\",\"\",#REF!)","v":""},{"$f":"IF(AD572=\"\",\"\",#REF!)","v":""},"","","","","","","","","","","","","","","","","","","","","",""]
[null,null,null,null,null,null,null,null,null,null,null,null,null,null,null,null,null,null,null,"",null,null,null,null,null," ",null,{"$f":"IF(AC573=\"\",\"\",MAX($AB$3:AB572)+1)","v":""},"","","",{"$f":"IF(AB573=\"\",\"\",#REF!)","v":""},{"$f":"IF(AD573=\"\",\"\",#REF!)","v":""},"","","","","","","","","","","","","","","","","","","","","",""]
[null,null,null,null,null,null,null,null,null,null,null,null,null,null,null,null,null,null,null,"",null,null,null,null,null," ",null,{"$f":"IF(AC574=\"\",\"\",MAX($AB$3:AB573)+1)","v":""},"","","",{"$f":"IF(AB574=\"\",\"\",#REF!)","v":""},{"$f":"IF(AD574=\"\",\"\",#REF!)","v":""},"","","","","","","","","","","","","","","","","","","","","",""]
[null,null,null,null,null,null,null,null,null,null,null,null,null,null,null,null,null,null,null,"",null,null,null,null,null," ",null,{"$f":"IF(AC575=\"\",\"\",MAX($AB$3:AB574)+1)","v":""},"","","",{"$f":"IF(AB575=\"\",\"\",#REF!)","v":""},{"$f":"IF(AD575=\"\",\"\",#REF!)","v":""},"","","","","","","","","","","","","","","","","","","","","",""]
[null,null,null,null,null,null,null,null,null,null,null,null,null,null,null,null,null,null,null,"",null,null,null,null,null," ",null,{"$f":"IF(AC576=\"\",\"\",MAX($AB$3:AB575)+1)","v":""},"","","",{"$f":"IF(AB576=\"\",\"\",#REF!)","v":""},{"$f":"IF(AD576=\"\",\"\",#REF!)","v":""},"","","","","","","","","","","","","","","","","","","","","",""]
[null,null,null,null,null,null,null,null,null,null,null,null,null,null,null,null,null,null,null,"",null,null,null,null,null," ",null,{"$f":"IF(AC577=\"\",\"\",MAX($AB$3:AB576)+1)","v":""},"","","",{"$f":"IF(AB577=\"\",\"\",#REF!)","v":""},{"$f":"IF(AD577=\"\",\"\",#REF!)","v":""},"","","","","","","","","","","","","","","","","","","","","",""]
[null,null,null,null,null,null,null,null,null,null,null,null,null,null,null,null,null,null,null,"",null,null,null,null,null," ",null,{"$f":"IF(AC578=\"\",\"\",MAX($AB$3:AB577)+1)","v":""},"","","",{"$f":"IF(AB578=\"\",\"\",#REF!)","v":""},{"$f":"IF(AD578=\"\",\"\",#REF!)","v":""},"","","","","","","","","","","","","","","","","","","","","",""]
[null,null,null,null,null,null,null,null,null,null,null,null,null,null,null,null,null,null,null,"",null,null,null,null,null," ",null,{"$f":"IF(AC579=\"\",\"\",MAX($AB$3:AB578)+1)","v":""},"","","",{"$f":"IF(AB579=\"\",\"\",#REF!)","v":""},{"$f":"IF(AD579=\"\",\"\",#REF!)","v":""},"","","","","","","","","","","","","","","","","","","","","",""]
[null,null,null,null,null,null,null,null,null,null,null,null,null,null,null,null,null,null,null,"",null,null,null,null,null," ",null,{"$f":"IF(AC580=\"\",\"\",MAX($AB$3:AB579)+1)","v":""},"","","",{"$f":"IF(AB580=\"\",\"\",#REF!)","v":""},{"$f":"IF(AD580=\"\",\"\",#REF!)","v":""},"","","","","","","","","","","","","","","","","","","","","",""]
[null,null,null,null,null,null,null,null,null,null,null,null,null,null,null,null,null,null,null,"",null,null,null,null,null," ",null,{"$f":"IF(AC581=\"\",\"\",MAX($AB$3:AB580)+1)","v":""},"","","",{"$f":"IF(AB581=\"\",\"\",#REF!)","v":""},{"$f":"IF(AD581=\"\",\"\",#REF!)","v":""},"","","","","","","","","","","","","","","","","","","","","",""]
[null,null,null,null,null,null,null,null,null,null,null,null,null,null,null,null,null,null,null,"",null,null,null,null,null," ",null,{"$f":"IF(AC582=\"\",\"\",MAX($AB$3:AB581)+1)","v":""},"","","",{"$f":"IF(AB582=\"\",\"\",#REF!)","v":""},{"$f":"IF(AD582=\"\",\"\",#REF!)","v":""},"","","","","","","","","","","","","","","","","","","","","",""]
[null,null,null,null,null,null,null,null,null,null,null,null,null,null,null,null,null,null,null,"",null,null,null,null,null," ",null,{"$f":"IF(AC583=\"\",\"\",MAX($AB$3:AB582)+1)","v":""},"","","",{"$f":"IF(AB583=\"\",\"\",#REF!)","v":""},{"$f":"IF(AD583=\"\",\"\",#REF!)","v":""},"","","","","","","","","","","","","","","","","","","","","",""]
[null,null,null,null,null,null,null,null,null,null,null,null,null,null,null,null,null,null,null,"",null,null,null,null,null," ",null,{"$f":"IF(AC584=\"\",\"\",MAX($AB$3:AB583)+1)","v":""},"","","",{"$f":"IF(AB584=\"\",\"\",#REF!)","v":""},{"$f":"IF(AD584=\"\",\"\",#REF!)","v":""},"","","","","","","","","","","","","","","","","","","","","",""]
[null,null,null,null,null,null,null,null,null,null,null,null,null,null,null,null,null,null,null,"",null,null,null,null,null," ",null,{"$f":"IF(AC585=\"\",\"\",MAX($AB$3:AB584)+1)","v":""},"","","",{"$f":"IF(AB585=\"\",\"\",#REF!)","v":""},{"$f":"IF(AD585=\"\",\"\",#REF!)","v":""},"","","","","","","","","","","","","","","","","","","","","",""]
[null,null,null,null,null,null,null,null,null,null,null,null,null,null,null,null,null,null,null,"",null,null,null,null,null," ",null,{"$f":"IF(AC586=\"\",\"\",MAX($AB$3:AB585)+1)","v":""},"","","",{"$f":"IF(AB586=\"\",\"\",#REF!)","v":""},{"$f":"IF(AD586=\"\",\"\",#REF!)","v":""},"","","","","","","","","","","","","","","","","","","","","",""]
[null,null,null,null,null,null,null,null,null,null,null,null,null,null,null,null,null,null,null,"",null,null,null,null,null," ",null,{"$f":"IF(AC587=\"\",\"\",MAX($AB$3:AB586)+1)","v":""},"","","",{"$f":"IF(AB587=\"\",\"\",#REF!)","v":""},{"$f":"IF(AD587=\"\",\"\",#REF!)","v":""},"","","","","","","","","","","","","","","","","","","","","",""]
[null,null,null,null,null,null,null,null,null,null,null,null,null,null,null,null,null,null,null,"",null,null,null,null,null," ",null,{"$f":"IF(AC588=\"\",\"\",MAX($AB$3:AB587)+1)","v":""},"","","",{"$f":"IF(AB588=\"\",\"\",#REF!)","v":""},{"$f":"IF(AD588=\"\",\"\",#REF!)","v":""},"","","","","","","","","","","","","","","","","","","","","",""]
[null,null,null,null,null,null,null,null,null,null,null,null,null,null,null,null,null,null,null,"",null,null,null,null,null," ",null,{"$f":"IF(AC589=\"\",\"\",MAX($AB$3:AB588)+1)","v":""},"","","",{"$f":"IF(AB589=\"\",\"\",#REF!)","v":""},{"$f":"IF(AD589=\"\",\"\",#REF!)","v":""},"","","","","","","","","","","","","","","","","","","","","",""]
[null,null,null,null,null,null,null,null,null,null,null,null,null,null,null,null,null,null,null,"",null,null,null,null,null," ",null,{"$f":"IF(AC590=\"\",\"\",MAX($AB$3:AB589)+1)","v":""},"","","",{"$f":"IF(AB590=\"\",\"\",#REF!)","v":""},{"$f":"IF(AD590=\"\",\"\",#REF!)","v":""},"","","","","","","","","","","","","","","","","","","","","",""]
[null,null,null,null,null,null,null,null,null,null,null,null,null,null,null,null,null,null,null,"",null,null,null,null,null," ",null,{"$f":"IF(AC591=\"\",\"\",MAX($AB$3:AB590)+1)","v":""},"","","",{"$f":"IF(AB591=\"\",\"\",#REF!)","v":""},{"$f":"IF(AD591=\"\",\"\",#REF!)","v":""},"","","","","","","","","","","","","","","","","","","","","",""]
[null,null,null,null,null,null,null,null,null,null,null,null,null,null,null,null,null,null,null,"",null,null,null,null,null," ",null,{"$f":"IF(AC592=\"\",\"\",MAX($AB$3:AB591)+1)","v":""},"","","",{"$f":"IF(AB592=\"\",\"\",#REF!)","v":""},{"$f":"IF(AD592=\"\",\"\",#REF!)","v":""},"","","","","","","","","","","","","","","","","","","","","",""]
[null,null,null,null,null,null,null,null,null,null,null,null,null,null,null,null,null,null,null,"",null,null,null,null,null," ",null,{"$f":"IF(AC593=\"\",\"\",MAX($AB$3:AB592)+1)","v":""},{"$f":"IF(C593=\"\",\"\",IF(B593=$AB$1,C593,\"\"))","v":""},{"$f":"IF(AB593=\"\",\"\",B593)","v":""},{"$f":"IF(AB593=\"\",\"\",E593)","v":""},{"$f":"IF(AB593=\"\",\"\",#REF!)","v":""},{"$f":"IF(AD593=\"\",\"\",#REF!)","v":""},{"$f":"IF(AD593=\"\",\"\",U593)","v":""},{"$f":"IF(AD593=\"\",\"\",V593)","v":""},{"$f":"IF(AD593=\"\",\"\",W593)","v":""},{"$f":"IF(AH593=\"\",\"\",X593)","v":""},{"$f":"IF(AI593=\"\",\"\",Y593)","v":""},{"$f":"IF(AE593=\"\",\"\",D593)","v":""},{"$f":"IF(AE593=\"\",\"\",X593)","v":""},{"$f":"IF(AE593=\"\",\"\",Y593)","v":""},{"$f":"IF(AD593=\"\",\"\",F593)","v":""},{"$f":"IF(AE593=\"\",\"\",G593)","v":""},{"$f":"IF(AD593=\"\",\"\",H593)","v":""},{"$f":"IF(AD593=\"\",\"\",I593)","v":""},{"$f":"IF(AH593=\"\",\"\",J593)","v":""},{"$f":"IF(AI593=\"\",\"\",K593)","v":""},{"$f":"IF(AJ593=\"\",\"\",L593)","v":""},{"$f":"IF(AK593=\"\",\"\",M593)","v":""},{"$f":"IF(AL593=\"\",\"\",N593)","v":""},{"$f":"IF(AM593=\"\",\"\",O593)","v":""},{"$f":"IF(AN593=\"\",\"\",P593)","v":""},{"$f":"IF(AO593=\"\",\"\",Q593)","v":""},{"$f":"IF(AP593=\"\",\"\",R593)","v":""},{"$f":"IF(AQ593=\"\",\"\",S593)","v":""}]
[null,null,null,null,null,null,null,null,null,null,null,null,null,null,null,null,null,null,null,{"$f":"IF(AND(C594=\"\",B594=\"\"),\"\",B594+1095)","v":""},null,null,null,null,null," ",null,{"$f":"IF(AC594=\"\",\"\",MAX($AB$3:AB593)+1)","v":""},"","","",{"$f":"IF(AB594=\"\",\"\",#REF!)","v":""},{"$f":"IF(AD594=\"\",\"\",#REF!)","v":""},"","","","","","","","","","","","","","","","","","","","","",""]
[null,null,null,null,null,null,null,null,null,null,null,null,null,null,null,null,null,null,null,"",null,null,null,null,null," ",null,{"$f":"IF(AC595=\"\",\"\",MAX($AB$3:AB594)+1)","v":""},"","","",{"$f":"IF(AB595=\"\",\"\",#REF!)","v":""},{"$f":"IF(AD595=\"\",\"\",#REF!)","v":""},"","","","","","","","","","","","","","","","","","","","","",""]
[null,null,null,null,null,null,null,null,null,null,null,null,null,null,null,null,null,null,null,"",null,null,null,null,null," ",null,{"$f":"IF(AC596=\"\",\"\",MAX($AB$3:AB595)+1)","v":""},"","","",{"$f":"IF(AB596=\"\",\"\",#REF!)","v":""},{"$f":"IF(AD596=\"\",\"\",#REF!)","v":""},"","","","","","","","","","","","","","","","","","","","","",""]
[null,null,null,null,null,null,null,null,null,null,null,null,null,null,null,null,null,null,null,"",null,null,null,null,null," ",null,{"$f":"IF(AC597=\"\",\"\",MAX($AB$3:AB596)+1)","v":""},"","","",{"$f":"IF(AB597=\"\",\"\",#REF!)","v":""},{"$f":"IF(AD597=\"\",\"\",#REF!)","v":""},"","","","","","","","","","","","","","","","","","","","","",""]
[null,null,null,null,null,null,null,null,null,null,null,null,null,null,null,null,null,null,null,"",null,null,null,null,null," ",null,{"$f":"IF(AC598=\"\",\"\",MAX($AB$3:AB597)+1)","v":""},"","","",{"$f":"IF(AB598=\"\",\"\",#REF!)","v":""},{"$f":"IF(AD598=\"\",\"\",#REF!)","v":""},"","","","","","","","","","","","","","","","","","","","","",""]
[null,null,null,null,null,null,null,null,null,null,null,null,null,null,null,null,null,null,null,"",null,null,null,null,null," ",null,{"$f":"IF(AC599=\"\",\"\",MAX($AB$3:AB598)+1)","v":""},"","","",{"$f":"IF(AB599=\"\",\"\",#REF!)","v":""},{"$f":"IF(AD599=\"\",\"\",#REF!)","v":""},"","","","","","","","","","","","","","","","","","","","","",""]
[null,null,null,null,null,null,null,null,null,null,null,null,null,null,null,null,null,null,null,"",null,null,null,null,null," ",null,{"$f":"IF(AC600=\"\",\"\",MAX($AB$3:AB599)+1)","v":""},"","","",{"$f":"IF(AB600=\"\",\"\",#REF!)","v":""},{"$f":"IF(AD600=\"\",\"\",#REF!)","v":""},"","","","","","","","","","","","","","","","","","","","","",""]
[null,null,null,null,null,null,null,null,null,null,null,null,null,null,null,null,null,null,null,"",null,null,null,null,null," ",null,{"$f":"IF(AC601=\"\",\"\",MAX($AB$3:AB600)+1)","v":""},"","","",{"$f":"IF(AB601=\"\",\"\",#REF!)","v":""},{"$f":"IF(AD601=\"\",\"\",#REF!)","v":""},"","","","","","","","","","","","","","","","","","","","","",""]
[null,null,null,null,null,null,null,null,null,null,null,null,null,null,null,null,null,null,null,"",null,null,null,null,null," ",null,{"$f":"IF(AC602=\"\",\"\",MAX($AB$3:AB601)+1)","v":""},"","","",{"$f":"IF(AB602=\"\",\"\",#REF!)","v":""},{"$f":"IF(AD602=\"\",\"\",#REF!)","v":""},"","","","","","","","","","","","","","","","","","","","","",""]
[null,null,null,null,null,null,null,null,null,null,null,null,null,null,null,null,null,null,null,"",null,null,null,null,null," ",null,{"$f":"IF(AC603=\"\",\"\",MAX($AB$3:AB602)+1)","v":""},"","","",{"$f":"IF(AB603=\"\",\"\",#REF!)","v":""},{"$f":"IF(AD603=\"\",\"\",#REF!)","v":""},"","","","","","","","","","","","","","","","","","","","","",""]
[null,null,null,null,null,null,null,null,null,null,null,null,null,null,null,null,null,null,null,"",null,null,null,null,null," ",null,{"$f":"IF(AC604=\"\",\"\",MAX($AB$3:AB603)+1)","v":""},"","","",{"$f":"IF(AB604=\"\",\"\",#REF!)","v":""},{"$f":"IF(AD604=\"\",\"\",#REF!)","v":""},"","","","","","","","","","","","","","","","","","","","","",""]
[null,null,null,null,null,null,null,null,null,null,null,null,null,null,null,null,null,null,null,"",null,null,null,null,null," ",null,{"$f":"IF(AC605=\"\",\"\",MAX($AB$3:AB604)+1)","v":""},"","","",{"$f":"IF(AB605=\"\",\"\",#REF!)","v":""},{"$f":"IF(AD605=\"\",\"\",#REF!)","v":""},"","","","","","","","","","","","","","","","","","","","","",""]
[null,null,null,null,null,null,null,null,null,null,null,null,null,null,null,null,null,null,null,"",null,null,null,null,null," ",null,{"$f":"IF(AC606=\"\",\"\",MAX($AB$3:AB605)+1)","v":""},"","","",{"$f":"IF(AB606=\"\",\"\",#REF!)","v":""},{"$f":"IF(AD606=\"\",\"\",#REF!)","v":""},"","","","","","","","","","","","","","","","","","","","","",""]
[null,null,null,null,null,null,null,null,null,null,null,null,null,null,null,null,null,null,null,"",null,null,null,null,null," ",null,{"$f":"IF(AC607=\"\",\"\",MAX($AB$3:AB606)+1)","v":""},"","","",{"$f":"IF(AB607=\"\",\"\",#REF!)","v":""},{"$f":"IF(AD607=\"\",\"\",#REF!)","v":""},"","","","","","","","","","","","","","","","","","","","","",""]
[null,null,null,null,null,null,null,null,null,null,null,null,null,null,null,null,null,null,null,"",null,null,null,null,null," ",null,{"$f":"IF(AC608=\"\",\"\",MAX($AB$3:AB607)+1)","v":""},"","","",{"$f":"IF(AB608=\"\",\"\",#REF!)","v":""},{"$f":"IF(AD608=\"\",\"\",#REF!)","v":""},"","","","","","","","","","","","","","","","","","","","","",""]
[null,null,null,null,null,null,null,null,null,null,null,null,null,null,null,null,null,null,null,"",null,null,null,null,null," ",null,{"$f":"IF(AC609=\"\",\"\",MAX($AB$3:AB608)+1)","v":""},"","","",{"$f":"IF(AB609=\"\",\"\",#REF!)","v":""},{"$f":"IF(AD609=\"\",\"\",#REF!)","v":""},"","","","","","","","","","","","","","","","","","","","","",""]
[null,null,null,null,null,null,null,null,null,null,null,null,null,null,null,null,null,null,null,"",null,null,null,null,null," ",null,{"$f":"IF(AC610=\"\",\"\",MAX($AB$3:AB609)+1)","v":""},"","","",{"$f":"IF(AB610=\"\",\"\",#REF!)","v":""},{"$f":"IF(AD610=\"\",\"\",#REF!)","v":""},"","","","","","","","","","","","","","","","","","","","","",""]
[null,null,null,null,null,null,null,null,null,null,null,null,null,null,null,null,null,null,null,"",null,null,null,null,null," ",null,{"$f":"IF(AC611=\"\",\"\",MAX($AB$3:AB610)+1)","v":""},"","","",{"$f":"IF(AB611=\"\",\"\",#REF!)","v":""},{"$f":"IF(AD611=\"\",\"\",#REF!)","v":""},"","","","","","","","","","","","","","","","","","","","","",""]
[null,null,null,null,null,null,null,null,null,null,null,null,null,null,null,null,null,null,null,"",null,null,null,null,null," ",null,{"$f":"IF(AC612=\"\",\"\",MAX($AB$3:AB611)+1)","v":""},"","","",{"$f":"IF(AB612=\"\",\"\",#REF!)","v":""},{"$f":"IF(AD612=\"\",\"\",#REF!)","v":""},"","","","","","","","","","","","","","","","","","","","","",""]
[null,null,null,null,null,null,null,null,null,null,null,null,null,null,null,null,null,null,null,"",null,null,null,null,null," ",null,{"$f":"IF(AC613=\"\",\"\",MAX($AB$3:AB612)+1)","v":""},"","","",{"$f":"IF(AB613=\"\",\"\",#REF!)","v":""},{"$f":"IF(AD613=\"\",\"\",#REF!)","v":""},"","","","","","","","","","","","","","","","","","","","","",""]
[null,null,null,null,null,null,null,null,null,null,null,null,null,null,null,null,null,null,null,"",null,null,null,null,null," ",null,{"$f":"IF(AC614=\"\",\"\",MAX($AB$3:AB613)+1)","v":""},"","","",{"$f":"IF(AB614=\"\",\"\",#REF!)","v":""},{"$f":"IF(AD614=\"\",\"\",#REF!)","v":""},"","","","","","","","","","","","","","","","","","","","","",""]
[null,null,null,null,null,null,null,null,null,null,null,null,null,null,null,null,null,null,null,"",null,null,null,null,null," ",null,{"$f":"IF(AC615=\"\",\"\",MAX($AB$3:AB614)+1)","v":""},"","","",{"$f":"IF(AB615=\"\",\"\",#REF!)","v":""},{"$f":"IF(AD615=\"\",\"\",#REF!)","v":""},"","","","","","","","","","","","","","","","","","","","","",""]
[null,null,null,null,null,null,null,null,null,null,null,null,null,null,null,null,null,null,null,"",null,null,null,null,null," ",null,{"$f":"IF(AC616=\"\",\"\",MAX($AB$3:AB615)+1)","v":""},"","","",{"$f":"IF(AB616=\"\",\"\",#REF!)","v":""},{"$f":"IF(AD616=\"\",\"\",#REF!)","v":""},"","","","","","","","","","","","","","","","","","","","","",""]
[null,null,null,null,null,null,null,null,null,null,null,null,null,null,null,null,null,null,null,"",null,null,null,null,null," ",null,{"$f":"IF(AC617=\"\",\"\",MAX($AB$3:AB616)+1)","v":""},"","","",{"$f":"IF(AB617=\"\",\"\",#REF!)","v":""},{"$f":"IF(AD617=\"\",\"\",#REF!)","v":""},"","","","","","","","","","","","","","","","","","","","","",""]
[null,null,null,null,null,null,null,null,null,null,null,null,null,null,null,null,null,null,null,"",null,null,null,null,null," ",null,{"$f":"IF(AC618=\"\",\"\",MAX($AB$3:AB617)+1)","v":""},"","","",{"$f":"IF(AB618=\"\",\"\",#REF!)","v":""},{"$f":"IF(AD618=\"\",\"\",#REF!)","v":""},"","","","","","","","","","","","","","","","","","","","","",""]
[null,null,null,null,null,null,null,null,null,null,null,null,null,null,null,null,null,null,null,"",null,null,null,null,null," ",null,{"$f":"IF(AC619=\"\",\"\",MAX($AB$3:AB618)+1)","v":""},"","","",{"$f":"IF(AB619=\"\",\"\",#REF!)","v":""},{"$f":"IF(AD619=\"\",\"\",#REF!)","v":""},"","","","","","","","","","","","","","","","","","","","","",""]
[null,null,null,null,null,null,null,null,null,null,null,null,null,null,null,null,null,null,null,"",null,null,null,null,null," ",null,{"$f":"IF(AC620=\"\",\"\",MAX($AB$3:AB619)+1)","v":""},"","","",{"$f":"IF(AB620=\"\",\"\",#REF!)","v":""},{"$f":"IF(AD620=\"\",\"\",#REF!)","v":""},"","","","","","","","","","","","","","","","","","","","","",""]
[null,null,null,null,null,null,null,null,null,null,null,null,null,null,null,null,null,null,null,"",null,null,null,null,null," ",null,{"$f":"IF(AC621=\"\",\"\",MAX($AB$3:AB620)+1)","v":""},"","","",{"$f":"IF(AB621=\"\",\"\",#REF!)","v":""},{"$f":"IF(AD621=\"\",\"\",#REF!)","v":""},"","","","","","","","","","","","","","","","","","","","","",""]
[null,null,null,null,null,null,null,null,null,null,null,null,null,null,null,null,null,null,null,"",null,null,null,null,null," ",null,{"$f":"IF(AC622=\"\",\"\",MAX($AB$3:AB621)+1)","v":""},"","","",{"$f":"IF(AB622=\"\",\"\",#REF!)","v":""},{"$f":"IF(AD622=\"\",\"\",#REF!)","v":""},"","","","","","","","","","","","","","","","","","","","","",""]
[null,null,null,null,null,null,null,null,null,null,null,null,null,null,null,null,null,null,null,"",null,null,null,null,null," ",null,{"$f":"IF(AC623=\"\",\"\",MAX($AB$3:AB622)+1)","v":""},"","","",{"$f":"IF(AB623=\"\",\"\",#REF!)","v":""},{"$f":"IF(AD623=\"\",\"\",#REF!)","v":""},"","","","","","","","","","","","","","","","","","","","","",""]
[null,null,null,null,null,null,null,null,null,null,null,null,null,null,null,null,null,null,null,"",null,null,null,null,null," ",null,{"$f":"IF(AC624=\"\",\"\",MAX($AB$3:AB623)+1)","v":""},"","","",{"$f":"IF(AB624=\"\",\"\",#REF!)","v":""},{"$f":"IF(AD624=\"\",\"\",#REF!)","v":""},"","","","","","","","","","","","","","","","","","","","","",""]
[null,null,null,null,null,null,null,null,null,null,null,null,null,null,null,null,null,null,null,"",null,null,null,null,null," ",null,{"$f":"IF(AC625=\"\",\"\",MAX($AB$3:AB624)+1)","v":""},"","","",{"$f":"IF(AB625=\"\",\"\",#REF!)","v":""},{"$f":"IF(AD625=\"\",\"\",#REF!)","v":""},"","","","","","","","","","","","","","","","","","","","","",""]
[null,null,null,null,null,null,null,null,null,null,null,null,null,null,null,null,null,null,null,"",null,null,null,null,null," ",null,{"$f":"IF(AC626=\"\",\"\",MAX($AB$3:AB625)+1)","v":""},"","","",{"$f":"IF(AB626=\"\",\"\",#REF!)","v":""},{"$f":"IF(AD626=\"\",\"\",#REF!)","v":""},"","","","","","","","","","","","","","","","","","","","","",""]
[null,null,null,null,null,null,null,null,null,null,null,null,null,null,null,null,null,null,null,"",null,null,null,null,null," ",null,{"$f":"IF(AC627=\"\",\"\",MAX($AB$3:AB626)+1)","v":""},"","","",{"$f":"IF(AB627=\"\",\"\",#REF!)","v":""},{"$f":"IF(AD627=\"\",\"\",#REF!)","v":""},"","","","","","","","","","","","","","","","","","","","","",""]
[null,null,null,null,null,null,null,null,null,null,null,null,null,null,null,null,null,null,null,"",null,null,null,null,null," ",null,{"$f":"IF(AC628=\"\",\"\",MAX($AB$3:AB627)+1)","v":""},"","","",{"$f":"IF(AB628=\"\",\"\",#REF!)","v":""},{"$f":"IF(AD628=\"\",\"\",#REF!)","v":""},"","","","","","","","","","","","","","","","","","","","","",""]
[null,null,null,null,null,null,null,null,null,null,null,null,null,null,null,null,null,null,null,"",null,null,null,null,null," ",null,{"$f":"IF(AC629=\"\",\"\",MAX($AB$3:AB628)+1)","v":""},"","","",{"$f":"IF(AB629=\"\",\"\",#REF!)","v":""},{"$f":"IF(AD629=\"\",\"\",#REF!)","v":""},"","","","","","","","","","","","","","","","","","","","","",""]
[null,null,null,null,null,null,null,null,null,null,null,null,null,null,null,null,null,null,null,"",null,null,null,null,null," ",null,{"$f":"IF(AC630=\"\",\"\",MAX($AB$3:AB629)+1)","v":""},"","","",{"$f":"IF(AB630=\"\",\"\",#REF!)","v":""},{"$f":"IF(AD630=\"\",\"\",#REF!)","v":""},"","","","","","","","","","","","","","","","","","","","","",""]
[null,null,null,null,null,null,null,null,null,null,null,null,null,null,null,null,null,null,null,"",null,null,null,null,null," ",null,{"$f":"IF(AC631=\"\",\"\",MAX($AB$3:AB630)+1)","v":""},"","","",{"$f":"IF(AB631=\"\",\"\",#REF!)","v":""},{"$f":"IF(AD631=\"\",\"\",#REF!)","v":""},"","","","","","","","","","","","","","","","","","","","","",""]
[null,null,null,null,null,null,null,null,null,null,null,null,null,null,null,null,null,null,null,"",null,null,null,null,null," ",null,{"$f":"IF(AC632=\"\",\"\",MAX($AB$3:AB631)+1)","v":""},"","","",{"$f":"IF(AB632=\"\",\"\",#REF!)","v":""},{"$f":"IF(AD632=\"\",\"\",#REF!)","v":""},"","","","","","","","","","","","","","","","","","","","","",""]
[null,null,null,null,null,null,null,null,null,null,null,null,null,null,null,null,null,null,null,"",null,null,null,null,null," ",null,{"$f":"IF(AC633=\"\",\"\",MAX($AB$3:AB632)+1)","v":""},"","","",{"$f":"IF(AB633=\"\",\"\",#REF!)","v":""},{"$f":"IF(AD633=\"\",\"\",#REF!)","v":""},"","","","","","","","","","","","","","","","","","","","","",""]
[null,null,null,null,null,null,null,null,null,null,null,null,null,null,null,null,null,null,null,"",null,null,null,null,null," ",null,{"$f":"IF(AC634=\"\",\"\",MAX($AB$3:AB633)+1)","v":""},"","","",{"$f":"IF(AB634=\"\",\"\",#REF!)","v":""},{"$f":"IF(AD634=\"\",\"\",#REF!)","v":""},"","","","","","","","","","","","","","","","","","","","","",""]
[null,null,null,null,null,null,null,null,null,null,null,null,null,null,null,null,null,null,null,"",null,null,null,null,null," ",null,{"$f":"IF(AC635=\"\",\"\",MAX($AB$3:AB634)+1)","v":""},"","","",{"$f":"IF(AB635=\"\",\"\",#REF!)","v":""},{"$f":"IF(AD635=\"\",\"\",#REF!)","v":""},"","","","","","","","","","","","","","","","","","","","","",""]
[null,null,null,null,null,null,null,null,null,null,null,null,null,null,null,null,null,null,null,"",null,null,null,null,null," ",null,{"$f":"IF(AC636=\"\",\"\",MAX($AB$3:AB635)+1)","v":""},"","","",{"$f":"IF(AB636=\"\",\"\",#REF!)","v":""},{"$f":"IF(AD636=\"\",\"\",#REF!)","v":""},"","","","","","","","","","","","","","","","","","","","","",""]
[null,null,null,null,null,null,null,null,null,null,null,null,null,null,null,null,null,null,null,"",null,null,null,null,null," ",null,{"$f":"IF(AC637=\"\",\"\",MAX($AB$3:AB636)+1)","v":""},"","","",{"$f":"IF(AB637=\"\",\"\",#REF!)","v":""},{"$f":"IF(AD637=\"\",\"\",#REF!)","v":""},"","","","","","","","","","","","","","","","","","","","","",""]
[null,null,null,null,null,null,null,null,null,null,null,null,null,null,null,null,null,null,null,"",null,null,null,null,null," ",null,{"$f":"IF(AC638=\"\",\"\",MAX($AB$3:AB637)+1)","v":""},"","","",{"$f":"IF(AB638=\"\",\"\",#REF!)","v":""},{"$f":"IF(AD638=\"\",\"\",#REF!)","v":""},"","","","","","","","","","","","","","","","","","","","","",""]
[null,null,null,null,null,null,null,null,null,null,null,null,null,null,null,null,null,null,null,"",null,null,null,null,null," ",null,{"$f":"IF(AC639=\"\",\"\",MAX($AB$3:AB638)+1)","v":""},"","","",{"$f":"IF(AB639=\"\",\"\",#REF!)","v":""},{"$f":"IF(AD639=\"\",\"\",#REF!)","v":""},"","","","","","","","","","","","","","","","","","","","","",""]
[null,null,null,null,null,null,null,null,null,null,null,null,null,null,null,null,null,null,null,"",null,null,null,null,null," ",null,{"$f":"IF(AC640=\"\",\"\",MAX($AB$3:AB639)+1)","v":""},"","","",{"$f":"IF(AB640=\"\",\"\",#REF!)","v":""},{"$f":"IF(AD640=\"\",\"\",#REF!)","v":""},"","","","","","","","","","","","","","","","","","","","","",""]
[null,null,null,null,null,null,null,null,null,null,null,null,null,null,null,null,null,null,null,"",null,null,null,null,null," ",null,{"$f":"IF(AC641=\"\",\"\",MAX($AB$3:AB640)+1)","v":""},"","","",{"$f":"IF(AB641=\"\",\"\",#REF!)","v":""},{"$f":"IF(AD641=\"\",\"\",#REF!)","v":""},"","","","","","","","","","","","","","","","","","","","","",""]
[null,null,null,null,null,null,null,null,null,null,null,null,null,null,null,null,null,null,null,"",null,null,null,null,null," ",null,{"$f":"IF(AC642=\"\",\"\",MAX($AB$3:AB641)+1)","v":""},"","","",{"$f":"IF(AB642=\"\",\"\",#REF!)","v":""},{"$f":"IF(AD642=\"\",\"\",#REF!)","v":""},"","","","","","","","","","","","","","","","","","","","","",""]
[null,null,null,null,null,null,null,null,null,null,null,null,null,null,null,null,null,null,null,"",null,null,null,null,null," ",null,{"$f":"IF(AC643=\"\",\"\",MAX($AB$3:AB642)+1)","v":""},"","","",{"$f":"IF(AB643=\"\",\"\",#REF!)","v":""},{"$f":"IF(AD643=\"\",\"\",#REF!)","v":""},"","","","","","","","","","","","","","","","","","","","","",""]
[null,null,null,null,null,null,null,null,null,null,null,null,null,null,null,null,null,null,null,"",null,null,null,null,null," ",null,{"$f":"IF(AC644=\"\",\"\",MAX($AB$3:AB643)+1)","v":""},"","","",{"$f":"IF(AB644=\"\",\"\",#REF!)","v":""},{"$f":"IF(AD644=\"\",\"\",#REF!)","v":""},"","","","","","","","","","","","","","","","","","","","","",""]
[null,null,null,null,null,null,null,null,null,null,null,null,null,null,null,null,null,null,null,"",null,null,null,null,null," ",null,{"$f":"IF(AC645=\"\",\"\",MAX($AB$3:AB644)+1)","v":""},"","","",{"$f":"IF(AB645=\"\",\"\",#REF!)","v":""},{"$f":"IF(AD645=\"\",\"\",#REF!)","v":""},"","","","","","","","","","","","","","","","","","","","","",""]
[null,null,null,null,null,null,null,null,null,null,null,null,null,null,null,null,null,null,null,"",null,null,null,null,null," ",null,{"$f":"IF(AC646=\"\",\"\",MAX($AB$3:AB645)+1)","v":""},"","","",{"$f":"IF(AB646=\"\",\"\",#REF!)","v":""},{"$f":"IF(AD646=\"\",\"\",#REF!)","v":""},"","","","","","","","","","","","","","","","","","","","","",""]
[null,null,null,null,null,null,null,null,null,null,null,null,null,null,null,null,null,null,null,"",null,null,null,null,null," ",null,{"$f":"IF(AC647=\"\",\"\",MAX($AB$3:AB646)+1)","v":""},"","","",{"$f":"IF(AB647=\"\",\"\",#REF!)","v":""},{"$f":"IF(AD647=\"\",\"\",#REF!)","v":""},"","","","","","","","","","","","","","","","","","","","","",""]
[null,null,null,null,null,null,null,null,null,null,null,null,null,null,null,null,null,null,null,"",null,null,null,null,null," ",null,{"$f":"IF(AC648=\"\",\"\",MAX($AB$3:AB647)+1)","v":""},"","","",{"$f":"IF(AB648=\"\",\"\",#REF!)","v":""},{"$f":"IF(AD648=\"\",\"\",#REF!)","v":""},"","","","","","","","","","","","","","","","","","","","","",""]
[null,null,null,null,null,null,null,null,null,null,null,null,null,null,null,null,null,null,null,"",null,null,null,null,null," ",null,{"$f":"IF(AC649=\"\",\"\",MAX($AB$3:AB648)+1)","v":""},"","","",{"$f":"IF(AB649=\"\",\"\",#REF!)","v":""},{"$f":"IF(AD649=\"\",\"\",#REF!)","v":""},"","","","","","","","","","","","","","","","","","","","","",""]
[null,null,null,null,null,null,null,null,null,null,null,null,null,null,null,null,null,null,null,"",null,null,null,null,null," ",null,{"$f":"IF(AC650=\"\",\"\",MAX($AB$3:AB649)+1)","v":""},"","","",{"$f":"IF(AB650=\"\",\"\",#REF!)","v":""},{"$f":"IF(AD650=\"\",\"\",#REF!)","v":""},"","","","","","","","","","","","","","","","","","","","","",""]
[null,null,null,null,null,null,null,null,null,null,null,null,null,null,null,null,null,null,null,"",null,null,null,null,null," ",null,{"$f":"IF(AC651=\"\",\"\",MAX($AB$3:AB650)+1)","v":""},"","","",{"$f":"IF(AB651=\"\",\"\",#REF!)","v":""},{"$f":"IF(AD651=\"\",\"\",#REF!)","v":""},"","","","","","","","","","","","","","","","","","","","","",""]
[null,null,null,null,null,null,null,null,null,null,null,null,null,null,null,null,null,null,null,"",null,null,null,null,null," ",null,{"$f":"IF(AC652=\"\",\"\",MAX($AB$3:AB651)+1)","v":""},"","","",{"$f":"IF(AB652=\"\",\"\",#REF!)","v":""},{"$f":"IF(AD652=\"\",\"\",#REF!)","v":""},"","","","","","","","","","","","","","","","","","","","","",""]
[null,null,null,null,null,null,null,null,null,null,null,null,null,null,null,null,null,null,null,"",null,null,null,null,null," ",null,{"$f":"IF(AC653=\"\",\"\",MAX($AB$3:AB652)+1)","v":""},"","","",{"$f":"IF(AB653=\"\",\"\",#REF!)","v":""},{"$f":"IF(AD653=\"\",\"\",#REF!)","v":""},"","","","","","","","","","","","","","","","","","","","","",""]
[null,null,null,null,null,null,null,null,null,null,null,null,null,null,null,null,null,null,null,"",null,null,null,null,null," ",null,{"$f":"IF(AC654=\"\",\"\",MAX($AB$3:AB653)+1)","v":""},"","","",{"$f":"IF(AB654=\"\",\"\",#REF!)","v":""},{"$f":"IF(AD654=\"\",\"\",#REF!)","v":""},"","","","","","","","","","","","","","","","","","","","","",""]
[null,null,null,null,null,null,null,null,null,null,null,null,null,null,null,null,null,null,null,"",null,null,null,null,null," ",null,{"$f":"IF(AC655=\"\",\"\",MAX($AB$3:AB654)+1)","v":""},"","","",{"$f":"IF(AB655=\"\",\"\",#REF!)","v":""},{"$f":"IF(AD655=\"\",\"\",#REF!)","v":""},"","","","","","","","","","","","","","","","","","","","","",""]
[null,null,null,null,null,null,null,null,null,null,null,null,null,null,null,null,null,null,null,"",null,null,null,null,null," ",null,{"$f":"IF(AC656=\"\",\"\",MAX($AB$3:AB655)+1)","v":""},"","","",{"$f":"IF(AB656=\"\",\"\",#REF!)","v":""},{"$f":"IF(AD656=\"\",\"\",#REF!)","v":""},"","","","","","","","","","","","","","","","","","","","","",""]
[null,null,null,null,null,null,null,null,null,null,null,null,null,null,null,null,null,null,null,"",null,null,null,null,null," ",null,{"$f":"IF(AC657=\"\",\"\",MAX($AB$3:AB656)+1)","v":""},{"$f":"IF(C657=\"\",\"\",IF(B657=$AB$1,C657,\"\"))","v":""},{"$f":"IF(AB657=\"\",\"\",B657)","v":""},{"$f":"IF(AB657=\"\",\"\",E657)","v":""},{"$f":"IF(AB657=\"\",\"\",#REF!)","v":""},{"$f":"IF(AD657=\"\",\"\",#REF!)","v":""},{"$f":"IF(AD657=\"\",\"\",U657)","v":""},{"$f":"IF(AD657=\"\",\"\",V657)","v":""},{"$f":"IF(AD657=\"\",\"\",W657)","v":""},{"$f":"IF(AH657=\"\",\"\",X657)","v":""},{"$f":"IF(AI657=\"\",\"\",Y657)","v":""},{"$f":"IF(AE657=\"\",\"\",D657)","v":""},{"$f":"IF(AE657=\"\",\"\",X657)","v":""},{"$f":"IF(AE657=\"\",\"\",Y657)","v":""},{"$f":"IF(AD657=\"\",\"\",F657)","v":""},{"$f":"IF(AE657=\"\",\"\",G657)","v":""},{"$f":"IF(AD657=\"\",\"\",H657)","v":""},{"$f":"IF(AD657=\"\",\"\",I657)","v":""},{"$f":"IF(AH657=\"\",\"\",J657)","v":""},{"$f":"IF(AI657=\"\",\"\",K657)","v":""},{"$f":"IF(AJ657=\"\",\"\",L657)","v":""},{"$f":"IF(AK657=\"\",\"\",M657)","v":""},{"$f":"IF(AL657=\"\",\"\",N657)","v":""},{"$f":"IF(AM657=\"\",\"\",O657)","v":""},{"$f":"IF(AN657=\"\",\"\",P657)","v":""},{"$f":"IF(AO657=\"\",\"\",Q657)","v":""},{"$f":"IF(AP657=\"\",\"\",R657)","v":""},{"$f":"IF(AQ657=\"\",\"\",S657)","v":""}]
[null,null,null,null,null,null,null,null,null,null,null,null,null,null,null,null,null,null,null,{"$f":"IF(AND(C658=\"\",B658=\"\"),\"\",B658+1095)","v":""},null,null,null,null,null," ",null,{"$f":"IF(AC658=\"\",\"\",MAX($AB$3:AB657)+1)","v":""},"","","",{"$f":"IF(AB658=\"\",\"\",#REF!)","v":""},{"$f":"IF(AD658=\"\",\"\",#REF!)","v":""},"","","","","","","","","","","","","","","","","","","","","",""]
[null,null,null,null,null,null,null,null,null,null,null,null,null,null,null,null,null,null,null,"",null,null,null,null,null," ",null,{"$f":"IF(AC659=\"\",\"\",MAX($AB$3:AB658)+1)","v":""},"","","",{"$f":"IF(AB659=\"\",\"\",#REF!)","v":""},{"$f":"IF(AD659=\"\",\"\",#REF!)","v":""},"","","","","","","","","","","","","","","","","","","","","",""]
[null,null,null,null,null,null,null,null,null,null,null,null,null,null,null,null,null,null,null,"",null,null,null,null,null," ",null,{"$f":"IF(AC660=\"\",\"\",MAX($AB$3:AB659)+1)","v":""},"","","",{"$f":"IF(AB660=\"\",\"\",#REF!)","v":""},{"$f":"IF(AD660=\"\",\"\",#REF!)","v":""},"","","","","","","","","","","","","","","","","","","","","",""]
[null,null,null,null,null,null,null,null,null,null,null,null,null,null,null,null,null,null,null,"",null,null,null,null,null," ",null,{"$f":"IF(AC661=\"\",\"\",MAX($AB$3:AB660)+1)","v":""},"","","",{"$f":"IF(AB661=\"\",\"\",#REF!)","v":""},{"$f":"IF(AD661=\"\",\"\",#REF!)","v":""},"","","","","","","","","","","","","","","","","","","","","",""]
[null,null,null,null,null,null,null,null,null,null,null,null,null,null,null,null,null,null,null,"",null,null,null,null,null," ",null,{"$f":"IF(AC662=\"\",\"\",MAX($AB$3:AB661)+1)","v":""},"","","",{"$f":"IF(AB662=\"\",\"\",#REF!)","v":""},{"$f":"IF(AD662=\"\",\"\",#REF!)","v":""},"","","","","","","","","","","","","","","","","","","","","",""]
[null,null,null,null,null,null,null,null,null,null,null,null,null,null,null,null,null,null,null,"",null,null,null,null,null," ",null,{"$f":"IF(AC663=\"\",\"\",MAX($AB$3:AB662)+1)","v":""},"","","",{"$f":"IF(AB663=\"\",\"\",#REF!)","v":""},{"$f":"IF(AD663=\"\",\"\",#REF!)","v":""},"","","","","","","","","","","","","","","","","","","","","",""]
[null,null,null,null,null,null,null,null,null,null,null,null,null,null,null,null,null,null,null,"",null,null,null,null,null," ",null,{"$f":"IF(AC664=\"\",\"\",MAX($AB$3:AB663)+1)","v":""},"","","",{"$f":"IF(AB664=\"\",\"\",#REF!)","v":""},{"$f":"IF(AD664=\"\",\"\",#REF!)","v":""},"","","","","","","","","","","","","","","","","","","","","",""]
[null,null,null,null,null,null,null,null,null,null,null,null,null,null,null,null,null,null,null,"",null,null,null,null,null," ",null,{"$f":"IF(AC665=\"\",\"\",MAX($AB$3:AB664)+1)","v":""},"","","",{"$f":"IF(AB665=\"\",\"\",#REF!)","v":""},{"$f":"IF(AD665=\"\",\"\",#REF!)","v":""},"","","","","","","","","","","","","","","","","","","","","",""]
[null,null,null,null,null,null,null,null,null,null,null,null,null,null,null,null,null,null,null,"",null,null,null,null,null," ",null,{"$f":"IF(AC666=\"\",\"\",MAX($AB$3:AB665)+1)","v":""},"","","",{"$f":"IF(AB666=\"\",\"\",#REF!)","v":""},{"$f":"IF(AD666=\"\",\"\",#REF!)","v":""},"","","","","","","","","","","","","","","","","","","","","",""]
[null,null,null,null,null,null,null,null,null,null,null,null,null,null,null,null,null,null,null,"",null,null,null,null,null," ",null,{"$f":"IF(AC667=\"\",\"\",MAX($AB$3:AB666)+1)","v":""},"","","",{"$f":"IF(AB667=\"\",\"\",#REF!)","v":""},{"$f":"IF(AD667=\"\",\"\",#REF!)","v":""},"","","","","","","","","","","","","","","","","","","","","",""]
[null,null,null,null,null,null,null,null,null,null,null,null,null,null,null,null,null,null,null,"",null,null,null,null,null," ",null,{"$f":"IF(AC668=\"\",\"\",MAX($AB$3:AB667)+1)","v":""},"","","",{"$f":"IF(AB668=\"\",\"\",#REF!)","v":""},{"$f":"IF(AD668=\"\",\"\",#REF!)","v":""},"","","","","","","","","","","","","","","","","","","","","",""]
[null,null,null,null,null,null,null,null,null,null,null,null,null,null,null,null,null,null,null,"",null,null,null,null,null," ",null,{"$f":"IF(AC669=\"\",\"\",MAX($AB$3:AB668)+1)","v":""},"","","",{"$f":"IF(AB669=\"\",\"\",#REF!)","v":""},{"$f":"IF(AD669=\"\",\"\",#REF!)","v":""},"","","","","","","","","","","","","","","","","","","","","",""]
[null,null,null,null,null,null,null,null,null,null,null,null,null,null,null,null,null,null,null,"",null,null,null,null,null," ",null,{"$f":"IF(AC670=\"\",\"\",MAX($AB$3:AB669)+1)","v":""},"","","",{"$f":"IF(AB670=\"\",\"\",#REF!)","v":""},{"$f":"IF(AD670=\"\",\"\",#REF!)","v":""},"","","","","","","","","","","","","","","","","","","","","",""]
[null,null,null,null,null,null,null,null,null,null,null,null,null,null,null,null,null,null,null,"",null,null,null,null,null," ",null,{"$f":"IF(AC671=\"\",\"\",MAX($AB$3:AB670)+1)","v":""},"","","",{"$f":"IF(AB671=\"\",\"\",#REF!)","v":""},{"$f":"IF(AD671=\"\",\"\",#REF!)","v":""},"","","","","","","","","","","","","","","","","","","","","",""]
[null,null,null,null,null,null,null,null,null,null,null,null,null,null,null,null,null,null,null,"",null,null,null,null,null," ",null,{"$f":"IF(AC672=\"\",\"\",MAX($AB$3:AB671)+1)","v":""},"","","",{"$f":"IF(AB672=\"\",\"\",#REF!)","v":""},{"$f":"IF(AD672=\"\",\"\",#REF!)","v":""},"","","","","","","","","","","","","","","","","","","","","",""]
[null,null,null,null,null,null,null,null,null,null,null,null,null,null,null,null,null,null,null,"",null,null,null,null,null," ",null,{"$f":"IF(AC673=\"\",\"\",MAX($AB$3:AB672)+1)","v":""},"","","",{"$f":"IF(AB673=\"\",\"\",#REF!)","v":""},{"$f":"IF(AD673=\"\",\"\",#REF!)","v":""},"","","","","","","","","","","","","","","","","","","","","",""]
[null,null,null,null,null,null,null,null,null,null,null,null,null,null,null,null,null,null,null,"",null,null,null,null,null," ",null,{"$f":"IF(AC674=\"\",\"\",MAX($AB$3:AB673)+1)","v":""},"","","",{"$f":"IF(AB674=\"\",\"\",#REF!)","v":""},{"$f":"IF(AD674=\"\",\"\",#REF!)","v":""},"","","","","","","","","","","","","","","","","","","","","",""]
[null,null,null,null,null,null,null,null,null,null,null,null,null,null,null,null,null,null,null,"",null,null,null,null,null," ",null,{"$f":"IF(AC675=\"\",\"\",MAX($AB$3:AB674)+1)","v":""},"","","",{"$f":"IF(AB675=\"\",\"\",#REF!)","v":""},{"$f":"IF(AD675=\"\",\"\",#REF!)","v":""},"","","","","","","","","","","","","","","","","","","","","",""]
[null,null,null,null,null,null,null,null,null,null,null,null,null,null,null,null,null,null,null,"",null,null,null,null,null," ",null,{"$f":"IF(AC676=\"\",\"\",MAX($AB$3:AB675)+1)","v":""},"","","",{"$f":"IF(AB676=\"\",\"\",#REF!)","v":""},{"$f":"IF(AD676=\"\",\"\",#REF!)","v":""},"","","","","","","","","","","","","","","","","","","","","",""]
[null,null,null,null,null,null,null,null,null,null,null,null,null,null,null,null,null,null,null,"",null,null,null,null,null," ",null,{"$f":"IF(AC677=\"\",\"\",MAX($AB$3:AB676)+1)","v":""},"","","",{"$f":"IF(AB677=\"\",\"\",#REF!)","v":""},{"$f":"IF(AD677=\"\",\"\",#REF!)","v":""},"","","","","","","","","","","","","","","","","","","","","",""]
[null,null,null,null,null,null,null,null,null,null,null,null,null,null,null,null,null,null,null,"",null,null,null,null,null," ",null,{"$f":"IF(AC678=\"\",\"\",MAX($AB$3:AB677)+1)","v":""},"","","",{"$f":"IF(AB678=\"\",\"\",#REF!)","v":""},{"$f":"IF(AD678=\"\",\"\",#REF!)","v":""},"","","","","","","","","","","","","","","","","","","","","",""]
[null,null,null,null,null,null,null,null,null,null,null,null,null,null,null,null,null,null,null,"",null,null,null,null,null," ",null,{"$f":"IF(AC679=\"\",\"\",MAX($AB$3:AB678)+1)","v":""},"","","",{"$f":"IF(AB679=\"\",\"\",#REF!)","v":""},{"$f":"IF(AD679=\"\",\"\",#REF!)","v":""},"","","","","","","","","","","","","","","","","","","","","",""]
[null,null,null,null,null,null,null,null,null,null,null,null,null,null,null,null,null,null,null,"",null,null,null,null,null," ",null,{"$f":"IF(AC680=\"\",\"\",MAX($AB$3:AB679)+1)","v":""},"","","",{"$f":"IF(AB680=\"\",\"\",#REF!)","v":""},{"$f":"IF(AD680=\"\",\"\",#REF!)","v":""},"","","","","","","","","","","","","","","","","","","","","",""]
[null,null,null,null,null,null,null,null,null,null,null,null,null,null,null,null,null,null,null,"",null,null,null,null,null," ",null,{"$f":"IF(AC681=\"\",\"\",MAX($AB$3:AB680)+1)","v":""},"","","",{"$f":"IF(AB681=\"\",\"\",#REF!)","v":""},{"$f":"IF(AD681=\"\",\"\",#REF!)","v":""},"","","","","","","","","","","","","","","","","","","","","",""]
[null,null,null,null,null,null,null,null,null,null,null,null,null,null,null,null,null,null,null,"",null,null,null,null,null," ",null,{"$f":"IF(AC682=\"\",\"\",MAX($AB$3:AB681)+1)","v":""},"","","",{"$f":"IF(AB682=\"\",\"\",#REF!)","v":""},{"$f":"IF(AD682=\"\",\"\",#REF!)","v":""},"","","","","","","","","","","","","","","","","","","","","",""]
[null,null,null,null,null,null,null,null,null,null,null,null,null,null,null,null,null,null,null,"",null,null,null,null,null," ",null,{"$f":"IF(AC683=\"\",\"\",MAX($AB$3:AB682)+1)","v":""},"","","",{"$f":"IF(AB683=\"\",\"\",#REF!)","v":""},{"$f":"IF(AD683=\"\",\"\",#REF!)","v":""},"","","","","","","","","","","","","","","","","","","","","",""]
[null,null,null,null,null,null,null,null,null,null,null,null,null,null,null,null,null,null,null,"",null,null,null,null,null," ",null,{"$f":"IF(AC684=\"\",\"\",MAX($AB$3:AB683)+1)","v":""},"","","",{"$f":"IF(AB684=\"\",\"\",#REF!)","v":""},{"$f":"IF(AD684=\"\",\"\",#REF!)","v":""},"","","","","","","","","","","","","","","","","","","","","",""]
[null,null,null,null,null,null,null,null,null,null,null,null,null,null,null,null,null,null,null,"",null,null,null,null,null," ",null,{"$f":"IF(AC685=\"\",\"\",MAX($AB$3:AB684)+1)","v":""},"","","",{"$f":"IF(AB685=\"\",\"\",#REF!)","v":""},{"$f":"IF(AD685=\"\",\"\",#REF!)","v":""},"","","","","","","","","","","","","","","","","","","","","",""]
[null,null,null,null,null,null,null,null,null,null,null,null,null,null,null,null,null,null,null,"",null,null,null,null,null," ",null,{"$f":"IF(AC686=\"\",\"\",MAX($AB$3:AB685)+1)","v":""},"","","",{"$f":"IF(AB686=\"\",\"\",#REF!)","v":""},{"$f":"IF(AD686=\"\",\"\",#REF!)","v":""},"","","","","","","","","","","","","","","","","","","","","",""]
[null,null,null,null,null,null,null,null,null,null,null,null,null,null,null,null,null,null,null,"",null,null,null,null,null," ",null,{"$f":"IF(AC687=\"\",\"\",MAX($AB$3:AB686)+1)","v":""},"","","",{"$f":"IF(AB687=\"\",\"\",#REF!)","v":""},{"$f":"IF(AD687=\"\",\"\",#REF!)","v":""},"","","","","","","","","","","","","","","","","","","","","",""]
[null,null,null,null,null,null,null,null,null,null,null,null,null,null,null,null,null,null,null,"",null,null,null,null,null," ",null,{"$f":"IF(AC688=\"\",\"\",MAX($AB$3:AB687)+1)","v":""},"","","",{"$f":"IF(AB688=\"\",\"\",#REF!)","v":""},{"$f":"IF(AD688=\"\",\"\",#REF!)","v":""},"","","","","","","","","","","","","","","","","","","","","",""]
[null,null,null,null,null,null,null,null,null,null,null,null,null,null,null,null,null,null,null,"",null,null,null,null,null," ",null,{"$f":"IF(AC689=\"\",\"\",MAX($AB$3:AB688)+1)","v":""},"","","",{"$f":"IF(AB689=\"\",\"\",#REF!)","v":""},{"$f":"IF(AD689=\"\",\"\",#REF!)","v":""},"","","","","","","","","","","","","","","","","","","","","",""]
[null,null,null,null,null,null,null,null,null,null,null,null,null,null,null,null,null,null,null,"",null,null,null,null,null," ",null,{"$f":"IF(AC690=\"\",\"\",MAX($AB$3:AB689)+1)","v":""},"","","",{"$f":"IF(AB690=\"\",\"\",#REF!)","v":""},{"$f":"IF(AD690=\"\",\"\",#REF!)","v":""},"","","","","","","","","","","","","","","","","","","","","",""]
[null,null,null,null,null,null,null,null,null,null,null,null,null,null,null,null,null,null,null,"",null,null,null,null,null," ",null,{"$f":"IF(AC691=\"\",\"\",MAX($AB$3:AB690)+1)","v":""},"","","",{"$f":"IF(AB691=\"\",\"\",#REF!)","v":""},{"$f":"IF(AD691=\"\",\"\",#REF!)","v":""},"","","","","","","","","","","","","","","","","","","","","",""]
[null,null,null,null,null,null,null,null,null,null,null,null,null,null,null,null,null,null,null,"",null,null,null,null,null," ",null,{"$f":"IF(AC692=\"\",\"\",MAX($AB$3:AB691)+1)","v":""},"","","",{"$f":"IF(AB692=\"\",\"\",#REF!)","v":""},{"$f":"IF(AD692=\"\",\"\",#REF!)","v":""},"","","","","","","","","","","","","","","","","","","","","",""]
[null,null,null,null,null,null,null,null,null,null,null,null,null,null,null,null,null,null,null,"",null,null,null,null,null," ",null,{"$f":"IF(AC693=\"\",\"\",MAX($AB$3:AB692)+1)","v":""},"","","",{"$f":"IF(AB693=\"\",\"\",#REF!)","v":""},{"$f":"IF(AD693=\"\",\"\",#REF!)","v":""},"","","","","","","","","","","","","","","","","","","","","",""]
[null,null,null,null,null,null,null,null,null,null,null,null,null,null,null,null,null,null,null,"",null,null,null,null,null," ",null,{"$f":"IF(AC694=\"\",\"\",MAX($AB$3:AB693)+1)","v":""},"","","",{"$f":"IF(AB694=\"\",\"\",#REF!)","v":""},{"$f":"IF(AD694=\"\",\"\",#REF!)","v":""},"","","","","","","","","","","","","","","","","","","","","",""]
[null,null,null,null,null,null,null,null,null,null,null,null,null,null,null,null,null,null,null,"",null,null,null,null,null," ",null,{"$f":"IF(AC695=\"\",\"\",MAX($AB$3:AB694)+1)","v":""},"","","",{"$f":"IF(AB695=\"\",\"\",#REF!)","v":""},{"$f":"IF(AD695=\"\",\"\",#REF!)","v":""},"","","","","","","","","","","","","","","","","","","","","",""]
[null,null,null,null,null,null,null,null,null,null,null,null,null,null,null,null,null,null,null,"",null,null,null,null,null," ",null,{"$f":"IF(AC696=\"\",\"\",MAX($AB$3:AB695)+1)","v":""},"","","",{"$f":"IF(AB696=\"\",\"\",#REF!)","v":""},{"$f":"IF(AD696=\"\",\"\",#REF!)","v":""},"","","","","","","","","","","","","","","","","","","","","",""]
[null,null,null,null,null,null,null,null,null,null,null,null,null,null,null,null,null,null,null,"",null,null,null,null,null," ",null,{"$f":"IF(AC697=\"\",\"\",MAX($AB$3:AB696)+1)","v":""},"","","",{"$f":"IF(AB697=\"\",\"\",#REF!)","v":""},{"$f":"IF(AD697=\"\",\"\",#REF!)","v":""},"","","","","","","","","","","","","","","","","","","","","",""]
[null,null,null,null,null,null,null,null,null,null,null,null,null,null,null,null,null,null,null,"",null,null,null,null,null," ",null,{"$f":"IF(AC698=\"\",\"\",MAX($AB$3:AB697)+1)","v":""},"","","",{"$f":"IF(AB698=\"\",\"\",#REF!)","v":""},{"$f":"IF(AD698=\"\",\"\",#REF!)","v":""},"","","","","","","","","","","","","","","","","","","","","",""]
[null,null,null,null,null,null,null,null,null,null,null,null,null,null,null,null,null,null,null,"",null,null,null,null,null," ",null,{"$f":"IF(AC699=\"\",\"\",MAX($AB$3:AB698)+1)","v":""},"","","",{"$f":"IF(AB699=\"\",\"\",#REF!)","v":""},{"$f":"IF(AD699=\"\",\"\",#REF!)","v":""},"","","","","","","","","","","","","","","","","","","","","",""]
[null,null,null,null,null,null,null,null,null,null,null,null,null,null,null,null,null,null,null,"",null,null,null,null,null," ",null,{"$f":"IF(AC700=\"\",\"\",MAX($AB$3:AB699)+1)","v":""},"","","",{"$f":"IF(AB700=\"\",\"\",#REF!)","v":""},{"$f":"IF(AD700=\"\",\"\",#REF!)","v":""},"","","","","","","","","","","","","","","","","","","","","",""]
[null,null,null,null,null,null,null,null,null,null,null,null,null,null,null,null,null,null,null,"",null,null,null,null,null," ",null,{"$f":"IF(AC701=\"\",\"\",MAX($AB$3:AB700)+1)","v":""},"","","",{"$f":"IF(AB701=\"\",\"\",#REF!)","v":""},{"$f":"IF(AD701=\"\",\"\",#REF!)","v":""},"","","","","","","","","","","","","","","","","","","","","",""]
[null,null,null,null,null,null,null,null,null,null,null,null,null,null,null,null,null,null,null,"",null,null,null,null,null," ",null,{"$f":"IF(AC702=\"\",\"\",MAX($AB$3:AB701)+1)","v":""},"","","",{"$f":"IF(AB702=\"\",\"\",#REF!)","v":""},{"$f":"IF(AD702=\"\",\"\",#REF!)","v":""},"","","","","","","","","","","","","","","","","","","","","",""]
[null,null,null,null,null,null,null,null,null,null,null,null,null,null,null,null,null,null,null,"",null,null,null,null,null," ",null,{"$f":"IF(AC703=\"\",\"\",MAX($AB$3:AB702)+1)","v":""},"","","",{"$f":"IF(AB703=\"\",\"\",#REF!)","v":""},{"$f":"IF(AD703=\"\",\"\",#REF!)","v":""},"","","","","","","","","","","","","","","","","","","","","",""]
[null,null,null,null,null,null,null,null,null,null,null,null,null,null,null,null,null,null,null,"",null,null,null,null,null," ",null,{"$f":"IF(AC704=\"\",\"\",MAX($AB$3:AB703)+1)","v":""},"","","",{"$f":"IF(AB704=\"\",\"\",#REF!)","v":""},{"$f":"IF(AD704=\"\",\"\",#REF!)","v":""},"","","","","","","","","","","","","","","","","","","","","",""]
[null,null,null,null,null,null,null,null,null,null,null,null,null,null,null,null,null,null,null,"",null,null,null,null,null," ",null,{"$f":"IF(AC705=\"\",\"\",MAX($AB$3:AB704)+1)","v":""},"","","",{"$f":"IF(AB705=\"\",\"\",#REF!)","v":""},{"$f":"IF(AD705=\"\",\"\",#REF!)","v":""},"","","","","","","","","","","","","","","","","","","","","",""]
[null,null,null,null,null,null,null,null,null,null,null,null,null,null,null,null,null,null,null,"",null,null,null,null,null," ",null,{"$f":"IF(AC706=\"\",\"\",MAX($AB$3:AB705)+1)","v":""},"","","",{"$f":"IF(AB706=\"\",\"\",#REF!)","v":""},{"$f":"IF(AD706=\"\",\"\",#REF!)","v":""},"","","","","","","","","","","","","","","","","","","","","",""]
[null,null,null,null,null,null,null,null,null,null,null,null,null,null,null,null,null,null,null,"",null,null,null,null,null," ",null,{"$f":"IF(AC707=\"\",\"\",MAX($AB$3:AB706)+1)","v":""},"","","",{"$f":"IF(AB707=\"\",\"\",#REF!)","v":""},{"$f":"IF(AD707=\"\",\"\",#REF!)","v":""},"","","","","","","","","","","","","","","","","","","","","",""]
[null,null,null,null,null,null,null,null,null,null,null,null,null,null,null,null,null,null,null,"",null,null,null,null,null," ",null,{"$f":"IF(AC708=\"\",\"\",MAX($AB$3:AB707)+1)","v":""},"","","",{"$f":"IF(AB708=\"\",\"\",#REF!)","v":""},{"$f":"IF(AD708=\"\",\"\",#REF!)","v":""},"","","","","","","","","","","","","","","","","","","","","",""]
[null,null,null,null,null,null,null,null,null,null,null,null,null,null,null,null,null,null,null,"",null,null,null,null,null," ",null,{"$f":"IF(AC709=\"\",\"\",MAX($AB$3:AB708)+1)","v":""},"","","",{"$f":"IF(AB709=\"\",\"\",#REF!)","v":""},{"$f":"IF(AD709=\"\",\"\",#REF!)","v":""},"","","","","","","","","","","","","","","","","","","","","",""]
[null,null,null,null,null,null,null,null,null,null,null,null,null,null,null,null,null,null,null,"",null,null,null,null,null," ",null,{"$f":"IF(AC710=\"\",\"\",MAX($AB$3:AB709)+1)","v":""},"","","",{"$f":"IF(AB710=\"\",\"\",#REF!)","v":""},{"$f":"IF(AD710=\"\",\"\",#REF!)","v":""},"","","","","","","","","","","","","","","","","","","","","",""]
[null,null,null,null,null,null,null,null,null,null,null,null,null,null,null,null,null,null,null,"",null,null,null,null,null," ",null,{"$f":"IF(AC711=\"\",\"\",MAX($AB$3:AB710)+1)","v":""},"","","",{"$f":"IF(AB711=\"\",\"\",#REF!)","v":""},{"$f":"IF(AD711=\"\",\"\",#REF!)","v":""},"","","","","","","","","","","","","","","","","","","","","",""]
[null,null,null,null,null,null,null,null,null,null,null,null,null,null,null,null,null,null,null,"",null,null,null,null,null," ",null,{"$f":"IF(AC712=\"\",\"\",MAX($AB$3:AB711)+1)","v":""},"","","",{"$f":"IF(AB712=\"\",\"\",#REF!)","v":""},{"$f":"IF(AD712=\"\",\"\",#REF!)","v":""},"","","","","","","","","","","","","","","","","","","","","",""]
[null,null,null,null,null,null,null,null,null,null,null,null,null,null,null,null,null,null,null,"",null,null,null,null,null," ",null,{"$f":"IF(AC713=\"\",\"\",MAX($AB$3:AB712)+1)","v":""},"","","",{"$f":"IF(AB713=\"\",\"\",#REF!)","v":""},{"$f":"IF(AD713=\"\",\"\",#REF!)","v":""},"","","","","","","","","","","","","","","","","","","","","",""]
[null,null,null,null,null,null,null,null,null,null,null,null,null,null,null,null,null,null,null,"",null,null,null,null,null," ",null,{"$f":"IF(AC714=\"\",\"\",MAX($AB$3:AB713)+1)","v":""},"","","",{"$f":"IF(AB714=\"\",\"\",#REF!)","v":""},{"$f":"IF(AD714=\"\",\"\",#REF!)","v":""},"","","","","","","","","","","","","","","","","","","","","",""]
[null,null,null,null,null,null,null,null,null,null,null,null,null,null,null,null,null,null,null,"",null,null,null,null,null," ",null,{"$f":"IF(AC715=\"\",\"\",MAX($AB$3:AB714)+1)","v":""},"","","",{"$f":"IF(AB715=\"\",\"\",#REF!)","v":""},{"$f":"IF(AD715=\"\",\"\",#REF!)","v":""},"","","","","","","","","","","","","","","","","","","","","",""]
[null,null,null,null,null,null,null,null,null,null,null,null,null,null,null,null,null,null,null,"",null,null,null,null,null," ",null,{"$f":"IF(AC716=\"\",\"\",MAX($AB$3:AB715)+1)","v":""},"","","",{"$f":"IF(AB716=\"\",\"\",#REF!)","v":""},{"$f":"IF(AD716=\"\",\"\",#REF!)","v":""},"","","","","","","","","","","","","","","","","","","","","",""]
[null,null,null,null,null,null,null,null,null,null,null,null,null,null,null,null,null,null,null,"",null,null,null,null,null," ",null,{"$f":"IF(AC717=\"\",\"\",MAX($AB$3:AB716)+1)","v":""},"","","",{"$f":"IF(AB717=\"\",\"\",#REF!)","v":""},{"$f":"IF(AD717=\"\",\"\",#REF!)","v":""},"","","","","","","","","","","","","","","","","","","","","",""]
[null,null,null,null,null,null,null,null,null,null,null,null,null,null,null,null,null,null,null,"",null,null,null,null,null," ",null,{"$f":"IF(AC718=\"\",\"\",MAX($AB$3:AB717)+1)","v":""},"","","",{"$f":"IF(AB718=\"\",\"\",#REF!)","v":""},{"$f":"IF(AD718=\"\",\"\",#REF!)","v":""},"","","","","","","","","","","","","","","","","","","","","",""]
[null,null,null,null,null,null,null,null,null,null,null,null,null,null,null,null,null,null,null,"",null,null,null,null,null," ",null,{"$f":"IF(AC719=\"\",\"\",MAX($AB$3:AB718)+1)","v":""},"","","",{"$f":"IF(AB719=\"\",\"\",#REF!)","v":""},{"$f":"IF(AD719=\"\",\"\",#REF!)","v":""},"","","","","","","","","","","","","","","","","","","","","",""]
[null,null,null,null,null,null,null,null,null,null,null,null,null,null,null,null,null,null,null,"",null,null,null,null,null," ",null,{"$f":"IF(AC720=\"\",\"\",MAX($AB$3:AB719)+1)","v":""},"","","",{"$f":"IF(AB720=\"\",\"\",#REF!)","v":""},{"$f":"IF(AD720=\"\",\"\",#REF!)","v":""},"","","","","","","","","","","","","","","","","","","","","",""]
[null,null,null,null,null,null,null,null,null,null,null,null,null,null,null,null,null,null,null,"",null,null,null,null,null," ",null,{"$f":"IF(AC721=\"\",\"\",MAX($AB$3:AB720)+1)","v":""},{"$f":"IF(C721=\"\",\"\",IF(B721=$AB$1,C721,\"\"))","v":""},{"$f":"IF(AB721=\"\",\"\",B721)","v":""},{"$f":"IF(AB721=\"\",\"\",E721)","v":""},{"$f":"IF(AB721=\"\",\"\",#REF!)","v":""},{"$f":"IF(AD721=\"\",\"\",#REF!)","v":""},{"$f":"IF(AD721=\"\",\"\",U721)","v":""},{"$f":"IF(AD721=\"\",\"\",V721)","v":""},{"$f":"IF(AD721=\"\",\"\",W721)","v":""},{"$f":"IF(AH721=\"\",\"\",X721)","v":""},{"$f":"IF(AI721=\"\",\"\",Y721)","v":""},{"$f":"IF(AE721=\"\",\"\",D721)","v":""},{"$f":"IF(AE721=\"\",\"\",X721)","v":""},{"$f":"IF(AE721=\"\",\"\",Y721)","v":""},{"$f":"IF(AD721=\"\",\"\",F721)","v":""},{"$f":"IF(AE721=\"\",\"\",G721)","v":""},{"$f":"IF(AD721=\"\",\"\",H721)","v":""},{"$f":"IF(AD721=\"\",\"\",I721)","v":""},{"$f":"IF(AH721=\"\",\"\",J721)","v":""},{"$f":"IF(AI721=\"\",\"\",K721)","v":""},{"$f":"IF(AJ721=\"\",\"\",L721)","v":""},{"$f":"IF(AK721=\"\",\"\",M721)","v":""},{"$f":"IF(AL721=\"\",\"\",N721)","v":""},{"$f":"IF(AM721=\"\",\"\",O721)","v":""},{"$f":"IF(AN721=\"\",\"\",P721)","v":""},{"$f":"IF(AO721=\"\",\"\",Q721)","v":""},{"$f":"IF(AP721=\"\",\"\",R721)","v":""},{"$f":"IF(AQ721=\"\",\"\",S721)","v":""}]
[null,null,null,null,null,null,null,null,null,null,null,null,null,null,null,null,null,null,null,{"$f":"IF(AND(C722=\"\",B722=\"\"),\"\",B722+1095)","v":""},null,null,null,null,null," ",null,{"$f":"IF(AC722=\"\",\"\",MAX($AB$3:AB721)+1)","v":""},"","","",{"$f":"IF(AB722=\"\",\"\",#REF!)","v":""},{"$f":"IF(AD722=\"\",\"\",#REF!)","v":""},"","","","","","","","","","","","","","","","","","","","","",""]
[null,null,null,null,null,null,null,null,null,null,null,null,null,null,null,null,null,null,null,"",null,null,null,null,null," ",null,{"$f":"IF(AC723=\"\",\"\",MAX($AB$3:AB722)+1)","v":""},"","","",{"$f":"IF(AB723=\"\",\"\",#REF!)","v":""},{"$f":"IF(AD723=\"\",\"\",#REF!)","v":""},"","","","","","","","","","","","","","","","","","","","","",""]
[null,null,null,null,null,null,null,null,null,null,null,null,null,null,null,null,null,null,null,"",null,null,null,null,null," ",null,{"$f":"IF(AC724=\"\",\"\",MAX($AB$3:AB723)+1)","v":""},"","","",{"$f":"IF(AB724=\"\",\"\",#REF!)","v":""},{"$f":"IF(AD724=\"\",\"\",#REF!)","v":""},"","","","","","","","","","","","","","","","","","","","","",""]
[null,null,null,null,null,null,null,null,null,null,null,null,null,null,null,null,null,null,null,"",null,null,null,null,null," ",null,{"$f":"IF(AC725=\"\",\"\",MAX($AB$3:AB724)+1)","v":""},"","","",{"$f":"IF(AB725=\"\",\"\",#REF!)","v":""},{"$f":"IF(AD725=\"\",\"\",#REF!)","v":""},"","","","","","","","","","","","","","","","","","","","","",""]
[null,null,null,null,null,null,null,null,null,null,null,null,null,null,null,null,null,null,null,"",null,null,null,null,null," ",null,{"$f":"IF(AC726=\"\",\"\",MAX($AB$3:AB725)+1)","v":""},"","","",{"$f":"IF(AB726=\"\",\"\",#REF!)","v":""},{"$f":"IF(AD726=\"\",\"\",#REF!)","v":""},"","","","","","","","","","","","","","","","","","","","","",""]
[null,null,null,null,null,null,null,null,null,null,null,null,null,null,null,null,null,null,null,"",null,null,null,null,null," ",null,{"$f":"IF(AC727=\"\",\"\",MAX($AB$3:AB726)+1)","v":""},"","","",{"$f":"IF(AB727=\"\",\"\",#REF!)","v":""},{"$f":"IF(AD727=\"\",\"\",#REF!)","v":""},"","","","","","","","","","","","","","","","","","","","","",""]
[null,null,null,null,null,null,null,null,null,null,null,null,null,null,null,null,null,null,null,"",null,null,null,null,null," ",null,{"$f":"IF(AC728=\"\",\"\",MAX($AB$3:AB727)+1)","v":""},"","","",{"$f":"IF(AB728=\"\",\"\",#REF!)","v":""},{"$f":"IF(AD728=\"\",\"\",#REF!)","v":""},"","","","","","","","","","","","","","","","","","","","","",""]
[null,null,null,null,null,null,null,null,null,null,null,null,null,null,null,null,null,null,null,"",null,null,null,null,null," ",null,{"$f":"IF(AC729=\"\",\"\",MAX($AB$3:AB728)+1)","v":""},"","","",{"$f":"IF(AB729=\"\",\"\",#REF!)","v":""},{"$f":"IF(AD729=\"\",\"\",#REF!)","v":""},"","","","","","","","","","","","","","","","","","","","","",""]
[null,null,null,null,null,null,null,null,null,null,null,null,null,null,null,null,null,null,null,"",null,null,null,null,null," ",null,{"$f":"IF(AC730=\"\",\"\",MAX($AB$3:AB729)+1)","v":""},"","","",{"$f":"IF(AB730=\"\",\"\",#REF!)","v":""},{"$f":"IF(AD730=\"\",\"\",#REF!)","v":""},"","","","","","","","","","","","","","","","","","","","","",""]
[null,null,null,null,null,null,null,null,null,null,null,null,null,null,null,null,null,null,null,"",null,null,null,null,null," ",null,{"$f":"IF(AC731=\"\",\"\",MAX($AB$3:AB730)+1)","v":""},"","","",{"$f":"IF(AB731=\"\",\"\",#REF!)","v":""},{"$f":"IF(AD731=\"\",\"\",#REF!)","v":""},"","","","","","","","","","","","","","","","","","","","","",""]
[null,null,null,null,null,null,null,null,null,null,null,null,null,null,null,null,null,null,null,"",null,null,null,null,null," ",null,{"$f":"IF(AC732=\"\",\"\",MAX($AB$3:AB731)+1)","v":""},"","","",{"$f":"IF(AB732=\"\",\"\",#REF!)","v":""},{"$f":"IF(AD732=\"\",\"\",#REF!)","v":""},"","","","","","","","","","","","","","","","","","","","","",""]
[null,null,null,null,null,null,null,null,null,null,null,null,null,null,null,null,null,null,null,"",null,null,null,null,null," ",null,{"$f":"IF(AC733=\"\",\"\",MAX($AB$3:AB732)+1)","v":""},"","","",{"$f":"IF(AB733=\"\",\"\",#REF!)","v":""},{"$f":"IF(AD733=\"\",\"\",#REF!)","v":""},"","","","","","","","","","","","","","","","","","","","","",""]
[null,null,null,null,null,null,null,null,null,null,null,null,null,null,null,null,null,null,null,"",null,null,null,null,null," ",null,{"$f":"IF(AC734=\"\",\"\",MAX($AB$3:AB733)+1)","v":""},"","","",{"$f":"IF(AB734=\"\",\"\",#REF!)","v":""},{"$f":"IF(AD734=\"\",\"\",#REF!)","v":""},"","","","","","","","","","","","","","","","","","","","","",""]
[null,null,null,null,null,null,null,null,null,null,null,null,null,null,null,null,null,null,null,"",null,null,null,null,null," ",null,{"$f":"IF(AC735=\"\",\"\",MAX($AB$3:AB734)+1)","v":""},"","","",{"$f":"IF(AB735=\"\",\"\",#REF!)","v":""},{"$f":"IF(AD735=\"\",\"\",#REF!)","v":""},"","","","","","","","","","","","","","","","","","","","","",""]
[null,null,null,null,null,null,null,null,null,null,null,null,null,null,null,null,null,null,null,"",null,null,null,null,null," ",null,{"$f":"IF(AC736=\"\",\"\",MAX($AB$3:AB735)+1)","v":""},"","","",{"$f":"IF(AB736=\"\",\"\",#REF!)","v":""},{"$f":"IF(AD736=\"\",\"\",#REF!)","v":""},"","","","","","","","","","","","","","","","","","","","","",""]
[null,null,null,null,null,null,null,null,null,null,null,null,null,null,null,null,null,null,null,"",null,null,null,null,null," ",null,{"$f":"IF(AC737=\"\",\"\",MAX($AB$3:AB736)+1)","v":""},"","","",{"$f":"IF(AB737=\"\",\"\",#REF!)","v":""},{"$f":"IF(AD737=\"\",\"\",#REF!)","v":""},"","","","","","","","","","","","","","","","","","","","","",""]
[null,null,null,null,null,null,null,null,null,null,null,null,null,null,null,null,null,null,null,"",null,null,null,null,null," ",null,{"$f":"IF(AC738=\"\",\"\",MAX($AB$3:AB737)+1)","v":""},"","","",{"$f":"IF(AB738=\"\",\"\",#REF!)","v":""},{"$f":"IF(AD738=\"\",\"\",#REF!)","v":""},"","","","","","","","","","","","","","","","","","","","","",""]
[null,null,null,null,null,null,null,null,null,null,null,null,null,null,null,null,null,null,null,"",null,null,null,null,null," ",null,{"$f":"IF(AC739=\"\",\"\",MAX($AB$3:AB738)+1)","v":""},"","","",{"$f":"IF(AB739=\"\",\"\",#REF!)","v":""},{"$f":"IF(AD739=\"\",\"\",#REF!)","v":""},"","","","","","","","","","","","","","","","","","","","","",""]
[null,null,null,null,null,null,null,null,null,null,null,null,null,null,null,null,null,null,null,"",null,null,null,null,null," ",null,{"$f":"IF(AC740=\"\",\"\",MAX($AB$3:AB739)+1)","v":""},"","","",{"$f":"IF(AB740=\"\",\"\",#REF!)","v":""},{"$f":"IF(AD740=\"\",\"\",#REF!)","v":""},"","","","","","","","","","","","","","","","","","","","","",""]
[null,null,null,null,null,null,null,null,null,null,null,null,null,null,null,null,null,null,null,"",null,null,null,null,null," ",null,{"$f":"IF(AC741=\"\",\"\",MAX($AB$3:AB740)+1)","v":""},"","","",{"$f":"IF(AB741=\"\",\"\",#REF!)","v":""},{"$f":"IF(AD741=\"\",\"\",#REF!)","v":""},"","","","","","","","","","","","","","","","","","","","","",""]
[null,null,null,null,null,null,null,null,null,null,null,null,null,null,null,null,null,null,null,"",null,null,null,null,null," ",null,{"$f":"IF(AC742=\"\",\"\",MAX($AB$3:AB741)+1)","v":""},"","","",{"$f":"IF(AB742=\"\",\"\",#REF!)","v":""},{"$f":"IF(AD742=\"\",\"\",#REF!)","v":""},"","","","","","","","","","","","","","","","","","","","","",""]
[null,null,null,null,null,null,null,null,null,null,null,null,null,null,null,null,null,null,null,"",null,null,null,null,null," ",null,{"$f":"IF(AC743=\"\",\"\",MAX($AB$3:AB742)+1)","v":""},"","","",{"$f":"IF(AB743=\"\",\"\",#REF!)","v":""},{"$f":"IF(AD743=\"\",\"\",#REF!)","v":""},"","","","","","","","","","","","","","","","","","","","","",""]
[null,null,null,null,null,null,null,null,null,null,null,null,null,null,null,null,null,null,null,"",null,null,null,null,null," ",null,{"$f":"IF(AC744=\"\",\"\",MAX($AB$3:AB743)+1)","v":""},"","","",{"$f":"IF(AB744=\"\",\"\",#REF!)","v":""},{"$f":"IF(AD744=\"\",\"\",#REF!)","v":""},"","","","","","","","","","","","","","","","","","","","","",""]
[null,null,null,null,null,null,null,null,null,null,null,null,null,null,null,null,null,null,null,"",null,null,null,null,null," ",null,{"$f":"IF(AC745=\"\",\"\",MAX($AB$3:AB744)+1)","v":""},"","","",{"$f":"IF(AB745=\"\",\"\",#REF!)","v":""},{"$f":"IF(AD745=\"\",\"\",#REF!)","v":""},"","","","","","","","","","","","","","","","","","","","","",""]
[null,null,null,null,null,null,null,null,null,null,null,null,null,null,null,null,null,null,null,"",null,null,null,null,null," ",null,{"$f":"IF(AC746=\"\",\"\",MAX($AB$3:AB745)+1)","v":""},"","","",{"$f":"IF(AB746=\"\",\"\",#REF!)","v":""},{"$f":"IF(AD746=\"\",\"\",#REF!)","v":""},"","","","","","","","","","","","","","","","","","","","","",""]
[null,null,null,null,null,null,null,null,null,null,null,null,null,null,null,null,null,null,null,"",null,null,null,null,null," ",null,{"$f":"IF(AC747=\"\",\"\",MAX($AB$3:AB746)+1)","v":""},"","","",{"$f":"IF(AB747=\"\",\"\",#REF!)","v":""},{"$f":"IF(AD747=\"\",\"\",#REF!)","v":""},"","","","","","","","","","","","","","","","","","","","","",""]
[null,null,null,null,null,null,null,null,null,null,null,null,null,null,null,null,null,null,null,"",null,null,null,null,null," ",null,{"$f":"IF(AC748=\"\",\"\",MAX($AB$3:AB747)+1)","v":""},"","","",{"$f":"IF(AB748=\"\",\"\",#REF!)","v":""},{"$f":"IF(AD748=\"\",\"\",#REF!)","v":""},"","","","","","","","","","","","","","","","","","","","","",""]
[null,null,null,null,null,null,null,null,null,null,null,null,null,null,null,null,null,null,null,"",null,null,null,null,null," ",null,{"$f":"IF(AC749=\"\",\"\",MAX($AB$3:AB748)+1)","v":""},"","","",{"$f":"IF(AB749=\"\",\"\",#REF!)","v":""},{"$f":"IF(AD749=\"\",\"\",#REF!)","v":""},"","","","","","","","","","","","","","","","","","","","","",""]
[null,null,null,null,null,null,null,null,null,null,null,null,null,null,null,null,null,null,null,"",null,null,null,null,null," ",null,{"$f":"IF(AC750=\"\",\"\",MAX($AB$3:AB749)+1)","v":""},"","","",{"$f":"IF(AB750=\"\",\"\",#REF!)","v":""},{"$f":"IF(AD750=\"\",\"\",#REF!)","v":""},"","","","","","","","","","","","","","","","","","","","","",""]
[null,null,null,null,null,null,null,null,null,null,null,null,null,null,null,null,null,null,null,"",null,null,null,null,null," ",null,{"$f":"IF(AC751=\"\",\"\",MAX($AB$3:AB750)+1)","v":""},"","","",{"$f":"IF(AB751=\"\",\"\",#REF!)","v":""},{"$f":"IF(AD751=\"\",\"\",#REF!)","v":""},"","","","","","","","","","","","","","","","","","","","","",""]
[null,null,null,null,null,null,null,null,null,null,null,null,null,null,null,null,null,null,null,"",null,null,null,null,null," ",null,{"$f":"IF(AC752=\"\",\"\",MAX($AB$3:AB751)+1)","v":""},"","","",{"$f":"IF(AB752=\"\",\"\",#REF!)","v":""},{"$f":"IF(AD752=\"\",\"\",#REF!)","v":""},"","","","","","","","","","","","","","","","","","","","","",""]
[null,null,null,null,null,null,null,null,null,null,null,null,null,null,null,null,null,null,null,"",null,null,null,null,null," ",null,{"$f":"IF(AC753=\"\",\"\",MAX($AB$3:AB752)+1)","v":""},"","","",{"$f":"IF(AB753=\"\",\"\",#REF!)","v":""},{"$f":"IF(AD753=\"\",\"\",#REF!)","v":""},"","","","","","","","","","","","","","","","","","","","","",""]
[null,null,null,null,null,null,null,null,null,null,null,null,null,null,null,null,null,null,null,"",null,null,null,null,null," ",null,{"$f":"IF(AC754=\"\",\"\",MAX($AB$3:AB753)+1)","v":""},"","","",{"$f":"IF(AB754=\"\",\"\",#REF!)","v":""},{"$f":"IF(AD754=\"\",\"\",#REF!)","v":""},"","","","","","","","","","","","","","","","","","","","","",""]
[null,null,null,null,null,null,null,null,null,null,null,null,null,null,null,null,null,null,null,"",null,null,null,null,null," ",null,{"$f":"IF(AC755=\"\",\"\",MAX($AB$3:AB754)+1)","v":""},"","","",{"$f":"IF(AB755=\"\",\"\",#REF!)","v":""},{"$f":"IF(AD755=\"\",\"\",#REF!)","v":""},"","","","","","","","","","","","","","","","","","","","","",""]
[null,null,null,null,null,null,null,null,null,null,null,null,null,null,null,null,null,null,null,"",null,null,null,null,null," ",null,{"$f":"IF(AC756=\"\",\"\",MAX($AB$3:AB755)+1)","v":""},"","","",{"$f":"IF(AB756=\"\",\"\",#REF!)","v":""},{"$f":"IF(AD756=\"\",\"\",#REF!)","v":""},"","","","","","","","","","","","","","","","","","","","","",""]
[null,null,null,null,null,null,null,null,null,null,null,null,null,null,null,null,null,null,null,"",null,null,null,null,null," ",null,{"$f":"IF(AC757=\"\",\"\",MAX($AB$3:AB756)+1)","v":""},"","","",{"$f":"IF(AB757=\"\",\"\",#REF!)","v":""},{"$f":"IF(AD757=\"\",\"\",#REF!)","v":""},"","","","","","","","","","","","","","","","","","","","","",""]
[null,null,null,null,null,null,null,null,null,null,null,null,null,null,null,null,null,null,null,"",null,null,null,null,null," ",null,{"$f":"IF(AC758=\"\",\"\",MAX($AB$3:AB757)+1)","v":""},"","","",{"$f":"IF(AB758=\"\",\"\",#REF!)","v":""},{"$f":"IF(AD758=\"\",\"\",#REF!)","v":""},"","","","","","","","","","","","","","","","","","","","","",""]
[null,null,null,null,null,null,null,null,null,null,null,null,null,null,null,null,null,null,null,"",null,null,null,null,null," ",null,{"$f":"IF(AC759=\"\",\"\",MAX($AB$3:AB758)+1)","v":""},"","","",{"$f":"IF(AB759=\"\",\"\",#REF!)","v":""},{"$f":"IF(AD759=\"\",\"\",#REF!)","v":""},"","","","","","","","","","","","","","","","","","","","","",""]
[null,null,null,null,null,null,null,null,null,null,null,null,null,null,null,null,null,null,null,"",null,null,null,null,null," ",null,{"$f":"IF(AC760=\"\",\"\",MAX($AB$3:AB759)+1)","v":""},"","","",{"$f":"IF(AB760=\"\",\"\",#REF!)","v":""},{"$f":"IF(AD760=\"\",\"\",#REF!)","v":""},"","","","","","","","","","","","","","","","","","","","","",""]
[null,null,null,null,null,null,null,null,null,null,null,null,null,null,null,null,null,null,null,"",null,null,null,null,null," ",null,{"$f":"IF(AC761=\"\",\"\",MAX($AB$3:AB760)+1)","v":""},"","","",{"$f":"IF(AB761=\"\",\"\",#REF!)","v":""},{"$f":"IF(AD761=\"\",\"\",#REF!)","v":""},"","","","","","","","","","","","","","","","","","","","","",""]
[null,null,null,null,null,null,null,null,null,null,null,null,null,null,null,null,null,null,null,"",null,null,null,null,null," ",null,{"$f":"IF(AC762=\"\",\"\",MAX($AB$3:AB761)+1)","v":""},"","","",{"$f":"IF(AB762=\"\",\"\",#REF!)","v":""},{"$f":"IF(AD762=\"\",\"\",#REF!)","v":""},"","","","","","","","","","","","","","","","","","","","","",""]
[null,null,null,null,null,null,null,null,null,null,null,null,null,null,null,null,null,null,null,"",null,null,null,null,null," ",null,{"$f":"IF(AC763=\"\",\"\",MAX($AB$3:AB762)+1)","v":""},"","","",{"$f":"IF(AB763=\"\",\"\",#REF!)","v":""},{"$f":"IF(AD763=\"\",\"\",#REF!)","v":""},"","","","","","","","","","","","","","","","","","","","","",""]
[null,null,null,null,null,null,null,null,null,null,null,null,null,null,null,null,null,null,null,"",null,null,null,null,null," ",null,{"$f":"IF(AC764=\"\",\"\",MAX($AB$3:AB763)+1)","v":""},"","","",{"$f":"IF(AB764=\"\",\"\",#REF!)","v":""},{"$f":"IF(AD764=\"\",\"\",#REF!)","v":""},"","","","","","","","","","","","","","","","","","","","","",""]
[null,null,null,null,null,null,null,null,null,null,null,null,null,null,null,null,null,null,null,"",null,null,null,null,null," ",null,{"$f":"IF(AC765=\"\",\"\",MAX($AB$3:AB764)+1)","v":""},"","","",{"$f":"IF(AB765=\"\",\"\",#REF!)","v":""},{"$f":"IF(AD765=\"\",\"\",#REF!)","v":""},"","","","","","","","","","","","","","","","","","","","","",""]
[null,null,null,null,null,null,null,null,null,null,null,null,null,null,null,null,null,null,null,"",null,null,null,null,null," ",null,{"$f":"IF(AC766=\"\",\"\",MAX($AB$3:AB765)+1)","v":""},"","","",{"$f":"IF(AB766=\"\",\"\",#REF!)","v":""},{"$f":"IF(AD766=\"\",\"\",#REF!)","v":""},"","","","","","","","","","","","","","","","","","","","","",""]
[null,null,null,null,null,null,null,null,null,null,null,null,null,null,null,null,null,null,null,"",null,null,null,null,null," ",null,{"$f":"IF(AC767=\"\",\"\",MAX($AB$3:AB766)+1)","v":""},"","","",{"$f":"IF(AB767=\"\",\"\",#REF!)","v":""},{"$f":"IF(AD767=\"\",\"\",#REF!)","v":""},"","","","","","","","","","","","","","","","","","","","","",""]
[null,null,null,null,null,null,null,null,null,null,null,null,null,null,null,null,null,null,null,"",null,null,null,null,null," ",null,{"$f":"IF(AC768=\"\",\"\",MAX($AB$3:AB767)+1)","v":""},"","","",{"$f":"IF(AB768=\"\",\"\",#REF!)","v":""},{"$f":"IF(AD768=\"\",\"\",#REF!)","v":""},"","","","","","","","","","","","","","","","","","","","","",""]
[null,null,null,null,null,null,null,null,null,null,null,null,null,null,null,null,null,null,null,"",null,null,null,null,null," ",null,{"$f":"IF(AC769=\"\",\"\",MAX($AB$3:AB768)+1)","v":""},"","","",{"$f":"IF(AB769=\"\",\"\",#REF!)","v":""},{"$f":"IF(AD769=\"\",\"\",#REF!)","v":""},"","","","","","","","","","","","","","","","","","","","","",""]
[null,null,null,null,null,null,null,null,null,null,null,null,null,null,null,null,null,null,null,"",null,null,null,null,null," ",null,{"$f":"IF(AC770=\"\",\"\",MAX($AB$3:AB769)+1)","v":""},"","","",{"$f":"IF(AB770=\"\",\"\",#REF!)","v":""},{"$f":"IF(AD770=\"\",\"\",#REF!)","v":""},"","","","","","","","","","","","","","","","","","","","","",""]
[null,null,null,null,null,null,null,null,null,null,null,null,null,null,null,null,null,null,null,"",null,null,null,null,null," ",null,{"$f":"IF(AC771=\"\",\"\",MAX($AB$3:AB770)+1)","v":""},"","","",{"$f":"IF(AB771=\"\",\"\",#REF!)","v":""},{"$f":"IF(AD771=\"\",\"\",#REF!)","v":""},"","","","","","","","","","","","","","","","","","","","","",""]
[null,null,null,null,null,null,null,null,null,null,null,null,null,null,null,null,null,null,null,"",null,null,null,null,null," ",null,{"$f":"IF(AC772=\"\",\"\",MAX($AB$3:AB771)+1)","v":""},"","","",{"$f":"IF(AB772=\"\",\"\",#REF!)","v":""},{"$f":"IF(AD772=\"\",\"\",#REF!)","v":""},"","","","","","","","","","","","","","","","","","","","","",""]
[null,null,null,null,null,null,null,null,null,null,null,null,null,null,null,null,null,null,null,"",null,null,null,null,null," ",null,{"$f":"IF(AC773=\"\",\"\",MAX($AB$3:AB772)+1)","v":""},"","","",{"$f":"IF(AB773=\"\",\"\",#REF!)","v":""},{"$f":"IF(AD773=\"\",\"\",#REF!)","v":""},"","","","","","","","","","","","","","","","","","","","","",""]
[null,null,null,null,null,null,null,null,null,null,null,null,null,null,null,null,null,null,null,"",null,null,null,null,null," ",null,{"$f":"IF(AC774=\"\",\"\",MAX($AB$3:AB773)+1)","v":""},"","","",{"$f":"IF(AB774=\"\",\"\",#REF!)","v":""},{"$f":"IF(AD774=\"\",\"\",#REF!)","v":""},"","","","","","","","","","","","","","","","","","","","","",""]
[null,null,null,null,null,null,null,null,null,null,null,null,null,null,null,null,null,null,null,"",null,null,null,null,null," ",null,{"$f":"IF(AC775=\"\",\"\",MAX($AB$3:AB774)+1)","v":""},"","","",{"$f":"IF(AB775=\"\",\"\",#REF!)","v":""},{"$f":"IF(AD775=\"\",\"\",#REF!)","v":""},"","","","","","","","","","","","","","","","","","","","","",""]
[null,null,null,null,null,null,null,null,null,null,null,null,null,null,null,null,null,null,null,"",null,null,null,null,null," ",null,{"$f":"IF(AC776=\"\",\"\",MAX($AB$3:AB775)+1)","v":""},"","","",{"$f":"IF(AB776=\"\",\"\",#REF!)","v":""},{"$f":"IF(AD776=\"\",\"\",#REF!)","v":""},"","","","","","","","","","","","","","","","","","","","","",""]
[null,null,null,null,null,null,null,null,null,null,null,null,null,null,null,null,null,null,null,"",null,null,null,null,null," ",null,{"$f":"IF(AC777=\"\",\"\",MAX($AB$3:AB776)+1)","v":""},"","","",{"$f":"IF(AB777=\"\",\"\",#REF!)","v":""},{"$f":"IF(AD777=\"\",\"\",#REF!)","v":""},"","","","","","","","","","","","","","","","","","","","","",""]
[null,null,null,null,null,null,null,null,null,null,null,null,null,null,null,null,null,null,null,"",null,null,null,null,null," ",null,{"$f":"IF(AC778=\"\",\"\",MAX($AB$3:AB777)+1)","v":""},"","","",{"$f":"IF(AB778=\"\",\"\",#REF!)","v":""},{"$f":"IF(AD778=\"\",\"\",#REF!)","v":""},"","","","","","","","","","","","","","","","","","","","","",""]
[null,null,null,null,null,null,null,null,null,null,null,null,null,null,null,null,null,null,null,"",null,null,null,null,null," ",null,{"$f":"IF(AC779=\"\",\"\",MAX($AB$3:AB778)+1)","v":""},"","","",{"$f":"IF(AB779=\"\",\"\",#REF!)","v":""},{"$f":"IF(AD779=\"\",\"\",#REF!)","v":""},"","","","","","","","","","","","","","","","","","","","","",""]
[null,null,null,null,null,null,null,null,null,null,null,null,null,null,null,null,null,null,null,"",null,null,null,null,null," ",null,{"$f":"IF(AC780=\"\",\"\",MAX($AB$3:AB779)+1)","v":""},"","","",{"$f":"IF(AB780=\"\",\"\",#REF!)","v":""},{"$f":"IF(AD780=\"\",\"\",#REF!)","v":""},"","","","","","","","","","","","","","","","","","","","","",""]
[null,null,null,null,null,null,null,null,null,null,null,null,null,null,null,null,null,null,null,"",null,null,null,null,null," ",null,{"$f":"IF(AC781=\"\",\"\",MAX($AB$3:AB780)+1)","v":""},"","","",{"$f":"IF(AB781=\"\",\"\",#REF!)","v":""},{"$f":"IF(AD781=\"\",\"\",#REF!)","v":""},"","","","","","","","","","","","","","","","","","","","","",""]
[null,null,null,null,null,null,null,null,null,null,null,null,null,null,null,null,null,null,null,"",null,null,null,null,null," ",null,{"$f":"IF(AC782=\"\",\"\",MAX($AB$3:AB781)+1)","v":""},"","","",{"$f":"IF(AB782=\"\",\"\",#REF!)","v":""},{"$f":"IF(AD782=\"\",\"\",#REF!)","v":""},"","","","","","","","","","","","","","","","","","","","","",""]
[null,null,null,null,null,null,null,null,null,null,null,null,null,null,null,null,null,null,null,"",null,null,null,null,null," ",null,{"$f":"IF(AC783=\"\",\"\",MAX($AB$3:AB782)+1)","v":""},"","","",{"$f":"IF(AB783=\"\",\"\",#REF!)","v":""},{"$f":"IF(AD783=\"\",\"\",#REF!)","v":""},"","","","","","","","","","","","","","","","","","","","","",""]
[null,null,null,null,null,null,null,null,null,null,null,null,null,null,null,null,null,null,null,"",null,null,null,null,null," ",null,{"$f":"IF(AC784=\"\",\"\",MAX($AB$3:AB783)+1)","v":""},"","","",{"$f":"IF(AB784=\"\",\"\",#REF!)","v":""},{"$f":"IF(AD784=\"\",\"\",#REF!)","v":""},"","","","","","","","","","","","","","","","","","","","","",""]
[null,null,null,null,null,null,null,null,null,null,null,null,null,null,null,null,null,null,null,"",null,null,null,null,null," ",null,{"$f":"IF(AC785=\"\",\"\",MAX($AB$3:AB784)+1)","v":""},{"$f":"IF(C785=\"\",\"\",IF(B785=$AB$1,C785,\"\"))","v":""},{"$f":"IF(AB785=\"\",\"\",B785)","v":""},{"$f":"IF(AB785=\"\",\"\",E785)","v":""},{"$f":"IF(AB785=\"\",\"\",#REF!)","v":""},{"$f":"IF(AD785=\"\",\"\",#REF!)","v":""},{"$f":"IF(AD785=\"\",\"\",U785)","v":""},{"$f":"IF(AD785=\"\",\"\",V785)","v":""},{"$f":"IF(AD785=\"\",\"\",W785)","v":""},{"$f":"IF(AH785=\"\",\"\",X785)","v":""},{"$f":"IF(AI785=\"\",\"\",Y785)","v":""},{"$f":"IF(AE785=\"\",\"\",D785)","v":""},{"$f":"IF(AE785=\"\",\"\",X785)","v":""},{"$f":"IF(AE785=\"\",\"\",Y785)","v":""},{"$f":"IF(AD785=\"\",\"\",F785)","v":""},{"$f":"IF(AE785=\"\",\"\",G785)","v":""},{"$f":"IF(AD785=\"\",\"\",H785)","v":""},{"$f":"IF(AD785=\"\",\"\",I785)","v":""},{"$f":"IF(AH785=\"\",\"\",J785)","v":""},{"$f":"IF(AI785=\"\",\"\",K785)","v":""},{"$f":"IF(AJ785=\"\",\"\",L785)","v":""},{"$f":"IF(AK785=\"\",\"\",M785)","v":""},{"$f":"IF(AL785=\"\",\"\",N785)","v":""},{"$f":"IF(AM785=\"\",\"\",O785)","v":""},{"$f":"IF(AN785=\"\",\"\",P785)","v":""},{"$f":"IF(AO785=\"\",\"\",Q785)","v":""},{"$f":"IF(AP785=\"\",\"\",R785)","v":""},{"$f":"IF(AQ785=\"\",\"\",S785)","v":""}]
[null,null,null,null,null,null,null,null,null,null,null,null,null,null,null,null,null,null,null,{"$f":"IF(AND(C786=\"\",B786=\"\"),\"\",B786+1095)","v":""},null,null,null,null,null," ",null,{"$f":"IF(AC786=\"\",\"\",MAX($AB$3:AB785)+1)","v":""},"","","",{"$f":"IF(AB786=\"\",\"\",#REF!)","v":""},{"$f":"IF(AD786=\"\",\"\",#REF!)","v":""},"","","","","","","","","","","","","","","","","","","","","",""]
[null,null,null,null,null,null,null,null,null,null,null,null,null,null,null,null,null,null,null,"",null,null,null,null,null," ",null,{"$f":"IF(AC787=\"\",\"\",MAX($AB$3:AB786)+1)","v":""},"","","",{"$f":"IF(AB787=\"\",\"\",#REF!)","v":""},{"$f":"IF(AD787=\"\",\"\",#REF!)","v":""},"","","","","","","","","","","","","","","","","","","","","",""]
[null,null,null,null,null,null,null,null,null,null,null,null,null,null,null,null,null,null,null,"",null,null,null,null,null," ",null,{"$f":"IF(AC788=\"\",\"\",MAX($AB$3:AB787)+1)","v":""},"","","",{"$f":"IF(AB788=\"\",\"\",#REF!)","v":""},{"$f":"IF(AD788=\"\",\"\",#REF!)","v":""},"","","","","","","","","","","","","","","","","","","","","",""]
[null,null,null,null,null,null,null,null,null,null,null,null,null,null,null,null,null,null,null,"",null,null,null,null,null," ",null,{"$f":"IF(AC789=\"\",\"\",MAX($AB$3:AB788)+1)","v":""},"","","",{"$f":"IF(AB789=\"\",\"\",#REF!)","v":""},{"$f":"IF(AD789=\"\",\"\",#REF!)","v":""},"","","","","","","","","","","","","","","","","","","","","",""]
[null,null,null,null,null,null,null,null,null,null,null,null,null,null,null,null,null,null,null,"",null,null,null,null,null," ",null,{"$f":"IF(AC790=\"\",\"\",MAX($AB$3:AB789)+1)","v":""},"","","",{"$f":"IF(AB790=\"\",\"\",#REF!)","v":""},{"$f":"IF(AD790=\"\",\"\",#REF!)","v":""},"","","","","","","","","","","","","","","","","","","","","",""]
[null,null,null,null,null,null,null,null,null,null,null,null,null,null,null,null,null,null,null,"",null,null,null,null,null," ",null,{"$f":"IF(AC791=\"\",\"\",MAX($AB$3:AB790)+1)","v":""},"","","",{"$f":"IF(AB791=\"\",\"\",#REF!)","v":""},{"$f":"IF(AD791=\"\",\"\",#REF!)","v":""},"","","","","","","","","","","","","","","","","","","","","",""]
[null,null,null,null,null,null,null,null,null,null,null,null,null,null,null,null,null,null,null,"",null,null,null,null,null," ",null,{"$f":"IF(AC792=\"\",\"\",MAX($AB$3:AB791)+1)","v":""},"","","",{"$f":"IF(AB792=\"\",\"\",#REF!)","v":""},{"$f":"IF(AD792=\"\",\"\",#REF!)","v":""},"","","","","","","","","","","","","","","","","","","","","",""]
[null,null,null,null,null,null,null,null,null,null,null,null,null,null,null,null,null,null,null,"",null,null,null,null,null," ",null,{"$f":"IF(AC793=\"\",\"\",MAX($AB$3:AB792)+1)","v":""},"","","",{"$f":"IF(AB793=\"\",\"\",#REF!)","v":""},{"$f":"IF(AD793=\"\",\"\",#REF!)","v":""},"","","","","","","","","","","","","","","","","","","","","",""]
[null,null,null,null,null,null,null,null,null,null,null,null,null,null,null,null,null,null,null,"",null,null,null,null,null," ",null,{"$f":"IF(AC794=\"\",\"\",MAX($AB$3:AB793)+1)","v":""},"","","",{"$f":"IF(AB794=\"\",\"\",#REF!)","v":""},{"$f":"IF(AD794=\"\",\"\",#REF!)","v":""},"","","","","","","","","","","","","","","","","","","","","",""]
[null,null,null,null,null,null,null,null,null,null,null,null,null,null,null,null,null,null,null,"",null,null,null,null,null," ",null,{"$f":"IF(AC795=\"\",\"\",MAX($AB$3:AB794)+1)","v":""},"","","",{"$f":"IF(AB795=\"\",\"\",#REF!)","v":""},{"$f":"IF(AD795=\"\",\"\",#REF!)","v":""},"","","","","","","","","","","","","","","","","","","","","",""]
[null,null,null,null,null,null,null,null,null,null,null,null,null,null,null,null,null,null,null,"",null,null,null,null,null," ",null,{"$f":"IF(AC796=\"\",\"\",MAX($AB$3:AB795)+1)","v":""},"","","",{"$f":"IF(AB796=\"\",\"\",#REF!)","v":""},{"$f":"IF(AD796=\"\",\"\",#REF!)","v":""},"","","","","","","","","","","","","","","","","","","","","",""]
[null,null,null,null,null,null,null,null,null,null,null,null,null,null,null,null,null,null,null,"",null,null,null,null,null," ",null,{"$f":"IF(AC797=\"\",\"\",MAX($AB$3:AB796)+1)","v":""},"","","",{"$f":"IF(AB797=\"\",\"\",#REF!)","v":""},{"$f":"IF(AD797=\"\",\"\",#REF!)","v":""},"","","","","","","","","","","","","","","","","","","","","",""]
[null,null,null,null,null,null,null,null,null,null,null,null,null,null,null,null,null,null,null,"",null,null,null,null,null," ",null,{"$f":"IF(AC798=\"\",\"\",MAX($AB$3:AB797)+1)","v":""},"","","",{"$f":"IF(AB798=\"\",\"\",#REF!)","v":""},{"$f":"IF(AD798=\"\",\"\",#REF!)","v":""},"","","","","","","","","","","","","","","","","","","","","",""]
[null,null,null,null,null,null,null,null,null,null,null,null,null,null,null,null,null,null,null,"",null,null,null,null,null," ",null,{"$f":"IF(AC799=\"\",\"\",MAX($AB$3:AB798)+1)","v":""},"","","",{"$f":"IF(AB799=\"\",\"\",#REF!)","v":""},{"$f":"IF(AD799=\"\",\"\",#REF!)","v":""},"","","","","","","","","","","","","","","","","","","","","",""]
[null,null,null,null,null,null,null,null,null,null,null,null,null,null,null,null,null,null,null,"",null,null,null,null,null," ",null,{"$f":"IF(AC800=\"\",\"\",MAX($AB$3:AB799)+1)","v":""},"","","",{"$f":"IF(AB800=\"\",\"\",#REF!)","v":""},{"$f":"IF(AD800=\"\",\"\",#REF!)","v":""},"","","","","","","","","","","","","","","","","","","","","",""]
[null,null,null,null,null,null,null,null,null,null,null,null,null,null,null,null,null,null,null,"",null,null,null,null,null," ",null,{"$f":"IF(AC801=\"\",\"\",MAX($AB$3:AB800)+1)","v":""},"","","",{"$f":"IF(AB801=\"\",\"\",#REF!)","v":""},{"$f":"IF(AD801=\"\",\"\",#REF!)","v":""},"","","","","","","","","","","","","","","","","","","","","",""]
[null,null,null,null,null,null,null,null,null,null,null,null,null,null,null,null,null,null,null,"",null,null,null,null,null," ",null,{"$f":"IF(AC802=\"\",\"\",MAX($AB$3:AB801)+1)","v":""},"","","",{"$f":"IF(AB802=\"\",\"\",#REF!)","v":""},{"$f":"IF(AD802=\"\",\"\",#REF!)","v":""},"","","","","","","","","","","","","","","","","","","","","",""]
[null,null,null,null,null,null,null,null,null,null,null,null,null,null,null,null,null,null,null,"",null,null,null,null,null," ",null,{"$f":"IF(AC803=\"\",\"\",MAX($AB$3:AB802)+1)","v":""},"","","",{"$f":"IF(AB803=\"\",\"\",#REF!)","v":""},{"$f":"IF(AD803=\"\",\"\",#REF!)","v":""},"","","","","","","","","","","","","","","","","","","","","",""]
[null,null,null,null,null,null,null,null,null,null,null,null,null,null,null,null,null,null,null,"",null,null,null,null,null," ",null,{"$f":"IF(AC804=\"\",\"\",MAX($AB$3:AB803)+1)","v":""},"","","",{"$f":"IF(AB804=\"\",\"\",#REF!)","v":""},{"$f":"IF(AD804=\"\",\"\",#REF!)","v":""},"","","","","","","","","","","","","","","","","","","","","",""]
[null,null,null,null,null,null,null,null,null,null,null,null,null,null,null,null,null,null,null,"",null,null,null,null,null," ",null,{"$f":"IF(AC805=\"\",\"\",MAX($AB$3:AB804)+1)","v":""},"","","",{"$f":"IF(AB805=\"\",\"\",#REF!)","v":""},{"$f":"IF(AD805=\"\",\"\",#REF!)","v":""},"","","","","","","","","","","","","","","","","","","","","",""]
[null,null,null,null,null,null,null,null,null,null,null,null,null,null,null,null,null,null,null,"",null,null,null,null,null," ",null,{"$f":"IF(AC806=\"\",\"\",MAX($AB$3:AB805)+1)","v":""},"","","",{"$f":"IF(AB806=\"\",\"\",#REF!)","v":""},{"$f":"IF(AD806=\"\",\"\",#REF!)","v":""},"","","","","","","","","","","","","","","","","","","","","",""]
[null,null,null,null,null,null,null,null,null,null,null,null,null,null,null,null,null,null,null,"",null,null,null,null,null," ",null,{"$f":"IF(AC807=\"\",\"\",MAX($AB$3:AB806)+1)","v":""},"","","",{"$f":"IF(AB807=\"\",\"\",#REF!)","v":""},{"$f":"IF(AD807=\"\",\"\",#REF!)","v":""},"","","","","","","","","","","","","","","","","","","","","",""]
[null,null,null,null,null,null,null,null,null,null,null,null,null,null,null,null,null,null,null,"",null,null,null,null,null," ",null,{"$f":"IF(AC808=\"\",\"\",MAX($AB$3:AB807)+1)","v":""},"","","",{"$f":"IF(AB808=\"\",\"\",#REF!)","v":""},{"$f":"IF(AD808=\"\",\"\",#REF!)","v":""},"","","","","","","","","","","","","","","","","","","","","",""]
[null,null,null,null,null,null,null,null,null,null,null,null,null,null,null,null,null,null,null,"",null,null,null,null,null," ",null,{"$f":"IF(AC809=\"\",\"\",MAX($AB$3:AB808)+1)","v":""},"","","",{"$f":"IF(AB809=\"\",\"\",#REF!)","v":""},{"$f":"IF(AD809=\"\",\"\",#REF!)","v":""},"","","","","","","","","","","","","","","","","","","","","",""]
[null,null,null,null,null,null,null,null,null,null,null,null,null,null,null,null,null,null,null,"",null,null,null,null,null," ",null,{"$f":"IF(AC810=\"\",\"\",MAX($AB$3:AB809)+1)","v":""},"","","",{"$f":"IF(AB810=\"\",\"\",#REF!)","v":""},{"$f":"IF(AD810=\"\",\"\",#REF!)","v":""},"","","","","","","","","","","","","","","","","","","","","",""]
[null,null,null,null,null,null,null,null,null,null,null,null,null,null,null,null,null,null,null,"",null,null,null,null,null," ",null,{"$f":"IF(AC811=\"\",\"\",MAX($AB$3:AB810)+1)","v":""},"","","",{"$f":"IF(AB811=\"\",\"\",#REF!)","v":""},{"$f":"IF(AD811=\"\",\"\",#REF!)","v":""},"","","","","","","","","","","","","","","","","","","","","",""]
[null,null,null,null,null,null,null,null,null,null,null,null,null,null,null,null,null,null,null,"",null,null,null,null,null," ",null,{"$f":"IF(AC812=\"\",\"\",MAX($AB$3:AB811)+1)","v":""},"","","",{"$f":"IF(AB812=\"\",\"\",#REF!)","v":""},{"$f":"IF(AD812=\"\",\"\",#REF!)","v":""},"","","","","","","","","","","","","","","","","","","","","",""]
[null,null,null,null,null,null,null,null,null,null,null,null,null,null,null,null,null,null,null,"",null,null,null,null,null," ",null,{"$f":"IF(AC813=\"\",\"\",MAX($AB$3:AB812)+1)","v":""},"","","",{"$f":"IF(AB813=\"\",\"\",#REF!)","v":""},{"$f":"IF(AD813=\"\",\"\",#REF!)","v":""},"","","","","","","","","","","","","","","","","","","","","",""]
[null,null,null,null,null,null,null,null,null,null,null,null,null,null,null,null,null,null,null,"",null,null,null,null,null," ",null,{"$f":"IF(AC814=\"\",\"\",MAX($AB$3:AB813)+1)","v":""},"","","",{"$f":"IF(AB814=\"\",\"\",#REF!)","v":""},{"$f":"IF(AD814=\"\",\"\",#REF!)","v":""},"","","","","","","","","","","","","","","","","","","","","",""]
[null,null,null,null,null,null,null,null,null,null,null,null,null,null,null,null,null,null,null,"",null,null,null,null,null," ",null,{"$f":"IF(AC815=\"\",\"\",MAX($AB$3:AB814)+1)","v":""},"","","",{"$f":"IF(AB815=\"\",\"\",#REF!)","v":""},{"$f":"IF(AD815=\"\",\"\",#REF!)","v":""},"","","","","","","","","","","","","","","","","","","","","",""]
[null,null,null,null,null,null,null,null,null,null,null,null,null,null,null,null,null,null,null,"",null,null,null,null,null," ",null,{"$f":"IF(AC816=\"\",\"\",MAX($AB$3:AB815)+1)","v":""},"","","",{"$f":"IF(AB816=\"\",\"\",#REF!)","v":""},{"$f":"IF(AD816=\"\",\"\",#REF!)","v":""},"","","","","","","","","","","","","","","","","","","","","",""]
[null,null,null,null,null,null,null,null,null,null,null,null,null,null,null,null,null,null,null,"",null,null,null,null,null," ",null,{"$f":"IF(AC817=\"\",\"\",MAX($AB$3:AB816)+1)","v":""},"","","",{"$f":"IF(AB817=\"\",\"\",#REF!)","v":""},{"$f":"IF(AD817=\"\",\"\",#REF!)","v":""},"","","","","","","","","","","","","","","","","","","","","",""]
[null,null,null,null,null,null,null,null,null,null,null,null,null,null,null,null,null,null,null,"",null,null,null,null,null," ",null,{"$f":"IF(AC818=\"\",\"\",MAX($AB$3:AB817)+1)","v":""},"","","",{"$f":"IF(AB818=\"\",\"\",#REF!)","v":""},{"$f":"IF(AD818=\"\",\"\",#REF!)","v":""},"","","","","","","","","","","","","","","","","","","","","",""]
[null,null,null,null,null,null,null,null,null,null,null,null,null,null,null,null,null,null,null,"",null,null,null,null,null," ",null,{"$f":"IF(AC819=\"\",\"\",MAX($AB$3:AB818)+1)","v":""},"","","",{"$f":"IF(AB819=\"\",\"\",#REF!)","v":""},{"$f":"IF(AD819=\"\",\"\",#REF!)","v":""},"","","","","","","","","","","","","","","","","","","","","",""]
[null,null,null,null,null,null,null,null,null,null,null,null,null,null,null,null,null,null,null,"",null,null,null,null,null," ",null,{"$f":"IF(AC820=\"\",\"\",MAX($AB$3:AB819)+1)","v":""},"","","",{"$f":"IF(AB820=\"\",\"\",#REF!)","v":""},{"$f":"IF(AD820=\"\",\"\",#REF!)","v":""},"","","","","","","","","","","","","","","","","","","","","",""]
[null,null,null,null,null,null,null,null,null,null,null,null,null,null,null,null,null,null,null,"",null,null,null,null,null," ",null,{"$f":"IF(AC821=\"\",\"\",MAX($AB$3:AB820)+1)","v":""},"","","",{"$f":"IF(AB821=\"\",\"\",#REF!)","v":""},{"$f":"IF(AD821=\"\",\"\",#REF!)","v":""},"","","","","","","","","","","","","","","","","","","","","",""]
[null,null,null,null,null,null,null,null,null,null,null,null,null,null,null,null,null,null,null,"",null,null,null,null,null," ",null,{"$f":"IF(AC822=\"\",\"\",MAX($AB$3:AB821)+1)","v":""},"","","",{"$f":"IF(AB822=\"\",\"\",#REF!)","v":""},{"$f":"IF(AD822=\"\",\"\",#REF!)","v":""},"","","","","","","","","","","","","","","","","","","","","",""]
[null,null,null,null,null,null,null,null,null,null,null,null,null,null,null,null,null,null,null,"",null,null,null,null,null," ",null,{"$f":"IF(AC823=\"\",\"\",MAX($AB$3:AB822)+1)","v":""},"","","",{"$f":"IF(AB823=\"\",\"\",#REF!)","v":""},{"$f":"IF(AD823=\"\",\"\",#REF!)","v":""},"","","","","","","","","","","","","","","","","","","","","",""]
[null,null,null,null,null,null,null,null,null,null,null,null,null,null,null,null,null,null,null,"",null,null,null,null,null," ",null,{"$f":"IF(AC824=\"\",\"\",MAX($AB$3:AB823)+1)","v":""},"","","",{"$f":"IF(AB824=\"\",\"\",#REF!)","v":""},{"$f":"IF(AD824=\"\",\"\",#REF!)","v":""},"","","","","","","","","","","","","","","","","","","","","",""]
[null,null,null,null,null,null,null,null,null,null,null,null,null,null,null,null,null,null,null,"",null,null,null,null,null," ",null,{"$f":"IF(AC825=\"\",\"\",MAX($AB$3:AB824)+1)","v":""},"","","",{"$f":"IF(AB825=\"\",\"\",#REF!)","v":""},{"$f":"IF(AD825=\"\",\"\",#REF!)","v":""},"","","","","","","","","","","","","","","","","","","","","",""]
[null,null,null,null,null,null,null,null,null,null,null,null,null,null,null,null,null,null,null,"",null,null,null,null,null," ",null,{"$f":"IF(AC826=\"\",\"\",MAX($AB$3:AB825)+1)","v":""},"","","",{"$f":"IF(AB826=\"\",\"\",#REF!)","v":""},{"$f":"IF(AD826=\"\",\"\",#REF!)","v":""},"","","","","","","","","","","","","","","","","","","","","",""]
[null,null,null,null,null,null,null,null,null,null,null,null,null,null,null,null,null,null,null,"",null,null,null,null,null," ",null,{"$f":"IF(AC827=\"\",\"\",MAX($AB$3:AB826)+1)","v":""},"","","",{"$f":"IF(AB827=\"\",\"\",#REF!)","v":""},{"$f":"IF(AD827=\"\",\"\",#REF!)","v":""},"","","","","","","","","","","","","","","","","","","","","",""]
[null,null,null,null,null,null,null,null,null,null,null,null,null,null,null,null,null,null,null,"",null,null,null,null,null," ",null,{"$f":"IF(AC828=\"\",\"\",MAX($AB$3:AB827)+1)","v":""},"","","",{"$f":"IF(AB828=\"\",\"\",#REF!)","v":""},{"$f":"IF(AD828=\"\",\"\",#REF!)","v":""},"","","","","","","","","","","","","","","","","","","","","",""]
[null,null,null,null,null,null,null,null,null,null,null,null,null,null,null,null,null,null,null,"",null,null,null,null,null," ",null,{"$f":"IF(AC829=\"\",\"\",MAX($AB$3:AB828)+1)","v":""},"","","",{"$f":"IF(AB829=\"\",\"\",#REF!)","v":""},{"$f":"IF(AD829=\"\",\"\",#REF!)","v":""},"","","","","","","","","","","","","","","","","","","","","",""]
[null,null,null,null,null,null,null,null,null,null,null,null,null,null,null,null,null,null,null,"",null,null,null,null,null," ",null,{"$f":"IF(AC830=\"\",\"\",MAX($AB$3:AB829)+1)","v":""},"","","",{"$f":"IF(AB830=\"\",\"\",#REF!)","v":""},{"$f":"IF(AD830=\"\",\"\",#REF!)","v":""},"","","","","","","","","","","","","","","","","","","","","",""]
[null,null,null,null,null,null,null,null,null,null,null,null,null,null,null,null,null,null,null,"",null,null,null,null,null," ",null,{"$f":"IF(AC831=\"\",\"\",MAX($AB$3:AB830)+1)","v":""},"","","",{"$f":"IF(AB831=\"\",\"\",#REF!)","v":""},{"$f":"IF(AD831=\"\",\"\",#REF!)","v":""},"","","","","","","","","","","","","","","","","","","","","",""]
[null,null,null,null,null,null,null,null,null,null,null,null,null,null,null,null,null,null,null,"",null,null,null,null,null," ",null,{"$f":"IF(AC832=\"\",\"\",MAX($AB$3:AB831)+1)","v":""},"","","",{"$f":"IF(AB832=\"\",\"\",#REF!)","v":""},{"$f":"IF(AD832=\"\",\"\",#REF!)","v":""},"","","","","","","","","","","","","","","","","","","","","",""]
[null,null,null,null,null,null,null,null,null,null,null,null,null,null,null,null,null,null,null,"",null,null,null,null,null," ",null,{"$f":"IF(AC833=\"\",\"\",MAX($AB$3:AB832)+1)","v":""},"","","",{"$f":"IF(AB833=\"\",\"\",#REF!)","v":""},{"$f":"IF(AD833=\"\",\"\",#REF!)","v":""},"","","","","","","","","","","","","","","","","","","","","",""]
[null,null,null,null,null,null,null,null,null,null,null,null,null,null,null,null,null,null,null,"",null,null,null,null,null," ",null,{"$f":"IF(AC834=\"\",\"\",MAX($AB$3:AB833)+1)","v":""},"","","",{"$f":"IF(AB834=\"\",\"\",#REF!)","v":""},{"$f":"IF(AD834=\"\",\"\",#REF!)","v":""},"","","","","","","","","","","","","","","","","","","","","",""]
[null,null,null,null,null,null,null,null,null,null,null,null,null,null,null,null,null,null,null,"",null,null,null,null,null," ",null,{"$f":"IF(AC835=\"\",\"\",MAX($AB$3:AB834)+1)","v":""},"","","",{"$f":"IF(AB835=\"\",\"\",#REF!)","v":""},{"$f":"IF(AD835=\"\",\"\",#REF!)","v":""},"","","","","","","","","","","","","","","","","","","","","",""]
[null,null,null,null,null,null,null,null,null,null,null,null,null,null,null,null,null,null,null,"",null,null,null,null,null," ",null,{"$f":"IF(AC836=\"\",\"\",MAX($AB$3:AB835)+1)","v":""},"","","",{"$f":"IF(AB836=\"\",\"\",#REF!)","v":""},{"$f":"IF(AD836=\"\",\"\",#REF!)","v":""},"","","","","","","","","","","","","","","","","","","","","",""]
[null,null,null,null,null,null,null,null,null,null,null,null,null,null,null,null,null,null,null,"",null,null,null,null,null," ",null,{"$f":"IF(AC837=\"\",\"\",MAX($AB$3:AB836)+1)","v":""},"","","",{"$f":"IF(AB837=\"\",\"\",#REF!)","v":""},{"$f":"IF(AD837=\"\",\"\",#REF!)","v":""},"","","","","","","","","","","","","","","","","","","","","",""]
[null,null,null,null,null,null,null,null,null,null,null,null,null,null,null,null,null,null,null,"",null,null,null,null,null," ",null,{"$f":"IF(AC838=\"\",\"\",MAX($AB$3:AB837)+1)","v":""},"","","",{"$f":"IF(AB838=\"\",\"\",#REF!)","v":""},{"$f":"IF(AD838=\"\",\"\",#REF!)","v":""},"","","","","","","","","","","","","","","","","","","","","",""]
[null,null,null,null,null,null,null,null,null,null,null,null,null,null,null,null,null,null,null,"",null,null,null,null,null," ",null,{"$f":"IF(AC839=\"\",\"\",MAX($AB$3:AB838)+1)","v":""},"","","",{"$f":"IF(AB839=\"\",\"\",#REF!)","v":""},{"$f":"IF(AD839=\"\",\"\",#REF!)","v":""},"","","","","","","","","","","","","","","","","","","","","",""]
[null,null,null,null,null,null,null,null,null,null,null,null,null,null,null,null,null,null,null,"",null,null,null,null,null," ",null,{"$f":"IF(AC840=\"\",\"\",MAX($AB$3:AB839)+1)","v":""},"","","",{"$f":"IF(AB840=\"\",\"\",#REF!)","v":""},{"$f":"IF(AD840=\"\",\"\",#REF!)","v":""},"","","","","","","","","","","","","","","","","","","","","",""]
[null,null,null,null,null,null,null,null,null,null,null,null,null,null,null,null,null,null,null,"",null,null,null,null,null," ",null,{"$f":"IF(AC841=\"\",\"\",MAX($AB$3:AB840)+1)","v":""},"","","",{"$f":"IF(AB841=\"\",\"\",#REF!)","v":""},{"$f":"IF(AD841=\"\",\"\",#REF!)","v":""},"","","","","","","","","","","","","","","","","","","","","",""]
[null,null,null,null,null,null,null,null,null,null,null,null,null,null,null,null,null,null,null,"",null,null,null,null,null," ",null,{"$f":"IF(AC842=\"\",\"\",MAX($AB$3:AB841)+1)","v":""},"","","",{"$f":"IF(AB842=\"\",\"\",#REF!)","v":""},{"$f":"IF(AD842=\"\",\"\",#REF!)","v":""},"","","","","","","","","","","","","","","","","","","","","",""]
[null,null,null,null,null,null,null,null,null,null,null,null,null,null,null,null,null,null,null,"",null,null,null,null,null," ",null,{"$f":"IF(AC843=\"\",\"\",MAX($AB$3:AB842)+1)","v":""},"","","",{"$f":"IF(AB843=\"\",\"\",#REF!)","v":""},{"$f":"IF(AD843=\"\",\"\",#REF!)","v":""},"","","","","","","","","","","","","","","","","","","","","",""]
[null,null,null,null,null,null,null,null,null,null,null,null,null,null,null,null,null,null,null,"",null,null,null,null,null," ",null,{"$f":"IF(AC844=\"\",\"\",MAX($AB$3:AB843)+1)","v":""},"","","",{"$f":"IF(AB844=\"\",\"\",#REF!)","v":""},{"$f":"IF(AD844=\"\",\"\",#REF!)","v":""},"","","","","","","","","","","","","","","","","","","","","",""]
[null,null,null,null,null,null,null,null,null,null,null,null,null,null,null,null,null,null,null,"",null,null,null,null,null," ",null,{"$f":"IF(AC845=\"\",\"\",MAX($AB$3:AB844)+1)","v":""},"","","",{"$f":"IF(AB845=\"\",\"\",#REF!)","v":""},{"$f":"IF(AD845=\"\",\"\",#REF!)","v":""},"","","","","","","","","","","","","","","","","","","","","",""]
[null,null,null,null,null,null,null,null,null,null,null,null,null,null,null,null,null,null,null,"",null,null,null,null,null," ",null,{"$f":"IF(AC846=\"\",\"\",MAX($AB$3:AB845)+1)","v":""},"","","",{"$f":"IF(AB846=\"\",\"\",#REF!)","v":""},{"$f":"IF(AD846=\"\",\"\",#REF!)","v":""},"","","","","","","","","","","","","","","","","","","","","",""]
[null,null,null,null,null,null,null,null,null,null,null,null,null,null,null,null,null,null,null,"",null,null,null,null,null," ",null,{"$f":"IF(AC847=\"\",\"\",MAX($AB$3:AB846)+1)","v":""},"","","",{"$f":"IF(AB847=\"\",\"\",#REF!)","v":""},{"$f":"IF(AD847=\"\",\"\",#REF!)","v":""},"","","","","","","","","","","","","","","","","","","","","",""]
[null,null,null,null,null,null,null,null,null,null,null,null,null,null,null,null,null,null,null,"",null,null,null,null,null," ",null,{"$f":"IF(AC848=\"\",\"\",MAX($AB$3:AB847)+1)","v":""},"","","",{"$f":"IF(AB848=\"\",\"\",#REF!)","v":""},{"$f":"IF(AD848=\"\",\"\",#REF!)","v":""},"","","","","","","","","","","","","","","","","","","","","",""]
[null,null,null,null,null,null,null,null,null,null,null,null,null,null,null,null,null,null,null,"",null,null,null,null,null," ",null,{"$f":"IF(AC849=\"\",\"\",MAX($AB$3:AB848)+1)","v":""},{"$f":"IF(C849=\"\",\"\",IF(B849=$AB$1,C849,\"\"))","v":""},{"$f":"IF(AB849=\"\",\"\",B849)","v":""},{"$f":"IF(AB849=\"\",\"\",E849)","v":""},{"$f":"IF(AB849=\"\",\"\",#REF!)","v":""},{"$f":"IF(AD849=\"\",\"\",#REF!)","v":""},{"$f":"IF(AD849=\"\",\"\",U849)","v":""},{"$f":"IF(AD849=\"\",\"\",V849)","v":""},{"$f":"IF(AD849=\"\",\"\",W849)","v":""},{"$f":"IF(AH849=\"\",\"\",X849)","v":""},{"$f":"IF(AI849=\"\",\"\",Y849)","v":""},{"$f":"IF(AE849=\"\",\"\",D849)","v":""},{"$f":"IF(AE849=\"\",\"\",X849)","v":""},{"$f":"IF(AE849=\"\",\"\",Y849)","v":""},{"$f":"IF(AD849=\"\",\"\",F849)","v":""},{"$f":"IF(AE849=\"\",\"\",G849)","v":""},{"$f":"IF(AD849=\"\",\"\",H849)","v":""},{"$f":"IF(AD849=\"\",\"\",I849)","v":""},{"$f":"IF(AH849=\"\",\"\",J849)","v":""},{"$f":"IF(AI849=\"\",\"\",K849)","v":""},{"$f":"IF(AJ849=\"\",\"\",L849)","v":""},{"$f":"IF(AK849=\"\",\"\",M849)","v":""},{"$f":"IF(AL849=\"\",\"\",N849)","v":""},{"$f":"IF(AM849=\"\",\"\",O849)","v":""},{"$f":"IF(AN849=\"\",\"\",P849)","v":""},{"$f":"IF(AO849=\"\",\"\",Q849)","v":""},{"$f":"IF(AP849=\"\",\"\",R849)","v":""},{"$f":"IF(AQ849=\"\",\"\",S849)","v":""}]
[null,null,null,null,null,null,null,null,null,null,null,null,null,null,null,null,null,null,null,{"$f":"IF(AND(C850=\"\",B850=\"\"),\"\",B850+1095)","v":""},null,null,null,null,null," ",null,{"$f":"IF(AC850=\"\",\"\",MAX($AB$3:AB849)+1)","v":""},"","","",{"$f":"IF(AB850=\"\",\"\",#REF!)","v":""},{"$f":"IF(AD850=\"\",\"\",#REF!)","v":""},"","","","","","","","","","","","","","","","","","","","","",""]
[null,null,null,null,null,null,null,null,null,null,null,null,null,null,null,null,null,null,null,"",null,null,null,null,null," ",null,{"$f":"IF(AC851=\"\",\"\",MAX($AB$3:AB850)+1)","v":""},"","","",{"$f":"IF(AB851=\"\",\"\",#REF!)","v":""},{"$f":"IF(AD851=\"\",\"\",#REF!)","v":""},"","","","","","","","","","","","","","","","","","","","","",""]
[null,null,null,null,null,null,null,null,null,null,null,null,null,null,null,null,null,null,null,"",null,null,null,null,null," ",null,{"$f":"IF(AC852=\"\",\"\",MAX($AB$3:AB851)+1)","v":""},"","","",{"$f":"IF(AB852=\"\",\"\",#REF!)","v":""},{"$f":"IF(AD852=\"\",\"\",#REF!)","v":""},"","","","","","","","","","","","","","","","","","","","","",""]
[null,null,null,null,null,null,null,null,null,null,null,null,null,null,null,null,null,null,null,"",null,null,null,null,null," ",null,{"$f":"IF(AC853=\"\",\"\",MAX($AB$3:AB852)+1)","v":""},"","","",{"$f":"IF(AB853=\"\",\"\",#REF!)","v":""},{"$f":"IF(AD853=\"\",\"\",#REF!)","v":""},"","","","","","","","","","","","","","","","","","","","","",""]
[null,null,null,null,null,null,null,null,null,null,null,null,null,null,null,null,null,null,null,"",null,null,null,null,null," ",null,{"$f":"IF(AC854=\"\",\"\",MAX($AB$3:AB853)+1)","v":""},"","","",{"$f":"IF(AB854=\"\",\"\",#REF!)","v":""},{"$f":"IF(AD854=\"\",\"\",#REF!)","v":""},"","","","","","","","","","","","","","","","","","","","","",""]
[null,null,null,null,null,null,null,null,null,null,null,null,null,null,null,null,null,null,null,"",null,null,null,null,null," ",null,{"$f":"IF(AC855=\"\",\"\",MAX($AB$3:AB854)+1)","v":""},"","","",{"$f":"IF(AB855=\"\",\"\",#REF!)","v":""},{"$f":"IF(AD855=\"\",\"\",#REF!)","v":""},"","","","","","","","","","","","","","","","","","","","","",""]
[null,null,null,null,null,null,null,null,null,null,null,null,null,null,null,null,null,null,null,"",null,null,null,null,null," ",null,{"$f":"IF(AC856=\"\",\"\",MAX($AB$3:AB855)+1)","v":""},"","","",{"$f":"IF(AB856=\"\",\"\",#REF!)","v":""},{"$f":"IF(AD856=\"\",\"\",#REF!)","v":""},"","","","","","","","","","","","","","","","","","","","","",""]
[null,null,null,null,null,null,null,null,null,null,null,null,null,null,null,null,null,null,null,"",null,null,null,null,null," ",null,{"$f":"IF(AC857=\"\",\"\",MAX($AB$3:AB856)+1)","v":""},"","","",{"$f":"IF(AB857=\"\",\"\",#REF!)","v":""},{"$f":"IF(AD857=\"\",\"\",#REF!)","v":""},"","","","","","","","","","","","","","","","","","","","","",""]
[null,null,null,null,null,null,null,null,null,null,null,null,null,null,null,null,null,null,null,"",null,null,null,null,null," ",null,{"$f":"IF(AC858=\"\",\"\",MAX($AB$3:AB857)+1)","v":""},"","","",{"$f":"IF(AB858=\"\",\"\",#REF!)","v":""},{"$f":"IF(AD858=\"\",\"\",#REF!)","v":""},"","","","","","","","","","","","","","","","","","","","","",""]
[null,null,null,null,null,null,null,null,null,null,null,null,null,null,null,null,null,null,null,"",null,null,null,null,null," ",null,{"$f":"IF(AC859=\"\",\"\",MAX($AB$3:AB858)+1)","v":""},"","","",{"$f":"IF(AB859=\"\",\"\",#REF!)","v":""},{"$f":"IF(AD859=\"\",\"\",#REF!)","v":""},"","","","","","","","","","","","","","","","","","","","","",""]
[null,null,null,null,null,null,null,null,null,null,null,null,null,null,null,null,null,null,null,"",null,null,null,null,null," ",null,{"$f":"IF(AC860=\"\",\"\",MAX($AB$3:AB859)+1)","v":""},"","","",{"$f":"IF(AB860=\"\",\"\",#REF!)","v":""},{"$f":"IF(AD860=\"\",\"\",#REF!)","v":""},"","","","","","","","","","","","","","","","","","","","","",""]
[null,null,null,null,null,null,null,null,null,null,null,null,null,null,null,null,null,null,null,"",null,null,null,null,null," ",null,{"$f":"IF(AC861=\"\",\"\",MAX($AB$3:AB860)+1)","v":""},"","","",{"$f":"IF(AB861=\"\",\"\",#REF!)","v":""},{"$f":"IF(AD861=\"\",\"\",#REF!)","v":""},"","","","","","","","","","","","","","","","","","","","","",""]
[null,null,null,null,null,null,null,null,null,null,null,null,null,null,null,null,null,null,null,"",null,null,null,null,null," ",null,{"$f":"IF(AC862=\"\",\"\",MAX($AB$3:AB861)+1)","v":""},"","","",{"$f":"IF(AB862=\"\",\"\",#REF!)","v":""},{"$f":"IF(AD862=\"\",\"\",#REF!)","v":""},"","","","","","","","","","","","","","","","","","","","","",""]
[null,null,null,null,null,null,null,null,null,null,null,null,null,null,null,null,null,null,null,"",null,null,null,null,null," ",null,{"$f":"IF(AC863=\"\",\"\",MAX($AB$3:AB862)+1)","v":""},"","","",{"$f":"IF(AB863=\"\",\"\",#REF!)","v":""},{"$f":"IF(AD863=\"\",\"\",#REF!)","v":""},"","","","","","","","","","","","","","","","","","","","","",""]
[null,null,null,null,null,null,null,null,null,null,null,null,null,null,null,null,null,null,null,"",null,null,null,null,null," ",null,{"$f":"IF(AC864=\"\",\"\",MAX($AB$3:AB863)+1)","v":""},"","","",{"$f":"IF(AB864=\"\",\"\",#REF!)","v":""},{"$f":"IF(AD864=\"\",\"\",#REF!)","v":""},"","","","","","","","","","","","","","","","","","","","","",""]
[null,null,null,null,null,null,null,null,null,null,null,null,null,null,null,null,null,null,null,"",null,null,null,null,null," ",null,{"$f":"IF(AC865=\"\",\"\",MAX($AB$3:AB864)+1)","v":""},"","","",{"$f":"IF(AB865=\"\",\"\",#REF!)","v":""},{"$f":"IF(AD865=\"\",\"\",#REF!)","v":""},"","","","","","","","","","","","","","","","","","","","","",""]
[null,null,null,null,null,null,null,null,null,null,null,null,null,null,null,null,null,null,null,"",null,null,null,null,null," ",null,{"$f":"IF(AC866=\"\",\"\",MAX($AB$3:AB865)+1)","v":""},"","","",{"$f":"IF(AB866=\"\",\"\",#REF!)","v":""},{"$f":"IF(AD866=\"\",\"\",#REF!)","v":""},"","","","","","","","","","","","","","","","","","","","","",""]
[null,null,null,null,null,null,null,null,null,null,null,null,null,null,null,null,null,null,null,"",null,null,null,null,null," ",null,{"$f":"IF(AC867=\"\",\"\",MAX($AB$3:AB866)+1)","v":""},"","","",{"$f":"IF(AB867=\"\",\"\",#REF!)","v":""},{"$f":"IF(AD867=\"\",\"\",#REF!)","v":""},"","","","","","","","","","","","","","","","","","","","","",""]
[null,null,null,null,null,null,null,null,null,null,null,null,null,null,null,null,null,null,null,"",null,null,null,null,null," ",null,{"$f":"IF(AC868=\"\",\"\",MAX($AB$3:AB867)+1)","v":""},"","","",{"$f":"IF(AB868=\"\",\"\",#REF!)","v":""},{"$f":"IF(AD868=\"\",\"\",#REF!)","v":""},"","","","","","","","","","","","","","","","","","","","","",""]
[null,null,null,null,null,null,null,null,null,null,null,null,null,null,null,null,null,null,null,"",null,null,null,null,null," ",null,{"$f":"IF(AC869=\"\",\"\",MAX($AB$3:AB868)+1)","v":""},"","","",{"$f":"IF(AB869=\"\",\"\",#REF!)","v":""},{"$f":"IF(AD869=\"\",\"\",#REF!)","v":""},"","","","","","","","","","","","","","","","","","","","","",""]
[null,null,null,null,null,null,null,null,null,null,null,null,null,null,null,null,null,null,null,"",null,null,null,null,null," ",null,{"$f":"IF(AC870=\"\",\"\",MAX($AB$3:AB869)+1)","v":""},"","","",{"$f":"IF(AB870=\"\",\"\",#REF!)","v":""},{"$f":"IF(AD870=\"\",\"\",#REF!)","v":""},"","","","","","","","","","","","","","","","","","","","","",""]
[null,null,null,null,null,null,null,null,null,null,null,null,null,null,null,null,null,null,null,"",null,null,null,null,null," ",null,{"$f":"IF(AC871=\"\",\"\",MAX($AB$3:AB870)+1)","v":""},"","","",{"$f":"IF(AB871=\"\",\"\",#REF!)","v":""},{"$f":"IF(AD871=\"\",\"\",#REF!)","v":""},"","","","","","","","","","","","","","","","","","","","","",""]
[null,null,null,null,null,null,null,null,null,null,null,null,null,null,null,null,null,null,null,"",null,null,null,null,null," ",null,{"$f":"IF(AC872=\"\",\"\",MAX($AB$3:AB871)+1)","v":""},"","","",{"$f":"IF(AB872=\"\",\"\",#REF!)","v":""},{"$f":"IF(AD872=\"\",\"\",#REF!)","v":""},"","","","","","","","","","","","","","","","","","","","","",""]
[null,null,null,null,null,null,null,null,null,null,null,null,null,null,null,null,null,null,null,"",null,null,null,null,null," ",null,{"$f":"IF(AC873=\"\",\"\",MAX($AB$3:AB872)+1)","v":""},"","","",{"$f":"IF(AB873=\"\",\"\",#REF!)","v":""},{"$f":"IF(AD873=\"\",\"\",#REF!)","v":""},"","","","","","","","","","","","","","","","","","","","","",""]
[null,null,null,null,null,null,null,null,null,null,null,null,null,null,null,null,null,null,null,"",null,null,null,null,null," ",null,{"$f":"IF(AC874=\"\",\"\",MAX($AB$3:AB873)+1)","v":""},"","","",{"$f":"IF(AB874=\"\",\"\",#REF!)","v":""},{"$f":"IF(AD874=\"\",\"\",#REF!)","v":""},"","","","","","","","","","","","","","","","","","","","","",""]
[null,null,null,null,null,null,null,null,null,null,null,null,null,null,null,null,null,null,null,"",null,null,null,null,null," ",null,{"$f":"IF(AC875=\"\",\"\",MAX($AB$3:AB874)+1)","v":""},"","","",{"$f":"IF(AB875=\"\",\"\",#REF!)","v":""},{"$f":"IF(AD875=\"\",\"\",#REF!)","v":""},"","","","","","","","","","","","","","","","","","","","","",""]
[null,null,null,null,null,null,null,null,null,null,null,null,null,null,null,null,null,null,null,"",null,null,null,null,null," ",null,{"$f":"IF(AC876=\"\",\"\",MAX($AB$3:AB875)+1)","v":""},"","","",{"$f":"IF(AB876=\"\",\"\",#REF!)","v":""},{"$f":"IF(AD876=\"\",\"\",#REF!)","v":""},"","","","","","","","","","","","","","","","","","","","","",""]
[null,null,null,null,null,null,null,null,null,null,null,null,null,null,null,null,null,null,null,"",null,null,null,null,null," ",null,{"$f":"IF(AC877=\"\",\"\",MAX($AB$3:AB876)+1)","v":""},"","","",{"$f":"IF(AB877=\"\",\"\",#REF!)","v":""},{"$f":"IF(AD877=\"\",\"\",#REF!)","v":""},"","","","","","","","","","","","","","","","","","","","","",""]
[null,null,null,null,null,null,null,null,null,null,null,null,null,null,null,null,null,null,null,"",null,null,null,null,null," ",null,{"$f":"IF(AC878=\"\",\"\",MAX($AB$3:AB877)+1)","v":""},"","","",{"$f":"IF(AB878=\"\",\"\",#REF!)","v":""},{"$f":"IF(AD878=\"\",\"\",#REF!)","v":""},"","","","","","","","","","","","","","","","","","","","","",""]
[null,null,null,null,null,null,null,null,null,null,null,null,null,null,null,null,null,null,null,"",null,null,null,null,null," ",null,{"$f":"IF(AC879=\"\",\"\",MAX($AB$3:AB878)+1)","v":""},"","","",{"$f":"IF(AB879=\"\",\"\",#REF!)","v":""},{"$f":"IF(AD879=\"\",\"\",#REF!)","v":""},"","","","","","","","","","","","","","","","","","","","","",""]
[null,null,null,null,null,null,null,null,null,null,null,null,null,null,null,null,null,null,null,"",null,null,null,null,null," ",null,{"$f":"IF(AC880=\"\",\"\",MAX($AB$3:AB879)+1)","v":""},"","","",{"$f":"IF(AB880=\"\",\"\",#REF!)","v":""},{"$f":"IF(AD880=\"\",\"\",#REF!)","v":""},"","","","","","","","","","","","","","","","","","","","","",""]
[null,null,null,null,null,null,null,null,null,null,null,null,null,null,null,null,null,null,null,"",null,null,null,null,null," ",null,{"$f":"IF(AC881=\"\",\"\",MAX($AB$3:AB880)+1)","v":""},"","","",{"$f":"IF(AB881=\"\",\"\",#REF!)","v":""},{"$f":"IF(AD881=\"\",\"\",#REF!)","v":""},"","","","","","","","","","","","","","","","","","","","","",""]
[null,null,null,null,null,null,null,null,null,null,null,null,null,null,null,null,null,null,null,"",null,null,null,null,null," ",null,{"$f":"IF(AC882=\"\",\"\",MAX($AB$3:AB881)+1)","v":""},"","","",{"$f":"IF(AB882=\"\",\"\",#REF!)","v":""},{"$f":"IF(AD882=\"\",\"\",#REF!)","v":""},"","","","","","","","","","","","","","","","","","","","","",""]
[null,null,null,null,null,null,null,null,null,null,null,null,null,null,null,null,null,null,null,"",null,null,null,null,null," ",null,{"$f":"IF(AC883=\"\",\"\",MAX($AB$3:AB882)+1)","v":""},"","","",{"$f":"IF(AB883=\"\",\"\",#REF!)","v":""},{"$f":"IF(AD883=\"\",\"\",#REF!)","v":""},"","","","","","","","","","","","","","","","","","","","","",""]
[null,null,null,null,null,null,null,null,null,null,null,null,null,null,null,null,null,null,null,"",null,null,null,null,null," ",null,{"$f":"IF(AC884=\"\",\"\",MAX($AB$3:AB883)+1)","v":""},"","","",{"$f":"IF(AB884=\"\",\"\",#REF!)","v":""},{"$f":"IF(AD884=\"\",\"\",#REF!)","v":""},"","","","","","","","","","","","","","","","","","","","","",""]
[null,null,null,null,null,null,null,null,null,null,null,null,null,null,null,null,null,null,null,"",null,null,null,null,null," ",null,{"$f":"IF(AC885=\"\",\"\",MAX($AB$3:AB884)+1)","v":""},"","","",{"$f":"IF(AB885=\"\",\"\",#REF!)","v":""},{"$f":"IF(AD885=\"\",\"\",#REF!)","v":""},"","","","","","","","","","","","","","","","","","","","","",""]
[null,null,null,null,null,null,null,null,null,null,null,null,null,null,null,null,null,null,null,"",null,null,null,null,null," ",null,{"$f":"IF(AC886=\"\",\"\",MAX($AB$3:AB885)+1)","v":""},"","","",{"$f":"IF(AB886=\"\",\"\",#REF!)","v":""},{"$f":"IF(AD886=\"\",\"\",#REF!)","v":""},"","","","","","","","","","","","","","","","","","","","","",""]
[null,null,null,null,null,null,null,null,null,null,null,null,null,null,null,null,null,null,null,"",null,null,null,null,null," ",null,{"$f":"IF(AC887=\"\",\"\",MAX($AB$3:AB886)+1)","v":""},"","","",{"$f":"IF(AB887=\"\",\"\",#REF!)","v":""},{"$f":"IF(AD887=\"\",\"\",#REF!)","v":""},"","","","","","","","","","","","","","","","","","","","","",""]
[null,null,null,null,null,null,null,null,null,null,null,null,null,null,null,null,null,null,null,"",null,null,null,null,null," ",null,{"$f":"IF(AC888=\"\",\"\",MAX($AB$3:AB887)+1)","v":""},"","","",{"$f":"IF(AB888=\"\",\"\",#REF!)","v":""},{"$f":"IF(AD888=\"\",\"\",#REF!)","v":""},"","","","","","","","","","","","","","","","","","","","","",""]
[null,null,null,null,null,null,null,null,null,null,null,null,null,null,null,null,null,null,null,"",null,null,null,null,null," ",null,{"$f":"IF(AC889=\"\",\"\",MAX($AB$3:AB888)+1)","v":""},"","","",{"$f":"IF(AB889=\"\",\"\",#REF!)","v":""},{"$f":"IF(AD889=\"\",\"\",#REF!)","v":""},"","","","","","","","","","","","","","","","","","","","","",""]
[null,null,null,null,null,null,null,null,null,null,null,null,null,null,null,null,null,null,null,"",null,null,null,null,null," ",null,{"$f":"IF(AC890=\"\",\"\",MAX($AB$3:AB889)+1)","v":""},"","","",{"$f":"IF(AB890=\"\",\"\",#REF!)","v":""},{"$f":"IF(AD890=\"\",\"\",#REF!)","v":""},"","","","","","","","","","","","","","","","","","","","","",""]
[null,null,null,null,null,null,null,null,null,null,null,null,null,null,null,null,null,null,null,"",null,null,null,null,null," ",null,{"$f":"IF(AC891=\"\",\"\",MAX($AB$3:AB890)+1)","v":""},"","","",{"$f":"IF(AB891=\"\",\"\",#REF!)","v":""},{"$f":"IF(AD891=\"\",\"\",#REF!)","v":""},"","","","","","","","","","","","","","","","","","","","","",""]
[null,null,null,null,null,null,null,null,null,null,null,null,null,null,null,null,null,null,null,"",null,null,null,null,null," ",null,{"$f":"IF(AC892=\"\",\"\",MAX($AB$3:AB891)+1)","v":""},"","","",{"$f":"IF(AB892=\"\",\"\",#REF!)","v":""},{"$f":"IF(AD892=\"\",\"\",#REF!)","v":""},"","","","","","","","","","","","","","","","","","","","","",""]
[null,null,null,null,null,null,null,null,null,null,null,null,null,null,null,null,null,null,null,"",null,null,null,null,null," ",null,{"$f":"IF(AC893=\"\",\"\",MAX($AB$3:AB892)+1)","v":""},"","","",{"$f":"IF(AB893=\"\",\"\",#REF!)","v":""},{"$f":"IF(AD893=\"\",\"\",#REF!)","v":""},"","","","","","","","","","","","","","","","","","","","","",""]
[null,null,null,null,null,null,null,null,null,null,null,null,null,null,null,null,null,null,null,"",null,null,null,null,null," ",null,{"$f":"IF(AC894=\"\",\"\",MAX($AB$3:AB893)+1)","v":""},"","","",{"$f":"IF(AB894=\"\",\"\",#REF!)","v":""},{"$f":"IF(AD894=\"\",\"\",#REF!)","v":""},"","","","","","","","","","","","","","","","","","","","","",""]
[null,null,null,null,null,null,null,null,null,null,null,null,null,null,null,null,null,null,null,"",null,null,null,null,null," ",null,{"$f":"IF(AC895=\"\",\"\",MAX($AB$3:AB894)+1)","v":""},"","","",{"$f":"IF(AB895=\"\",\"\",#REF!)","v":""},{"$f":"IF(AD895=\"\",\"\",#REF!)","v":""},"","","","","","","","","","","","","","","","","","","","","",""]
[null,null,null,null,null,null,null,null,null,null,null,null,null,null,null,null,null,null,null,"",null,null,null,null,null," ",null,{"$f":"IF(AC896=\"\",\"\",MAX($AB$3:AB895)+1)","v":""},"","","",{"$f":"IF(AB896=\"\",\"\",#REF!)","v":""},{"$f":"IF(AD896=\"\",\"\",#REF!)","v":""},"","","","","","","","","","","","","","","","","","","","","",""]
[null,null,null,null,null,null,null,null,null,null,null,null,null,null,null,null,null,null,null,"",null,null,null,null,null," ",null,{"$f":"IF(AC897=\"\",\"\",MAX($AB$3:AB896)+1)","v":""},"","","",{"$f":"IF(AB897=\"\",\"\",#REF!)","v":""},{"$f":"IF(AD897=\"\",\"\",#REF!)","v":""},"","","","","","","","","","","","","","","","","","","","","",""]
[null,null,null,null,null,null,null,null,null,null,null,null,null,null,null,null,null,null,null,"",null,null,null,null,null," ",null,{"$f":"IF(AC898=\"\",\"\",MAX($AB$3:AB897)+1)","v":""},"","","",{"$f":"IF(AB898=\"\",\"\",#REF!)","v":""},{"$f":"IF(AD898=\"\",\"\",#REF!)","v":""},"","","","","","","","","","","","","","","","","","","","","",""]
[null,null,null,null,null,null,null,null,null,null,null,null,null,null,null,null,null,null,null,"",null,null,null,null,null," ",null,{"$f":"IF(AC899=\"\",\"\",MAX($AB$3:AB898)+1)","v":""},"","","",{"$f":"IF(AB899=\"\",\"\",#REF!)","v":""},{"$f":"IF(AD899=\"\",\"\",#REF!)","v":""},"","","","","","","","","","","","","","","","","","","","","",""]
[null,null,null,null,null,null,null,null,null,null,null,null,null,null,null,null,null,null,null,"",null,null,null,null,null," ",null,{"$f":"IF(AC900=\"\",\"\",MAX($AB$3:AB899)+1)","v":""},"","","",{"$f":"IF(AB900=\"\",\"\",#REF!)","v":""},{"$f":"IF(AD900=\"\",\"\",#REF!)","v":""},"","","","","","","","","","","","","","","","","","","","","",""]
[null,null,null,null,null,null,null,null,null,null,null,null,null,null,null,null,null,null,null,"",null,null,null,null,null," ",null,{"$f":"IF(AC901=\"\",\"\",MAX($AB$3:AB900)+1)","v":""},"","","",{"$f":"IF(AB901=\"\",\"\",#REF!)","v":""},{"$f":"IF(AD901=\"\",\"\",#REF!)","v":""},"","","","","","","","","","","","","","","","","","","","","",""]
[null,null,null,null,null,null,null,null,null,null,null,null,null,null,null,null,null,null,null,"",null,null,null,null,null," ",null,{"$f":"IF(AC902=\"\",\"\",MAX($AB$3:AB901)+1)","v":""},"","","",{"$f":"IF(AB902=\"\",\"\",#REF!)","v":""},{"$f":"IF(AD902=\"\",\"\",#REF!)","v":""},"","","","","","","","","","","","","","","","","","","","","",""]
[null,null,null,null,null,null,null,null,null,null,null,null,null,null,null,null,null,null,null,"",null,null,null,null,null," ",null,{"$f":"IF(AC903=\"\",\"\",MAX($AB$3:AB902)+1)","v":""},"","","",{"$f":"IF(AB903=\"\",\"\",#REF!)","v":""},{"$f":"IF(AD903=\"\",\"\",#REF!)","v":""},"","","","","","","","","","","","","","","","","","","","","",""]
[null,null,null,null,null,null,null,null,null,null,null,null,null,null,null,null,null,null,null,"",null,null,null,null,null," ",null,{"$f":"IF(AC904=\"\",\"\",MAX($AB$3:AB903)+1)","v":""},"","","",{"$f":"IF(AB904=\"\",\"\",#REF!)","v":""},{"$f":"IF(AD904=\"\",\"\",#REF!)","v":""},"","","","","","","","","","","","","","","","","","","","","",""]
[null,null,null,null,null,null,null,null,null,null,null,null,null,null,null,null,null,null,null,"",null,null,null,null,null," ",null,{"$f":"IF(AC905=\"\",\"\",MAX($AB$3:AB904)+1)","v":""},"","","",{"$f":"IF(AB905=\"\",\"\",#REF!)","v":""},{"$f":"IF(AD905=\"\",\"\",#REF!)","v":""},"","","","","","","","","","","","","","","","","","","","","",""]
[null,null,null,null,null,null,null,null,null,null,null,null,null,null,null,null,null,null,null,"",null,null,null,null,null," ",null,{"$f":"IF(AC906=\"\",\"\",MAX($AB$3:AB905)+1)","v":""},"","","",{"$f":"IF(AB906=\"\",\"\",#REF!)","v":""},{"$f":"IF(AD906=\"\",\"\",#REF!)","v":""},"","","","","","","","","","","","","","","","","","","","","",""]
[null,null,null,null,null,null,null,null,null,null,null,null,null,null,null,null,null,null,null,"",null,null,null,null,null," ",null,{"$f":"IF(AC907=\"\",\"\",MAX($AB$3:AB906)+1)","v":""},"","","",{"$f":"IF(AB907=\"\",\"\",#REF!)","v":""},{"$f":"IF(AD907=\"\",\"\",#REF!)","v":""},"","","","","","","","","","","","","","","","","","","","","",""]
[null,null,null,null,null,null,null,null,null,null,null,null,null,null,null,null,null,null,null,"",null,null,null,null,null," ",null,{"$f":"IF(AC908=\"\",\"\",MAX($AB$3:AB907)+1)","v":""},"","","",{"$f":"IF(AB908=\"\",\"\",#REF!)","v":""},{"$f":"IF(AD908=\"\",\"\",#REF!)","v":""},"","","","","","","","","","","","","","","","","","","","","",""]
[null,null,null,null,null,null,null,null,null,null,null,null,null,null,null,null,null,null,null,"",null,null,null,null,null," ",null,{"$f":"IF(AC909=\"\",\"\",MAX($AB$3:AB908)+1)","v":""},"","","",{"$f":"IF(AB909=\"\",\"\",#REF!)","v":""},{"$f":"IF(AD909=\"\",\"\",#REF!)","v":""},"","","","","","","","","","","","","","","","","","","","","",""]
[null,null,null,null,null,null,null,null,null,null,null,null,null,null,null,null,null,null,null,"",null,null,null,null,null," ",null,{"$f":"IF(AC910=\"\",\"\",MAX($AB$3:AB909)+1)","v":""},"","","",{"$f":"IF(AB910=\"\",\"\",#REF!)","v":""},{"$f":"IF(AD910=\"\",\"\",#REF!)","v":""},"","","","","","","","","","","","","","","","","","","","","",""]
[null,null,null,null,null,null,null,null,null,null,null,null,null,null,null,null,null,null,null,"",null,null,null,null,null," ",null,{"$f":"IF(AC911=\"\",\"\",MAX($AB$3:AB910)+1)","v":""},"","","",{"$f":"IF(AB911=\"\",\"\",#REF!)","v":""},{"$f":"IF(AD911=\"\",\"\",#REF!)","v":""},"","","","","","","","","","","","","","","","","","","","","",""]
[null,null,null,null,null,null,null,null,null,null,null,null,null,null,null,null,null,null,null,"",null,null,null,null,null," ",null,{"$f":"IF(AC912=\"\",\"\",MAX($AB$3:AB911)+1)","v":""},"","","",{"$f":"IF(AB912=\"\",\"\",#REF!)","v":""},{"$f":"IF(AD912=\"\",\"\",#REF!)","v":""},"","","","","","","","","","","","","","","","","","","","","",""]
[null,null,null,null,null,null,null,null,null,null,null,null,null,null,null,null,null,null,null,"",null,null,null,null,null," ",null,{"$f":"IF(AC913=\"\",\"\",MAX($AB$3:AB912)+1)","v":""},{"$f":"IF(C913=\"\",\"\",IF(B913=$AB$1,C913,\"\"))","v":""},{"$f":"IF(AB913=\"\",\"\",B913)","v":""},{"$f":"IF(AB913=\"\",\"\",E913)","v":""},{"$f":"IF(AB913=\"\",\"\",#REF!)","v":""},{"$f":"IF(AD913=\"\",\"\",#REF!)","v":""},{"$f":"IF(AD913=\"\",\"\",U913)","v":""},{"$f":"IF(AD913=\"\",\"\",V913)","v":""},{"$f":"IF(AD913=\"\",\"\",W913)","v":""},{"$f":"IF(AH913=\"\",\"\",X913)","v":""},{"$f":"IF(AI913=\"\",\"\",Y913)","v":""},{"$f":"IF(AE913=\"\",\"\",D913)","v":""},{"$f":"IF(AE913=\"\",\"\",X913)","v":""},{"$f":"IF(AE913=\"\",\"\",Y913)","v":""},{"$f":"IF(AD913=\"\",\"\",F913)","v":""},{"$f":"IF(AE913=\"\",\"\",G913)","v":""},{"$f":"IF(AD913=\"\",\"\",H913)","v":""},{"$f":"IF(AD913=\"\",\"\",I913)","v":""},{"$f":"IF(AH913=\"\",\"\",J913)","v":""},{"$f":"IF(AI913=\"\",\"\",K913)","v":""},{"$f":"IF(AJ913=\"\",\"\",L913)","v":""},{"$f":"IF(AK913=\"\",\"\",M913)","v":""},{"$f":"IF(AL913=\"\",\"\",N913)","v":""},{"$f":"IF(AM913=\"\",\"\",O913)","v":""},{"$f":"IF(AN913=\"\",\"\",P913)","v":""},{"$f":"IF(AO913=\"\",\"\",Q913)","v":""},{"$f":"IF(AP913=\"\",\"\",R913)","v":""},{"$f":"IF(AQ913=\"\",\"\",S913)","v":""}]
[null,null,null,null,null,null,null,null,null,null,null,null,null,null,null,null,null,null,null,{"$f":"IF(AND(C914=\"\",B914=\"\"),\"\",B914+1095)","v":""},null,null,null,null,null," ",null,{"$f":"IF(AC914=\"\",\"\",MAX($AB$3:AB913)+1)","v":""},"","","",{"$f":"IF(AB914=\"\",\"\",#REF!)","v":""},{"$f":"IF(AD914=\"\",\"\",#REF!)","v":""},"","","","","","","","","","","","","","","","","","","","","",""]
[null,null,null,null,null,null,null,null,null,null,null,null,null,null,null,null,null,null,null,"",null,null,null,null,null," ",null,{"$f":"IF(AC915=\"\",\"\",MAX($AB$3:AB914)+1)","v":""},"","","",{"$f":"IF(AB915=\"\",\"\",#REF!)","v":""},{"$f":"IF(AD915=\"\",\"\",#REF!)","v":""},"","","","","","","","","","","","","","","","","","","","","",""]
[null,null,null,null,null,null,null,null,null,null,null,null,null,null,null,null,null,null,null,"",null,null,null,null,null," ",null,{"$f":"IF(AC916=\"\",\"\",MAX($AB$3:AB915)+1)","v":""},"","","",{"$f":"IF(AB916=\"\",\"\",#REF!)","v":""},{"$f":"IF(AD916=\"\",\"\",#REF!)","v":""},"","","","","","","","","","","","","","","","","","","","","",""]
[null,null,null,null,null,null,null,null,null,null,null,null,null,null,null,null,null,null,null,"",null,null,null,null,null," ",null,{"$f":"IF(AC917=\"\",\"\",MAX($AB$3:AB916)+1)","v":""},"","","",{"$f":"IF(AB917=\"\",\"\",#REF!)","v":""},{"$f":"IF(AD917=\"\",\"\",#REF!)","v":""},"","","","","","","","","","","","","","","","","","","","","",""]
[null,null,null,null,null,null,null,null,null,null,null,null,null,null,null,null,null,null,null,"",null,null,null,null,null," ",null,{"$f":"IF(AC918=\"\",\"\",MAX($AB$3:AB917)+1)","v":""},"","","",{"$f":"IF(AB918=\"\",\"\",#REF!)","v":""},{"$f":"IF(AD918=\"\",\"\",#REF!)","v":""},"","","","","","","","","","","","","","","","","","","","","",""]
[null,null,null,null,null,null,null,null,null,null,null,null,null,null,null,null,null,null,null,"",null,null,null,null,null," ",null,{"$f":"IF(AC919=\"\",\"\",MAX($AB$3:AB918)+1)","v":""},"","","",{"$f":"IF(AB919=\"\",\"\",#REF!)","v":""},{"$f":"IF(AD919=\"\",\"\",#REF!)","v":""},"","","","","","","","","","","","","","","","","","","","","",""]
[null,null,null,null,null,null,null,null,null,null,null,null,null,null,null,null,null,null,null,"",null,null,null,null,null," ",null,{"$f":"IF(AC920=\"\",\"\",MAX($AB$3:AB919)+1)","v":""},"","","",{"$f":"IF(AB920=\"\",\"\",#REF!)","v":""},{"$f":"IF(AD920=\"\",\"\",#REF!)","v":""},"","","","","","","","","","","","","","","","","","","","","",""]
[null,null,null,null,null,null,null,null,null,null,null,null,null,null,null,null,null,null,null,"",null,null,null,null,null," ",null,{"$f":"IF(AC921=\"\",\"\",MAX($AB$3:AB920)+1)","v":""},"","","",{"$f":"IF(AB921=\"\",\"\",#REF!)","v":""},{"$f":"IF(AD921=\"\",\"\",#REF!)","v":""},"","","","","","","","","","","","","","","","","","","","","",""]
[null,null,null,null,null,null,null,null,null,null,null,null,null,null,null,null,null,null,null,"",null,null,null,null,null," ",null,{"$f":"IF(AC922=\"\",\"\",MAX($AB$3:AB921)+1)","v":""},"","","",{"$f":"IF(AB922=\"\",\"\",#REF!)","v":""},{"$f":"IF(AD922=\"\",\"\",#REF!)","v":""},"","","","","","","","","","","","","","","","","","","","","",""]
[null,null,null,null,null,null,null,null,null,null,null,null,null,null,null,null,null,null,null,"",null,null,null,null,null," ",null,{"$f":"IF(AC923=\"\",\"\",MAX($AB$3:AB922)+1)","v":""},"","","",{"$f":"IF(AB923=\"\",\"\",#REF!)","v":""},{"$f":"IF(AD923=\"\",\"\",#REF!)","v":""},"","","","","","","","","","","","","","","","","","","","","",""]
[null,null,null,null,null,null,null,null,null,null,null,null,null,null,null,null,null,null,null,"",null,null,null,null,null," ",null,{"$f":"IF(AC924=\"\",\"\",MAX($AB$3:AB923)+1)","v":""},"","","",{"$f":"IF(AB924=\"\",\"\",#REF!)","v":""},{"$f":"IF(AD924=\"\",\"\",#REF!)","v":""},"","","","","","","","","","","","","","","","","","","","","",""]
[null,null,null,null,null,null,null,null,null,null,null,null,null,null,null,null,null,null,null,"",null,null,null,null,null," ",null,{"$f":"IF(AC925=\"\",\"\",MAX($AB$3:AB924)+1)","v":""},"","","",{"$f":"IF(AB925=\"\",\"\",#REF!)","v":""},{"$f":"IF(AD925=\"\",\"\",#REF!)","v":""},"","","","","","","","","","","","","","","","","","","","","",""]
[null,null,null,null,null,null,null,null,null,null,null,null,null,null,null,null,null,null,null,"",null,null,null,null,null," ",null,{"$f":"IF(AC926=\"\",\"\",MAX($AB$3:AB925)+1)","v":""},"","","",{"$f":"IF(AB926=\"\",\"\",#REF!)","v":""},{"$f":"IF(AD926=\"\",\"\",#REF!)","v":""},"","","","","","","","","","","","","","","","","","","","","",""]
[null,null,null,null,null,null,null,null,null,null,null,null,null,null,null,null,null,null,null,"",null,null,null,null,null," ",null,{"$f":"IF(AC927=\"\",\"\",MAX($AB$3:AB926)+1)","v":""},"","","",{"$f":"IF(AB927=\"\",\"\",#REF!)","v":""},{"$f":"IF(AD927=\"\",\"\",#REF!)","v":""},"","","","","","","","","","","","","","","","","","","","","",""]
[null,null,null,null,null,null,null,null,null,null,null,null,null,null,null,null,null,null,null,"",null,null,null,null,null," ",null,{"$f":"IF(AC928=\"\",\"\",MAX($AB$3:AB927)+1)","v":""},"","","",{"$f":"IF(AB928=\"\",\"\",#REF!)","v":""},{"$f":"IF(AD928=\"\",\"\",#REF!)","v":""},"","","","","","","","","","","","","","","","","","","","","",""]
[null,null,null,null,null,null,null,null,null,null,null,null,null,null,null,null,null,null,null,"",null,null,null,null,null," ",null,{"$f":"IF(AC929=\"\",\"\",MAX($AB$3:AB928)+1)","v":""},"","","",{"$f":"IF(AB929=\"\",\"\",#REF!)","v":""},{"$f":"IF(AD929=\"\",\"\",#REF!)","v":""},"","","","","","","","","","","","","","","","","","","","","",""]
[null,null,null,null,null,null,null,null,null,null,null,null,null,null,null,null,null,null,null,"",null,null,null,null,null," ",null,{"$f":"IF(AC930=\"\",\"\",MAX($AB$3:AB929)+1)","v":""},"","","",{"$f":"IF(AB930=\"\",\"\",#REF!)","v":""},{"$f":"IF(AD930=\"\",\"\",#REF!)","v":""},"","","","","","","","","","","","","","","","","","","","","",""]
[null,null,null,null,null,null,null,null,null,null,null,null,null,null,null,null,null,null,null,"",null,null,null,null,null," ",null,{"$f":"IF(AC931=\"\",\"\",MAX($AB$3:AB930)+1)","v":""},"","","",{"$f":"IF(AB931=\"\",\"\",#REF!)","v":""},{"$f":"IF(AD931=\"\",\"\",#REF!)","v":""},"","","","","","","","","","","","","","","","","","","","","",""]
[null,null,null,null,null,null,null,null,null,null,null,null,null,null,null,null,null,null,null,"",null,null,null,null,null," ",null,{"$f":"IF(AC932=\"\",\"\",MAX($AB$3:AB931)+1)","v":""},"","","",{"$f":"IF(AB932=\"\",\"\",#REF!)","v":""},{"$f":"IF(AD932=\"\",\"\",#REF!)","v":""},"","","","","","","","","","","","","","","","","","","","","",""]
[null,null,null,null,null,null,null,null,null,null,null,null,null,null,null,null,null,null,null,"",null,null,null,null,null," ",null,{"$f":"IF(AC933=\"\",\"\",MAX($AB$3:AB932)+1)","v":""},"","","",{"$f":"IF(AB933=\"\",\"\",#REF!)","v":""},{"$f":"IF(AD933=\"\",\"\",#REF!)","v":""},"","","","","","","","","","","","","","","","","","","","","",""]
[null,null,null,null,null,null,null,null,null,null,null,null,null,null,null,null,null,null,null,"",null,null,null,null,null," ",null,{"$f":"IF(AC934=\"\",\"\",MAX($AB$3:AB933)+1)","v":""},"","","",{"$f":"IF(AB934=\"\",\"\",#REF!)","v":""},{"$f":"IF(AD934=\"\",\"\",#REF!)","v":""},"","","","","","","","","","","","","","","","","","","","","",""]
[null,null,null,null,null,null,null,null,null,null,null,null,null,null,null,null,null,null,null,"",null,null,null,null,null," ",null,{"$f":"IF(AC935=\"\",\"\",MAX($AB$3:AB934)+1)","v":""},"","","",{"$f":"IF(AB935=\"\",\"\",#REF!)","v":""},{"$f":"IF(AD935=\"\",\"\",#REF!)","v":""},"","","","","","","","","","","","","","","","","","","","","",""]
[null,null,null,null,null,null,null,null,null,null,null,null,null,null,null,null,null,null,null,"",null,null,null,null,null," ",null,{"$f":"IF(AC936=\"\",\"\",MAX($AB$3:AB935)+1)","v":""},"","","",{"$f":"IF(AB936=\"\",\"\",#REF!)","v":""},{"$f":"IF(AD936=\"\",\"\",#REF!)","v":""},"","","","","","","","","","","","","","","","","","","","","",""]
[null,null,null,null,null,null,null,null,null,null,null,null,null,null,null,null,null,null,null,"",null,null,null,null,null," ",null,{"$f":"IF(AC937=\"\",\"\",MAX($AB$3:AB936)+1)","v":""},"","","",{"$f":"IF(AB937=\"\",\"\",#REF!)","v":""},{"$f":"IF(AD937=\"\",\"\",#REF!)","v":""},"","","","","","","","","","","","","","","","","","","","","",""]
[null,null,null,null,null,null,null,null,null,null,null,null,null,null,null,null,null,null,null,"",null,null,null,null,null," ",null,{"$f":"IF(AC938=\"\",\"\",MAX($AB$3:AB937)+1)","v":""},"","","",{"$f":"IF(AB938=\"\",\"\",#REF!)","v":""},{"$f":"IF(AD938=\"\",\"\",#REF!)","v":""},"","","","","","","","","","","","","","","","","","","","","",""]
[null,null,null,null,null,null,null,null,null,null,null,null,null,null,null,null,null,null,null,"",null,null,null,null,null," ",null,{"$f":"IF(AC939=\"\",\"\",MAX($AB$3:AB938)+1)","v":""},"","","",{"$f":"IF(AB939=\"\",\"\",#REF!)","v":""},{"$f":"IF(AD939=\"\",\"\",#REF!)","v":""},"","","","","","","","","","","","","","","","","","","","","",""]
[null,null,null,null,null,null,null,null,null,null,null,null,null,null,null,null,null,null,null,"",null,null,null,null,null," ",null,{"$f":"IF(AC940=\"\",\"\",MAX($AB$3:AB939)+1)","v":""},"","","",{"$f":"IF(AB940=\"\",\"\",#REF!)","v":""},{"$f":"IF(AD940=\"\",\"\",#REF!)","v":""},"","","","","","","","","","","","","","","","","","","","","",""]
[null,null,null,null,null,null,null,null,null,null,null,null,null,null,null,null,null,null,null,"",null,null,null,null,null," ",null,{"$f":"IF(AC941=\"\",\"\",MAX($AB$3:AB940)+1)","v":""},"","","",{"$f":"IF(AB941=\"\",\"\",#REF!)","v":""},{"$f":"IF(AD941=\"\",\"\",#REF!)","v":""},"","","","","","","","","","","","","","","","","","","","","",""]
[null,null,null,null,null,null,null,null,null,null,null,null,null,null,null,null,null,null,null,"",null,null,null,null,null," ",null,{"$f":"IF(AC942=\"\",\"\",MAX($AB$3:AB941)+1)","v":""},"","","",{"$f":"IF(AB942=\"\",\"\",#REF!)","v":""},{"$f":"IF(AD942=\"\",\"\",#REF!)","v":""},"","","","","","","","","","","","","","","","","","","","","",""]
[null,null,null,null,null,null,null,null,null,null,null,null,null,null,null,null,null,null,null,"",null,null,null,null,null," ",null,{"$f":"IF(AC943=\"\",\"\",MAX($AB$3:AB942)+1)","v":""},"","","",{"$f":"IF(AB943=\"\",\"\",#REF!)","v":""},{"$f":"IF(AD943=\"\",\"\",#REF!)","v":""},"","","","","","","","","","","","","","","","","","","","","",""]
[null,null,null,null,null,null,null,null,null,null,null,null,null,null,null,null,null,null,null,"",null,null,null,null,null," ",null,{"$f":"IF(AC944=\"\",\"\",MAX($AB$3:AB943)+1)","v":""},"","","",{"$f":"IF(AB944=\"\",\"\",#REF!)","v":""},{"$f":"IF(AD944=\"\",\"\",#REF!)","v":""},"","","","","","","","","","","","","","","","","","","","","",""]
[null,null,null,null,null,null,null,null,null,null,null,null,null,null,null,null,null,null,null,"",null,null,null,null,null," ",null,{"$f":"IF(AC945=\"\",\"\",MAX($AB$3:AB944)+1)","v":""},"","","",{"$f":"IF(AB945=\"\",\"\",#REF!)","v":""},{"$f":"IF(AD945=\"\",\"\",#REF!)","v":""},"","","","","","","","","","","","","","","","","","","","","",""]
[null,null,null,null,null,null,null,null,null,null,null,null,null,null,null,null,null,null,null,"",null,null,null,null,null," ",null,{"$f":"IF(AC946=\"\",\"\",MAX($AB$3:AB945)+1)","v":""},"","","",{"$f":"IF(AB946=\"\",\"\",#REF!)","v":""},{"$f":"IF(AD946=\"\",\"\",#REF!)","v":""},"","","","","","","","","","","","","","","","","","","","","",""]
[null,null,null,null,null,null,null,null,null,null,null,null,null,null,null,null,null,null,null,"",null,null,null,null,null," ",null,{"$f":"IF(AC947=\"\",\"\",MAX($AB$3:AB946)+1)","v":""},"","","",{"$f":"IF(AB947=\"\",\"\",#REF!)","v":""},{"$f":"IF(AD947=\"\",\"\",#REF!)","v":""},"","","","","","","","","","","","","","","","","","","","","",""]
[null,null,null,null,null,null,null,null,null,null,null,null,null,null,null,null,null,null,null,"",null,null,null,null,null," ",null,{"$f":"IF(AC948=\"\",\"\",MAX($AB$3:AB947)+1)","v":""},"","","",{"$f":"IF(AB948=\"\",\"\",#REF!)","v":""},{"$f":"IF(AD948=\"\",\"\",#REF!)","v":""},"","","","","","","","","","","","","","","","","","","","","",""]
[null,null,null,null,null,null,null,null,null,null,null,null,null,null,null,null,null,null,null,"",null,null,null,null,null," ",null,{"$f":"IF(AC949=\"\",\"\",MAX($AB$3:AB948)+1)","v":""},"","","",{"$f":"IF(AB949=\"\",\"\",#REF!)","v":""},{"$f":"IF(AD949=\"\",\"\",#REF!)","v":""},"","","","","","","","","","","","","","","","","","","","","",""]
[null,null,null,null,null,null,null,null,null,null,null,null,null,null,null,null,null,null,null,"",null,null,null,null,null," ",null,{"$f":"IF(AC950=\"\",\"\",MAX($AB$3:AB949)+1)","v":""},"","","",{"$f":"IF(AB950=\"\",\"\",#REF!)","v":""},{"$f":"IF(AD950=\"\",\"\",#REF!)","v":""},"","","","","","","","","","","","","","","","","","","","","",""]
[null,null,null,null,null,null,null,null,null,null,null,null,null,null,null,null,null,null,null,"",null,null,null,null,null," ",null,{"$f":"IF(AC951=\"\",\"\",MAX($AB$3:AB950)+1)","v":""},"","","",{"$f":"IF(AB951=\"\",\"\",#REF!)","v":""},{"$f":"IF(AD951=\"\",\"\",#REF!)","v":""},"","","","","","","","","","","","","","","","","","","","","",""]
[null,null,null,null,null,null,null,null,null,null,null,null,null,null,null,null,null,null,null,"",null,null,null,null,null," ",null,{"$f":"IF(AC952=\"\",\"\",MAX($AB$3:AB951)+1)","v":""},"","","",{"$f":"IF(AB952=\"\",\"\",#REF!)","v":""},{"$f":"IF(AD952=\"\",\"\",#REF!)","v":""},"","","","","","","","","","","","","","","","","","","","","",""]
[null,null,null,null,null,null,null,null,null,null,null,null,null,null,null,null,null,null,null,"",null,null,null,null,null," ",null,{"$f":"IF(AC953=\"\",\"\",MAX($AB$3:AB952)+1)","v":""},"","","",{"$f":"IF(AB953=\"\",\"\",#REF!)","v":""},{"$f":"IF(AD953=\"\",\"\",#REF!)","v":""},"","","","","","","","","","","","","","","","","","","","","",""]
[null,null,null,null,null,null,null,null,null,null,null,null,null,null,null,null,null,null,null,"",null,null,null,null,null," ",null,{"$f":"IF(AC954=\"\",\"\",MAX($AB$3:AB953)+1)","v":""},"","","",{"$f":"IF(AB954=\"\",\"\",#REF!)","v":""},{"$f":"IF(AD954=\"\",\"\",#REF!)","v":""},"","","","","","","","","","","","","","","","","","","","","",""]
[null,null,null,null,null,null,null,null,null,null,null,null,null,null,null,null,null,null,null,"",null,null,null,null,null," ",null,{"$f":"IF(AC955=\"\",\"\",MAX($AB$3:AB954)+1)","v":""},"","","",{"$f":"IF(AB955=\"\",\"\",#REF!)","v":""},{"$f":"IF(AD955=\"\",\"\",#REF!)","v":""},"","","","","","","","","","","","","","","","","","","","","",""]
[null,null,null,null,null,null,null,null,null,null,null,null,null,null,null,null,null,null,null,"",null,null,null,null,null," ",null,{"$f":"IF(AC956=\"\",\"\",MAX($AB$3:AB955)+1)","v":""},"","","",{"$f":"IF(AB956=\"\",\"\",#REF!)","v":""},{"$f":"IF(AD956=\"\",\"\",#REF!)","v":""},"","","","","","","","","","","","","","","","","","","","","",""]
[null,null,null,null,null,null,null,null,null,null,null,null,null,null,null,null,null,null,null,"",null,null,null,null,null," ",null,{"$f":"IF(AC957=\"\",\"\",MAX($AB$3:AB956)+1)","v":""},"","","",{"$f":"IF(AB957=\"\",\"\",#REF!)","v":""},{"$f":"IF(AD957=\"\",\"\",#REF!)","v":""},"","","","","","","","","","","","","","","","","","","","","",""]
[null,null,null,null,null,null,null,null,null,null,null,null,null,null,null,null,null,null,null,"",null,null,null,null,null," ",null,{"$f":"IF(AC958=\"\",\"\",MAX($AB$3:AB957)+1)","v":""},"","","",{"$f":"IF(AB958=\"\",\"\",#REF!)","v":""},{"$f":"IF(AD958=\"\",\"\",#REF!)","v":""},"","","","","","","","","","","","","","","","","","","","","",""]
[null,null,null,null,null,null,null,null,null,null,null,null,null,null,null,null,null,null,null,"",null,null,null,null,null," ",null,{"$f":"IF(AC959=\"\",\"\",MAX($AB$3:AB958)+1)","v":""},"","","",{"$f":"IF(AB959=\"\",\"\",#REF!)","v":""},{"$f":"IF(AD959=\"\",\"\",#REF!)","v":""},"","","","","","","","","","","","","","","","","","","","","",""]
[null,null,null,null,null,null,null,null,null,null,null,null,null,null,null,null,null,null,null,"",null,null,null,null,null," ",null,{"$f":"IF(AC960=\"\",\"\",MAX($AB$3:AB959)+1)","v":""},"","","",{"$f":"IF(AB960=\"\",\"\",#REF!)","v":""},{"$f":"IF(AD960=\"\",\"\",#REF!)","v":""},"","","","","","","","","","","","","","","","","","","","","",""]
[null,null,null,null,null,null,null,null,null,null,null,null,null,null,null,null,null,null,null,"",null,null,null,null,null," ",null,{"$f":"IF(AC961=\"\",\"\",MAX($AB$3:AB960)+1)","v":""},"","","",{"$f":"IF(AB961=\"\",\"\",#REF!)","v":""},{"$f":"IF(AD961=\"\",\"\",#REF!)","v":""},"","","","","","","","","","","","","","","","","","","","","",""]
[null,null,null,null,null,null,null,null,null,null,null,null,null,null,null,null,null,null,null,"",null,null,null,null,null," ",null,{"$f":"IF(AC962=\"\",\"\",MAX($AB$3:AB961)+1)","v":""},"","","",{"$f":"IF(AB962=\"\",\"\",#REF!)","v":""},{"$f":"IF(AD962=\"\",\"\",#REF!)","v":""},"","","","","","","","","","","","","","","","","","","","","",""]
[null,null,null,null,null,null,null,null,null,null,null,null,null,null,null,null,null,null,null,"",null,null,null,null,null," ",null,{"$f":"IF(AC963=\"\",\"\",MAX($AB$3:AB962)+1)","v":""},"","","",{"$f":"IF(AB963=\"\",\"\",#REF!)","v":""},{"$f":"IF(AD963=\"\",\"\",#REF!)","v":""},"","","","","","","","","","","","","","","","","","","","","",""]
[null,null,null,null,null,null,null,null,null,null,null,null,null,null,null,null,null,null,null,"",null,null,null,null,null," ",null,{"$f":"IF(AC964=\"\",\"\",MAX($AB$3:AB963)+1)","v":""},"","","",{"$f":"IF(AB964=\"\",\"\",#REF!)","v":""},{"$f":"IF(AD964=\"\",\"\",#REF!)","v":""},"","","","","","","","","","","","","","","","","","","","","",""]
[null,null,null,null,null,null,null,null,null,null,null,null,null,null,null,null,null,null,null,"",null,null,null,null,null," ",null,{"$f":"IF(AC965=\"\",\"\",MAX($AB$3:AB964)+1)","v":""},"","","",{"$f":"IF(AB965=\"\",\"\",#REF!)","v":""},{"$f":"IF(AD965=\"\",\"\",#REF!)","v":""},"","","","","","","","","","","","","","","","","","","","","",""]
[null,null,null,null,null,null,null,null,null,null,null,null,null,null,null,null,null,null,null,"",null,null,null,null,null," ",null,{"$f":"IF(AC966=\"\",\"\",MAX($AB$3:AB965)+1)","v":""},"","","",{"$f":"IF(AB966=\"\",\"\",#REF!)","v":""},{"$f":"IF(AD966=\"\",\"\",#REF!)","v":""},"","","","","","","","","","","","","","","","","","","","","",""]
[null,null,null,null,null,null,null,null,null,null,null,null,null,null,null,null,null,null,null,"",null,null,null,null,null," ",null,{"$f":"IF(AC967=\"\",\"\",MAX($AB$3:AB966)+1)","v":""},"","","",{"$f":"IF(AB967=\"\",\"\",#REF!)","v":""},{"$f":"IF(AD967=\"\",\"\",#REF!)","v":""},"","","","","","","","","","","","","","","","","","","","","",""]
[null,null,null,null,null,null,null,null,null,null,null,null,null,null,null,null,null,null,null,"",null,null,null,null,null," ",null,{"$f":"IF(AC968=\"\",\"\",MAX($AB$3:AB967)+1)","v":""},"","","",{"$f":"IF(AB968=\"\",\"\",#REF!)","v":""},{"$f":"IF(AD968=\"\",\"\",#REF!)","v":""},"","","","","","","","","","","","","","","","","","","","","",""]
[null,null,null,null,null,null,null,null,null,null,null,null,null,null,null,null,null,null,null,"",null,null,null,null,null," ",null,{"$f":"IF(AC969=\"\",\"\",MAX($AB$3:AB968)+1)","v":""},"","","",{"$f":"IF(AB969=\"\",\"\",#REF!)","v":""},{"$f":"IF(AD969=\"\",\"\",#REF!)","v":""},"","","","","","","","","","","","","","","","","","","","","",""]
[null,null,null,null,null,null,null,null,null,null,null,null,null,null,null,null,null,null,null,"",null,null,null,null,null," ",null,{"$f":"IF(AC970=\"\",\"\",MAX($AB$3:AB969)+1)","v":""},"","","",{"$f":"IF(AB970=\"\",\"\",#REF!)","v":""},{"$f":"IF(AD970=\"\",\"\",#REF!)","v":""},"","","","","","","","","","","","","","","","","","","","","",""]
[null,null,null,null,null,null,null,null,null,null,null,null,null,null,null,null,null,null,null,"",null,null,null,null,null," ",null,{"$f":"IF(AC971=\"\",\"\",MAX($AB$3:AB970)+1)","v":""},"","","",{"$f":"IF(AB971=\"\",\"\",#REF!)","v":""},{"$f":"IF(AD971=\"\",\"\",#REF!)","v":""},"","","","","","","","","","","","","","","","","","","","","",""]
[null,null,null,null,null,null,null,null,null,null,null,null,null,null,null,null,null,null,null,"",null,null,null,null,null," ",null,{"$f":"IF(AC972=\"\",\"\",MAX($AB$3:AB971)+1)","v":""},"","","",{"$f":"IF(AB972=\"\",\"\",#REF!)","v":""},{"$f":"IF(AD972=\"\",\"\",#REF!)","v":""},"","","","","","","","","","","","","","","","","","","","","",""]
[null,null,null,null,null,null,null,null,null,null,null,null,null,null,null,null,null,null,null,"",null,null,null,null,null," ",null,{"$f":"IF(AC973=\"\",\"\",MAX($AB$3:AB972)+1)","v":""},"","","",{"$f":"IF(AB973=\"\",\"\",#REF!)","v":""},{"$f":"IF(AD973=\"\",\"\",#REF!)","v":""},"","","","","","","","","","","","","","","","","","","","","",""]
[null,null,null,null,null,null,null,null,null,null,null,null,null,null,null,null,null,null,null,"",null,null,null,null,null," ",null,{"$f":"IF(AC974=\"\",\"\",MAX($AB$3:AB973)+1)","v":""},"","","",{"$f":"IF(AB974=\"\",\"\",#REF!)","v":""},{"$f":"IF(AD974=\"\",\"\",#REF!)","v":""},"","","","","","","","","","","","","","","","","","","","","",""]
[null,null,null,null,null,null,null,null,null,null,null,null,null,null,null,null,null,null,null,"",null,null,null,null,null," ",null,{"$f":"IF(AC975=\"\",\"\",MAX($AB$3:AB974)+1)","v":""},"","","",{"$f":"IF(AB975=\"\",\"\",#REF!)","v":""},{"$f":"IF(AD975=\"\",\"\",#REF!)","v":""},"","","","","","","","","","","","","","","","","","","","","",""]
[null,null,null,null,null,null,null,null,null,null,null,null,null,null,null,null,null,null,null,"",null,null,null,null,null," ",null,{"$f":"IF(AC976=\"\",\"\",MAX($AB$3:AB975)+1)","v":""},"","","",{"$f":"IF(AB976=\"\",\"\",#REF!)","v":""},{"$f":"IF(AD976=\"\",\"\",#REF!)","v":""},"","","","","","","","","","","","","","","","","","","","","",""]
[null,null,null,null,null,null,null,null,null,null,null,null,null,null,null,null,null,null,null,"",null,null,null,null,null," ",null,{"$f":"IF(AC977=\"\",\"\",MAX($AB$3:AB976)+1)","v":""},{"$f":"IF(C977=\"\",\"\",IF(B977=$AB$1,C977,\"\"))","v":""},{"$f":"IF(AB977=\"\",\"\",B977)","v":""},{"$f":"IF(AB977=\"\",\"\",E977)","v":""},{"$f":"IF(AB977=\"\",\"\",#REF!)","v":""},{"$f":"IF(AD977=\"\",\"\",#REF!)","v":""},{"$f":"IF(AD977=\"\",\"\",U977)","v":""},{"$f":"IF(AD977=\"\",\"\",V977)","v":""},{"$f":"IF(AD977=\"\",\"\",W977)","v":""},{"$f":"IF(AH977=\"\",\"\",X977)","v":""},{"$f":"IF(AI977=\"\",\"\",Y977)","v":""},{"$f":"IF(AE977=\"\",\"\",D977)","v":""},{"$f":"IF(AE977=\"\",\"\",X977)","v":""},{"$f":"IF(AE977=\"\",\"\",Y977)","v":""},{"$f":"IF(AD977=\"\",\"\",F977)","v":""},{"$f":"IF(AE977=\"\",\"\",G977)","v":""},{"$f":"IF(AD977=\"\",\"\",H977)","v":""},{"$f":"IF(AD977=\"\",\"\",I977)","v":""},{"$f":"IF(AH977=\"\",\"\",J977)","v":""},{"$f":"IF(AI977=\"\",\"\",K977)","v":""},{"$f":"IF(AJ977=\"\",\"\",L977)","v":""},{"$f":"IF(AK977=\"\",\"\",M977)","v":""},{"$f":"IF(AL977=\"\",\"\",N977)","v":""},{"$f":"IF(AM977=\"\",\"\",O977)","v":""},{"$f":"IF(AN977=\"\",\"\",P977)","v":""},{"$f":"IF(AO977=\"\",\"\",Q977)","v":""},{"$f":"IF(AP977=\"\",\"\",R977)","v":""},{"$f":"IF(AQ977=\"\",\"\",S977)","v":""}]
[null,null,null,null,null,null,null,null,null,null,null,null,null,null,null,null,null,null,null,{"$f":"IF(AND(C978=\"\",B978=\"\"),\"\",B978+1095)","v":""},null,null,null,null,null," ",null,{"$f":"IF(AC978=\"\",\"\",MAX($AB$3:AB977)+1)","v":""},"","","",{"$f":"IF(AB978=\"\",\"\",#REF!)","v":""},{"$f":"IF(AD978=\"\",\"\",#REF!)","v":""},"","","","","","","","","","","","","","","","","","","","","",""]
[null,null,null,null,null,null,null,null,null,null,null,null,null,null,null,null,null,null,null,"",null,null,null,null,null," ",null,{"$f":"IF(AC979=\"\",\"\",MAX($AB$3:AB978)+1)","v":""},"","","",{"$f":"IF(AB979=\"\",\"\",#REF!)","v":""},{"$f":"IF(AD979=\"\",\"\",#REF!)","v":""},"","","","","","","","","","","","","","","","","","","","","",""]
[null,null,null,null,null,null,null,null,null,null,null,null,null,null,null,null,null,null,null,"",null,null,null,null,null," ",null,{"$f":"IF(AC980=\"\",\"\",MAX($AB$3:AB979)+1)","v":""},"","","",{"$f":"IF(AB980=\"\",\"\",#REF!)","v":""},{"$f":"IF(AD980=\"\",\"\",#REF!)","v":""},"","","","","","","","","","","","","","","","","","","","","",""]
[null,null,null,null,null,null,null,null,null,null,null,null,null,null,null,null,null,null,null,"",null,null,null,null,null," ",null,{"$f":"IF(AC981=\"\",\"\",MAX($AB$3:AB980)+1)","v":""},"","","",{"$f":"IF(AB981=\"\",\"\",#REF!)","v":""},{"$f":"IF(AD981=\"\",\"\",#REF!)","v":""},"","","","","","","","","","","","","","","","","","","","","",""]
[null,null,null,null,null,null,null,null,null,null,null,null,null,null,null,null,null,null,null,"",null,null,null,null,null," ",null,{"$f":"IF(AC982=\"\",\"\",MAX($AB$3:AB981)+1)","v":""},"","","",{"$f":"IF(AB982=\"\",\"\",#REF!)","v":""},{"$f":"IF(AD982=\"\",\"\",#REF!)","v":""},"","","","","","","","","","","","","","","","","","","","","",""]
[null,null,null,null,null,null,null,null,null,null,null,null,null,null,null,null,null,null,null,"",null,null,null,null,null," ",null,{"$f":"IF(AC983=\"\",\"\",MAX($AB$3:AB982)+1)","v":""},"","","",{"$f":"IF(AB983=\"\",\"\",#REF!)","v":""},{"$f":"IF(AD983=\"\",\"\",#REF!)","v":""},"","","","","","","","","","","","","","","","","","","","","",""]
[null,null,null,null,null,null,null,null,null,null,null,null,null,null,null,null,null,null,null,"",null,null,null,null,null," ",null,{"$f":"IF(AC984=\"\",\"\",MAX($AB$3:AB983)+1)","v":""},"","","",{"$f":"IF(AB984=\"\",\"\",#REF!)","v":""},{"$f":"IF(AD984=\"\",\"\",#REF!)","v":""},"","","","","","","","","","","","","","","","","","","","","",""]
[null,null,null,null,null,null,null,null,null,null,null,null,null,null,null,null,null,null,null,"",null,null,null,null,null," ",null,{"$f":"IF(AC985=\"\",\"\",MAX($AB$3:AB984)+1)","v":""},"","","",{"$f":"IF(AB985=\"\",\"\",#REF!)","v":""},{"$f":"IF(AD985=\"\",\"\",#REF!)","v":""},"","","","","","","","","","","","","","","","","","","","","",""]
[null,null,null,null,null,null,null,null,null,null,null,null,null,null,null,null,null,null,null,"",null,null,null,null,null," ",null,{"$f":"IF(AC986=\"\",\"\",MAX($AB$3:AB985)+1)","v":""},"","","",{"$f":"IF(AB986=\"\",\"\",#REF!)","v":""},{"$f":"IF(AD986=\"\",\"\",#REF!)","v":""},"","","","","","","","","","","","","","","","","","","","","",""]
[null,null,null,null,null,null,null,null,null,null,null,null,null,null,null,null,null,null,null,"",null,null,null,null,null," ",null,{"$f":"IF(AC987=\"\",\"\",MAX($AB$3:AB986)+1)","v":""},"","","",{"$f":"IF(AB987=\"\",\"\",#REF!)","v":""},{"$f":"IF(AD987=\"\",\"\",#REF!)","v":""},"","","","","","","","","","","","","","","","","","","","","",""]
[null,null,null,null,null,null,null,null,null,null,null,null,null,null,null,null,null,null,null,"",null,null,null,null,null," ",null,{"$f":"IF(AC988=\"\",\"\",MAX($AB$3:AB987)+1)","v":""},"","","",{"$f":"IF(AB988=\"\",\"\",#REF!)","v":""},{"$f":"IF(AD988=\"\",\"\",#REF!)","v":""},"","","","","","","","","","","","","","","","","","","","","",""]
[null,null,null,null,null,null,null,null,null,null,null,null,null,null,null,null,null,null,null,"",null,null,null,null,null," ",null,{"$f":"IF(AC989=\"\",\"\",MAX($AB$3:AB988)+1)","v":""},"","","",{"$f":"IF(AB989=\"\",\"\",#REF!)","v":""},{"$f":"IF(AD989=\"\",\"\",#REF!)","v":""},"","","","","","","","","","","","","","","","","","","","","",""]
[null,null,null,null,null,null,null,null,null,null,null,null,null,null,null,null,null,null,null,"",null,null,null,null,null," ",null,{"$f":"IF(AC990=\"\",\"\",MAX($AB$3:AB989)+1)","v":""},"","","",{"$f":"IF(AB990=\"\",\"\",#REF!)","v":""},{"$f":"IF(AD990=\"\",\"\",#REF!)","v":""},"","","","","","","","","","","","","","","","","","","","","",""]
[null,null,null,null,null,null,null,null,null,null,null,null,null,null,null,null,null,null,null,"",null,null,null,null,null," ",null,{"$f":"IF(AC991=\"\",\"\",MAX($AB$3:AB990)+1)","v":""},"","","",{"$f":"IF(AB991=\"\",\"\",#REF!)","v":""},{"$f":"IF(AD991=\"\",\"\",#REF!)","v":""},"","","","","","","","","","","","","","","","","","","","","",""]
[null,null,null,null,null,null,null,null,null,null,null,null,null,null,null,null,null,null,null,"",null,null,null,null,null," ",null,{"$f":"IF(AC992=\"\",\"\",MAX($AB$3:AB991)+1)","v":""},"","","",{"$f":"IF(AB992=\"\",\"\",#REF!)","v":""},{"$f":"IF(AD992=\"\",\"\",#REF!)","v":""},"","","","","","","","","","","","","","","","","","","","","",""]
[null,null,null,null,null,null,null,null,null,null,null,null,null,null,null,null,null,null,null,"",null,null,null,null,null," ",null,{"$f":"IF(AC993=\"\",\"\",MAX($AB$3:AB992)+1)","v":""},"","","",{"$f":"IF(AB993=\"\",\"\",#REF!)","v":""},{"$f":"IF(AD993=\"\",\"\",#REF!)","v":""},"","","","","","","","","","","","","","","","","","","","","",""]
[null,null,null,null,null,null,null,null,null,null,null,null,null,null,null,null,null,null,null,"",null,null,null,null,null," ",null,{"$f":"IF(AC994=\"\",\"\",MAX($AB$3:AB993)+1)","v":""},"","","",{"$f":"IF(AB994=\"\",\"\",#REF!)","v":""},{"$f":"IF(AD994=\"\",\"\",#REF!)","v":""},"","","","","","","","","","","","","","","","","","","","","",""]
[null,null,null,null,null,null,null,null,null,null,null,null,null,null,null,null,null,null,null,"",null,null,null,null,null," ",null,{"$f":"IF(AC995=\"\",\"\",MAX($AB$3:AB994)+1)","v":""},"","","",{"$f":"IF(AB995=\"\",\"\",#REF!)","v":""},{"$f":"IF(AD995=\"\",\"\",#REF!)","v":""},"","","","","","","","","","","","","","","","","","","","","",""]
[null,null,null,null,null,null,null,null,null,null,null,null,null,null,null,null,null,null,null,"",null,null,null,null,null," ",null,{"$f":"IF(AC996=\"\",\"\",MAX($AB$3:AB995)+1)","v":""},"","","",{"$f":"IF(AB996=\"\",\"\",#REF!)","v":""},{"$f":"IF(AD996=\"\",\"\",#REF!)","v":""},"","","","","","","","","","","","","","","","","","","","","",""]
[null,null,null,null,null,null,null,null,null,null,null,null,null,null,null,null,null,null,null,"",null,null,null,null,null," ",null,{"$f":"IF(AC997=\"\",\"\",MAX($AB$3:AB996)+1)","v":""},"","","",{"$f":"IF(AB997=\"\",\"\",#REF!)","v":""},{"$f":"IF(AD997=\"\",\"\",#REF!)","v":""},"","","","","","","","","","","","","","","","","","","","","",""]
[null,null,null,null,null,null,null,null,null,null,null,null,null,null,null,null,null,null,null,"",null,null,null,null,null," ",null,{"$f":"IF(AC998=\"\",\"\",MAX($AB$3:AB997)+1)","v":""},"","","",{"$f":"IF(AB998=\"\",\"\",#REF!)","v":""},{"$f":"IF(AD998=\"\",\"\",#REF!)","v":""},"","","","","","","","","","","","","","","","","","","","","",""]
[null,null,null,null,null,null,null,null,null,null,null,null,null,null,null,null,null,null,null,"",null,null,null,null,null," ",null,{"$f":"IF(AC999=\"\",\"\",MAX($AB$3:AB998)+1)","v":""},"","","",{"$f":"IF(AB999=\"\",\"\",#REF!)","v":""},{"$f":"IF(AD999=\"\",\"\",#REF!)","v":""},"","","","","","","","","","","","","","","","","","","","","",""]
[null,null,null,null,null,null,null,null,null,null,null,null,null,null,null,null,null,null,null,"",null,null,null,null,null," ",null,{"$f":"IF(AC1000=\"\",\"\",MAX($AB$3:AB999)+1)","v":""},"","","",{"$f":"IF(AB1000=\"\",\"\",#REF!)","v":""},{"$f":"IF(AD1000=\"\",\"\",#REF!)","v":""},"","","","","","","","","","","","","","","","","","","","","",""]
[null,null,null,null,null,null,null,null,null,null,null,null,null,null,null,null,null,null,null,"",null,null,null,null,null," ",null,{"$f":"IF(AC1001=\"\",\"\",MAX($AB$3:AB1000)+1)","v":""},"","","",{"$f":"IF(AB1001=\"\",\"\",#REF!)","v":""},{"$f":"IF(AD1001=\"\",\"\",#REF!)","v":""},"","","","","","","","","","","","","","","","","","","","","",""]
[null,null,null,null,null,null,null,null,null,null,null,null,null,null,null,null,null,null,null,"",null,null,null,null,null," ",null,{"$f":"IF(AC1002=\"\",\"\",MAX($AB$3:AB1001)+1)","v":""},"","","",{"$f":"IF(AB1002=\"\",\"\",#REF!)","v":""},{"$f":"IF(AD1002=\"\",\"\",#REF!)","v":""},"","","","","","","","","","","","","","","","","","","","","",""]
[null,null,null,null,null,null,null,null,null,null,null,null,null,null,null,null,null,null,null,"",null,null,null,null,null," ",null,{"$f":"IF(AC1003=\"\",\"\",MAX($AB$3:AB1002)+1)","v":""},"","","",{"$f":"IF(AB1003=\"\",\"\",#REF!)","v":""},{"$f":"IF(AD1003=\"\",\"\",#REF!)","v":""},"","","","","","","","","","","","","","","","","","","","","",""]
[null,null,null,null,null,null,null,null,null,null,null,null,null,null,null,null,null,null,null,"",null,null,null,null,null," ",null,{"$f":"IF(AC1004=\"\",\"\",MAX($AB$3:AB1003)+1)","v":""},"","","",{"$f":"IF(AB1004=\"\",\"\",#REF!)","v":""},{"$f":"IF(AD1004=\"\",\"\",#REF!)","v":""},"","","","","","","","","","","","","","","","","","","","","",""]

{"sheet":"Дата печать","index":4,"n_rows":30,"n_cols":13,"rows_kept":30,"cut":false,"hidden":false,"merged":[]}
["02-Печать данных",null,null,null,"Дата обучения:","2022-08-29"," "," "," "," "]
["№ п/п","Дата проведения обучения:","№ удостоверения:","ФИО обучаемого:",null,null,null," "," "," ","Должность:","Вид проверки (очеред,внеочеред)","Результат"]
["1",2,3,4,null,null,null,null,null," ",12,13,14]
[1,{"$f":"IFERROR(VLOOKUP($A4,'Журнал Вахта_ИТР'!$AB$4:$AG$1004,3,FALSE),\"\")","v":"2022-08-29"},{"$f":"IFERROR(VLOOKUP($A4,'Журнал Вахта_ИТР'!$AB$4:$AG$1004,4,FALSE),\"\")","v":"165205"},{"$f":"IFERROR(VLOOKUP($A4,'Журнал Вахта_ИТР'!$AB$4:$AG$1004,2,FALSE),\"\")","v":"Балык Садир"},{"$f":"IFERROR(VLOOKUP($A4,'Журнал Вахта_ИТР'!$AB$4:$AG$1004,5,FALSE),\"\")","v":"T506"},{"$f":"IFERROR(VLOOKUP($A4,'Журнал Вахта_ИТР'!$AB$4:$AG$1004,6,FALSE),\"\")","v":""},null,null,null," ",{"$f":"IFERROR(VLOOKUP($A4,'Журнал Вахта_ИТР'!$AB$4:$AO$1004,12,FALSE),\"\")","v":"Бурильщик ЭиРБС на нефть и газ 8 р"},{"$f":"IFERROR(VLOOKUP($A4,'Журнал Вахта_ИТР'!$AB$4:$AO$1004,13,FALSE),\"\")","v":"Очередная"},{"$f":"IFERROR(VLOOKUP($A4,'Журнал Вахта_ИТР'!$AB$4:$AO$1004,14,FALSE),\"\")","v":"Сдал"}]
[2,{"$f":"IFERROR(VLOOKUP($A5,'Журнал Вахта_ИТР'!$AB$4:$AG$1004,3,FALSE),\"\")","v":"2022-08-29"},{"$f":"IFERROR(VLOOKUP($A5,'Журнал Вахта_ИТР'!$AB$4:$AG$1004,4,FALSE),\"\")","v":"28-3842"},{"$f":"IFERROR(VLOOKUP($A5,'Журнал Вахта_ИТР'!$AB$4:$AG$1004,2,FALSE),\"\")","v":"Семенов Сын"},{"$f":"IFERROR(VLOOKUP($A5,'Журнал Вахта_ИТР'!$AB$4:$AG$1004,5,FALSE),\"\")","v":"T506"},{"$f":"IFERROR(VLOOKUP($A5,'Журнал Вахта_ИТР'!$AB$4:$AG$1004,6,FALSE),\"\")","v":""}," ",null,null," ",{"$f":"IFERROR(VLOOKUP($A5,'Журнал Вахта_ИТР'!$AB$4:$AO$1004,12,FALSE),\"\")","v":"Помощник бурильщика ЭиРБС (второй) 6 р."},{"$f":"IFERROR(VLOOKUP($A5,'Журнал Вахта_ИТР'!$AB$4:$AO$1004,13,FALSE),\"\")","v":"Очередная"},{"$f":"IFERROR(VLOOKUP($A5,'Журнал Вахта_ИТР'!$AB$4:$AO$1004,14,FALSE),\"\")","v":"Сдал"}]
[3,{"$f":"IFERROR(VLOOKUP($A6,'Журнал Вахта_ИТР'!$AB$4:$AG$1004,3,FALSE),\"\")","v":"2022-08-29"},{"$f":"IFERROR(VLOOKUP($A6,'Журнал Вахта_ИТР'!$AB$4:$AG$1004,4,FALSE),\"\")","v":"29100"},{"$f":"IFERROR(VLOOKUP($A6,'Журнал Вахта_ИТР'!$AB$4:$AG$1004,2,FALSE),\"\")","v":"Коношанов Торган"},{"$f":"IFERROR(VLOOKUP($A6,'Журнал Вахта_ИТР'!$AB$4:$AG$1004,5,FALSE),\"\")","v":"T506"},{"$f":"IFERROR(VLOOKUP($A6,'Журнал Вахта_ИТР'!$AB$4:$AG$1004,6,FALSE),\"\")","v":""}," ",null,null," ",{"$f":"IFERROR(VLOOKUP($A6,'Журнал Вахта_ИТР'!$AB$4:$AO$1004,12,FALSE),\"\")","v":"Помощник бурильщика ЭиРБС (второй) 6 р."},{"$f":"IFERROR(VLOOKUP($A6,'Журнал Вахта_ИТР'!$AB$4:$AO$1004,13,FALSE),\"\")","v":"Очередная"},{"$f":"IFERROR(VLOOKUP($A6,'Журнал Вахта_ИТР'!$AB$4:$AO$1004,14,FALSE),\"\")","v":"Сдал"}]
[4,{"$f":"IFERROR(VLOOKUP($A7,'Журнал Вахта_ИТР'!$AB$4:$AG$1004,3,FALSE),\"\")","v":""},{"$f":"IFERROR(VLOOKUP($A7,'Журнал Вахта_ИТР'!$AB$4:$AG$1004,4,FALSE),\"\")","v":""},{"$f":"IFERROR(VLOOKUP($A7,'Журнал Вахта_ИТР'!$AB$4:$AG$1004,2,FALSE),\"\")","v":""},{"$f":"IFERROR(VLOOKUP($A7,'Журнал Вахта_ИТР'!$AB$4:$AG$1004,5,FALSE),\"\")","v":""},{"$f":"IFERROR(VLOOKUP($A7,'Журнал Вахта_ИТР'!$AB$4:$AG$1004,6,FALSE),\"\")","v":""}," ",null,null," ",{"$f":"IFERROR(VLOOKUP($A7,'Журнал Вахта_ИТР'!$AB$4:$AO$1004,12,FALSE),\"\")","v":""},{"$f":"IFERROR(VLOOKUP($A7,'Журнал Вахта_ИТР'!$AB$4:$AO$1004,13,FALSE),\"\")","v":""},{"$f":"IFERROR(VLOOKUP($A7,'Журнал Вахта_ИТР'!$AB$4:$AO$1004,14,FALSE),\"\")","v":""}]
[5,{"$f":"IFERROR(VLOOKUP($A8,'Журнал Вахта_ИТР'!$AB$4:$AG$1004,3,FALSE),\"\")","v":""},{"$f":"IFERROR(VLOOKUP($A8,'Журнал Вахта_ИТР'!$AB$4:$AG$1004,4,FALSE),\"\")","v":""},{"$f":"IFERROR(VLOOKUP($A8,'Журнал Вахта_ИТР'!$AB$4:$AG$1004,2,FALSE),\"\")","v":""},{"$f":"IFERROR(VLOOKUP($A8,'Журнал Вахта_ИТР'!$AB$4:$AG$1004,5,FALSE),\"\")","v":""},{"$f":"IFERROR(VLOOKUP($A8,'Журнал Вахта_ИТР'!$AB$4:$AG$1004,6,FALSE),\"\")","v":""}," ",null,null,null,{"$f":"IFERROR(VLOOKUP($A8,'Журнал Вахта_ИТР'!$AB$4:$AO$1004,12,FALSE),\"\")","v":""},{"$f":"IFERROR(VLOOKUP($A8,'Журнал Вахта_ИТР'!$AB$4:$AO$1004,13,FALSE),\"\")","v":""},{"$f":"IFERROR(VLOOKUP($A8,'Журнал Вахта_ИТР'!$AB$4:$AO$1004,14,FALSE),\"\")","v":""}]
[6,{"$f":"IFERROR(VLOOKUP($A9,'Журнал Вахта_ИТР'!$AB$4:$AG$1004,3,FALSE),\"\")","v":""},{"$f":"IFERROR(VLOOKUP($A9,'Журнал Вахта_ИТР'!$AB$4:$AG$1004,4,FALSE),\"\")","v":""},{"$f":"IFERROR(VLOOKUP($A9,'Журнал Вахта_ИТР'!$AB$4:$AG$1004,2,FALSE),\"\")","v":""},{"$f":"IFERROR(VLOOKUP($A9,'Журнал Вахта_ИТР'!$AB$4:$AG$1004,5,FALSE),\"\")","v":""},{"$f":"IFERROR(VLOOKUP($A9,'Журнал Вахта_ИТР'!$AB$4:$AG$1004,6,FALSE),\"\")","v":""}," ",null,null,null,{"$f":"IFERROR(VLOOKUP($A9,'Журнал Вахта_ИТР'!$AB$4:$AO$1004,12,FALSE),\"\")","v":""},{"$f":"IFERROR(VLOOKUP($A9,'Журнал Вахта_ИТР'!$AB$4:$AO$1004,13,FALSE),\"\")","v":""},{"$f":"IFERROR(VLOOKUP($A9,'Журнал Вахта_ИТР'!$AB$4:$AO$1004,14,FALSE),\"\")","v":""}]
[7,{"$f":"IFERROR(VLOOKUP($A10,'Журнал Вахта_ИТР'!$AB$4:$AG$1004,3,FALSE),\"\")","v":""},{"$f":"IFERROR(VLOOKUP($A10,'Журнал Вахта_ИТР'!$AB$4:$AG$1004,4,FALSE),\"\")","v":""},{"$f":"IFERROR(VLOOKUP($A10,'Журнал Вахта_ИТР'!$AB$4:$AG$1004,2,FALSE),\"\")","v":""},{"$f":"IFERROR(VLOOKUP($A10,'Журнал Вахта_ИТР'!$AB$4:$AG$1004,5,FALSE),\"\")","v":""},{"$f":"IFERROR(VLOOKUP($A10,'Журнал Вахта_ИТР'!$AB$4:$AG$1004,6,FALSE),\"\")","v":""}," ",null,null,null,{"$f":"IFERROR(VLOOKUP($A10,'Журнал Вахта_ИТР'!$AB$4:$AO$1004,12,FALSE),\"\")","v":""},{"$f":"IFERROR(VLOOKUP($A10,'Журнал Вахта_ИТР'!$AB$4:$AO$1004,13,FALSE),\"\")","v":""},{"$f":"IFERROR(VLOOKUP($A10,'Журнал Вахта_ИТР'!$AB$4:$AO$1004,14,FALSE),\"\")","v":""}]
[8,{"$f":"IFERROR(VLOOKUP($A11,'Журнал Вахта_ИТР'!$AB$4:$AG$1004,3,FALSE),\"\")","v":""},{"$f":"IFERROR(VLOOKUP($A11,'Журнал Вахта_ИТР'!$AB$4:$AG$1004,4,FALSE),\"\")","v":""},{"$f":"IFERROR(VLOOKUP($A11,'Журнал Вахта_ИТР'!$AB$4:$AG$1004,2,FALSE),\"\")","v":""},{"$f":"IFERROR(VLOOKUP($A11,'Журнал Вахта_ИТР'!$AB$4:$AG$1004,5,FALSE),\"\")","v":""},{"$f":"IFERROR(VLOOKUP($A11,'Журнал Вахта_ИТР'!$AB$4:$AG$1004,6,FALSE),\"\")","v":""}," ",null,null,null,{"$f":"IFERROR(VLOOKUP($A11,'Журнал Вахта_ИТР'!$AB$4:$AO$1004,12,FALSE),\"\")","v":""},{"$f":"IFERROR(VLOOKUP($A11,'Журнал Вахта_ИТР'!$AB$4:$AO$1004,13,FALSE),\"\")","v":""},{"$f":"IFERROR(VLOOKUP($A11,'Журнал Вахта_ИТР'!$AB$4:$AO$1004,14,FALSE),\"\")","v":""}]
[9,{"$f":"IFERROR(VLOOKUP($A12,'Журнал Вахта_ИТР'!$AB$4:$AG$1004,3,FALSE),\"\")","v":""},{"$f":"IFERROR(VLOOKUP($A12,'Журнал Вахта_ИТР'!$AB$4:$AG$1004,4,FALSE),\"\")","v":""},{"$f":"IFERROR(VLOOKUP($A12,'Журнал Вахта_ИТР'!$AB$4:$AG$1004,2,FALSE),\"\")","v":""},{"$f":"IFERROR(VLOOKUP($A12,'Журнал Вахта_ИТР'!$AB$4:$AG$1004,5,FALSE),\"\")","v":""},{"$f":"IFERROR(VLOOKUP($A12,'Журнал Вахта_ИТР'!$AB$4:$AG$1004,6,FALSE),\"\")","v":""}," ",null,null,null,{"$f":"IFERROR(VLOOKUP($A12,'Журнал Вахта_ИТР'!$AB$4:$AO$1004,12,FALSE),\"\")","v":""},{"$f":"IFERROR(VLOOKUP($A12,'Журнал Вахта_ИТР'!$AB$4:$AO$1004,13,FALSE),\"\")","v":""},{"$f":"IFERROR(VLOOKUP($A12,'Журнал Вахта_ИТР'!$AB$4:$AO$1004,14,FALSE),\"\")","v":""}]
[10,{"$f":"IFERROR(VLOOKUP($A13,'Журнал Вахта_ИТР'!$AB$4:$AG$1004,3,FALSE),\"\")","v":""},{"$f":"IFERROR(VLOOKUP($A13,'Журнал Вахта_ИТР'!$AB$4:$AG$1004,4,FALSE),\"\")","v":""},{"$f":"IFERROR(VLOOKUP($A13,'Журнал Вахта_ИТР'!$AB$4:$AG$1004,2,FALSE),\"\")","v":""},{"$f":"IFERROR(VLOOKUP($A13,'Журнал Вахта_ИТР'!$AB$4:$AG$1004,5,FALSE),\"\")","v":""},{"$f":"IFERROR(VLOOKUP($A13,'Журнал Вахта_ИТР'!$AB$4:$AG$1004,6,FALSE),\"\")","v":""}," ",null,null,null,{"$f":"IFERROR(VLOOKUP($A13,'Журнал Вахта_ИТР'!$AB$4:$AO$1004,12,FALSE),\"\")","v":""},{"$f":"IFERROR(VLOOKUP($A13,'Журнал Вахта_ИТР'!$AB$4:$AO$1004,13,FALSE),\"\")","v":""},{"$f":"IFERROR(VLOOKUP($A13,'Журнал Вахта_ИТР'!$AB$4:$AO$1004,14,FALSE),\"\")","v":""}]
[11,{"$f":"IFERROR(VLOOKUP($A14,'Журнал Вахта_ИТР'!$AB$4:$AG$1004,3,FALSE),\"\")","v":""},{"$f":"IFERROR(VLOOKUP($A14,'Журнал Вахта_ИТР'!$AB$4:$AG$1004,4,FALSE),\"\")","v":""},{"$f":"IFERROR(VLOOKUP($A14,'Журнал Вахта_ИТР'!$AB$4:$AG$1004,2,FALSE),\"\")","v":""},{"$f":"IFERROR(VLOOKUP($A14,'Журнал Вахта_ИТР'!$AB$4:$AG$1004,5,FALSE),\"\")","v":""},{"$f":"IFERROR(VLOOKUP($A14,'Журнал Вахта_ИТР'!$AB$4:$AG$1004,6,FALSE),\"\")","v":""}," ",null,null,null,{"$f":"IFERROR(VLOOKUP($A14,'Журнал Вахта_ИТР'!$AB$4:$AO$1004,12,FALSE),\"\")","v":""},{"$f":"IFERROR(VLOOKUP($A14,'Журнал Вахта_ИТР'!$AB$4:$AO$1004,13,FALSE),\"\")","v":""},{"$f":"IFERROR(VLOOKUP($A14,'Журнал Вахта_ИТР'!$AB$4:$AO$1004,14,FALSE),\"\")","v":""}]
[12,{"$f":"IFERROR(VLOOKUP($A15,'Журнал Вахта_ИТР'!$AB$4:$AG$1004,3,FALSE),\"\")","v":""},{"$f":"IFERROR(VLOOKUP($A15,'Журнал Вахта_ИТР'!$AB$4:$AG$1004,4,FALSE),\"\")","v":""},{"$f":"IFERROR(VLOOKUP($A15,'Журнал Вахта_ИТР'!$AB$4:$AG$1004,2,FALSE),\"\")","v":""},{"$f":"IFERROR(VLOOKUP($A15,'Журнал Вахта_ИТР'!$AB$4:$AG$1004,5,FALSE),\"\")","v":""},{"$f":"IFERROR(VLOOKUP($A15,'Журнал Вахта_ИТР'!$AB$4:$AG$1004,6,FALSE),\"\")","v":""},null,null,null,null,{"$f":"IFERROR(VLOOKUP($A15,'Журнал Вахта_ИТР'!$AB$4:$AO$1004,12,FALSE),\"\")","v":""},{"$f":"IFERROR(VLOOKUP($A15,'Журнал Вахта_ИТР'!$AB$4:$AO$1004,13,FALSE),\"\")","v":""},{"$f":"IFERROR(VLOOKUP($A15,'Журнал Вахта_ИТР'!$AB$4:$AO$1004,14,FALSE),\"\")","v":""}]
[13,{"$f":"IFERROR(VLOOKUP($A16,'Журнал Вахта_ИТР'!$AB$4:$AG$1004,3,FALSE),\"\")","v":""},{"$f":"IFERROR(VLOOKUP($A16,'Журнал Вахта_ИТР'!$AB$4:$AG$1004,4,FALSE),\"\")","v":""},{"$f":"IFERROR(VLOOKUP($A16,'Журнал Вахта_ИТР'!$AB$4:$AG$1004,2,FALSE),\"\")","v":""},{"$f":"IFERROR(VLOOKUP($A16,'Журнал Вахта_ИТР'!$AB$4:$AG$1004,5,FALSE),\"\")","v":""},{"$f":"IFERROR(VLOOKUP($A16,'Журнал Вахта_ИТР'!$AB$4:$AG$1004,6,FALSE),\"\")","v":""}," ",null,null,null,{"$f":"IFERROR(VLOOKUP($A16,'Журнал Вахта_ИТР'!$AB$4:$AO$1004,12,FALSE),\"\")","v":""},{"$f":"IFERROR(VLOOKUP($A16,'Журнал Вахта_ИТР'!$AB$4:$AO$1004,13,FALSE),\"\")","v":""},{"$f":"IFERROR(VLOOKUP($A16,'Журнал Вахта_ИТР'!$AB$4:$AO$1004,14,FALSE),\"\")","v":""}]
[14,{"$f":"IFERROR(VLOOKUP($A17,'Журнал Вахта_ИТР'!$AB$4:$AG$1004,3,FALSE),\"\")","v":""},{"$f":"IFERROR(VLOOKUP($A17,'Журнал Вахта_ИТР'!$AB$4:$AG$1004,4,FALSE),\"\")","v":""},{"$f":"IFERROR(VLOOKUP($A17,'Журнал Вахта_ИТР'!$AB$4:$AG$1004,2,FALSE),\"\")","v":""},{"$f":"IFERROR(VLOOKUP($A17,'Журнал Вахта_ИТР'!$AB$4:$AG$1004,5,FALSE),\"\")","v":""},{"$f":"IFERROR(VLOOKUP($A17,'Журнал Вахта_ИТР'!$AB$4:$AG$1004,6,FALSE),\"\")","v":""},null,null,null,null,{"$f":"IFERROR(VLOOKUP($A17,'Журнал Вахта_ИТР'!$AB$4:$AO$1004,12,FALSE),\"\")","v":""},{"$f":"IFERROR(VLOOKUP($A17,'Журнал Вахта_ИТР'!$AB$4:$AO$1004,13,FALSE),\"\")","v":""},{"$f":"IFERROR(VLOOKUP($A17,'Журнал Вахта_ИТР'!$AB$4:$AO$1004,14,FALSE),\"\")","v":""}]
[15,{"$f":"IFERROR(VLOOKUP($A18,'Журнал Вахта_ИТР'!$AB$4:$AG$1004,3,FALSE),\"\")","v":""},{"$f":"IFERROR(VLOOKUP($A18,'Журнал Вахта_ИТР'!$AB$4:$AG$1004,4,FALSE),\"\")","v":""},{"$f":"IFERROR(VLOOKUP($A18,'Журнал Вахта_ИТР'!$AB$4:$AG$1004,2,FALSE),\"\")","v":""},{"$f":"IFERROR(VLOOKUP($A18,'Журнал Вахта_ИТР'!$AB$4:$AG$1004,5,FALSE),\"\")","v":""},{"$f":"IFERROR(VLOOKUP($A18,'Журнал Вахта_ИТР'!$AB$4:$AG$1004,6,FALSE),\"\")","v":""},null,null,null,null,{"$f":"IFERROR(VLOOKUP($A18,'Журнал Вахта_ИТР'!$AB$4:$AO$1004,12,FALSE),\"\")","v":""},{"$f":"IFERROR(VLOOKUP($A18,'Журнал Вахта_ИТР'!$AB$4:$AO$1004,13,FALSE),\"\")","v":""},{"$f":"IFERROR(VLOOKUP($A18,'Журнал Вахта_ИТР'!$AB$4:$AO$1004,14,FALSE),\"\")","v":""}]
[16,{"$f":"IFERROR(VLOOKUP($A19,'Журнал Вахта_ИТР'!$AB$4:$AG$1004,3,FALSE),\"\")","v":""},{"$f":"IFERROR(VLOOKUP($A19,'Журнал Вахта_ИТР'!$AB$4:$AG$1004,4,FALSE),\"\")","v":""},{"$f":"IFERROR(VLOOKUP($A19,'Журнал Вахта_ИТР'!$AB$4:$AG$1004,2,FALSE),\"\")","v":""},{"$f":"IFERROR(VLOOKUP($A19,'Журнал Вахта_ИТР'!$AB$4:$AG$1004,5,FALSE),\"\")","v":""},{"$f":"IFERROR(VLOOKUP($A19,'Журнал Вахта_ИТР'!$AB$4:$AG$1004,6,FALSE),\"\")","v":""},null,null,null,null,{"$f":"IFERROR(VLOOKUP($A19,'Журнал Вахта_ИТР'!$AB$4:$AO$1004,12,FALSE),\"\")","v":""},{"$f":"IFERROR(VLOOKUP($A19,'Журнал Вахта_ИТР'!$AB$4:$AO$1004,13,FALSE),\"\")","v":""},{"$f":"IFERROR(VLOOKUP($A19,'Журнал Вахта_ИТР'!$AB$4:$AO$1004,14,FALSE),\"\")","v":""}]
[]
[{"$f":"IF(B21=\"\",\"\",MAX($A$3:A20)+1)","v":""},null,{"$f":"IF(A21=\"\",\"\",CONCATENATE(IF(A21<10,CONCATENATE(\"00\",A21),IF(A21<100,CONCATENATE(\"00\",A21),A21)),\"-ПП-15\"))","v":""}]
[{"$f":"IF(B22=\"\",\"\",MAX($A$3:A21)+1)","v":""},null,{"$f":"IF(A22=\"\",\"\",CONCATENATE(IF(A22<10,CONCATENATE(\"00\",A22),IF(A22<100,CONCATENATE(\"00\",A22),A22)),\"-ПП-15\"))","v":""}]
[{"$f":"IF(B23=\"\",\"\",MAX($A$3:A22)+1)","v":""},null,""]
[{"$f":"IF(B24=\"\",\"\",MAX($A$3:A23)+1)","v":""},null,""]
[{"$f":"IF(B25=\"\",\"\",MAX($A$3:A24)+1)","v":""},null,""]
[{"$f":"IF(B26=\"\",\"\",MAX($A$3:A25)+1)","v":""},null,""]
[{"$f":"IF(B27=\"\",\"\",MAX($A$3:A26)+1)","v":""},null,""]
[{"$f":"IF(B28=\"\",\"\",MAX($A$3:A27)+1)","v":""},null,""]
[{"$f":"IF(B29=\"\",\"\",MAX($A$3:A28)+1)","v":""},null,""]
[null,null,""]