{"text_format":"1","workbook":"xlsx","n_sheets":5,"sheets":["Вахта+Подменные","ИТР","Высота","Журнал Вахта_ИТР","Дата печать"],"not_rendered":{"charts":0,"images":1,"macros":1,"external_links":0,"defined_names":4,"comments":0,"pivot_tables":0},"unopened":[],"bounds":{"document_bytes":16777216,"sheet_cells":100000,"rows_first":2000,"rows_last":500,"rows_between":2000,"halvings":0,"cell_chars":16384,"cell_head_chars":4096},"cells_cut":0,"cells_raw":0,"read":"whole","date_system":"1900"}

{"sheet":"Вахта+Подменные","index":0,"n_rows":153,"n_cols":36,"rows_kept":153,"cut":false,"hidden":false,"merged":[[3,0,4,0],[5,0,6,0],[7,0,8,0],[9,0,10,0],[4,1,4,2],[6,1,6,2],[10,1,10,2],[12,1,12,2],[3,12,4,12],[5,12,6,12],[3,14,4,14],[5,14,6,14],[8,1,8,2],[3,9,4,9],[5,9,6,9],[65,0,65,35],[66,12,67,12],[61,0,62,0],[61,9,62,9],[55,0,56,0],[55,9,56,9],[51,0,52,0],[51,9,52,9],[40,0,41,0],[40,9,41,9],[7,9,8,9],[7,12,8,12],[7,14,8,14],[9,9,10,9],[9,12,10,12],[9,14,10,14],[11,9,12,9],[11,12,12,12],[21,14,22,14],[22,1,22,2],[44,0,44,35],[45,0,46,0],[45,9,46,9],[45,12,46,12],[45,14,46,14],[46,1,46,2],[47,0,48,0],[40,12,41,12],[40,14,41,14],[41,1,41,2],[42,0,43,0],[42,9,43,9],[42,12,43,12],[42,14,43,14],[27,1,27,2],[43,1,43,2],[13,12,14,12],[13,14,14,14],[15,0,16,0],[15,9,16,9],[15,12,16,12],[15,14,16,14],[16,1,16,2],[11,0,12,0],[13,0,14,0],[14,1,14,2],[17,12,18,12],[2,0,2,35],[32,0,33,0],[32,9,33,9],[32,12,33,12],[32,14,33,14],[33,1,33,2],[28,12,29,12],[28,14,29,14],[29,1,29,2],[30,0,31,0],[30,9,31,9],[30,12,31,12],[30,14,31,14],[31,1,31,2],[24,12,25,12],[24,14,25,14],[25,1,25,2],[26,0,27,0],[26,9,27,9],[26,12,27,12],[11,14,12,14],[13,9,14,9],[26,14,27,14],[17,14,18,14],[18,1,18,2],[34,12,35,12],[34,14,35,14],[35,1,35,2],[36,0,37,0],[36,9,37,9],[36,12,37,12],[36,14,37,14],[37,1,37,2],[23,0,23,35],[34,0,35,0],[34,9,35,9],[28,0,29,0],[28,9,29,9],[24,0,25,0],[24,9,25,9],[17,0,18,0],[17,9,18,9],[21,0,22,0],[21,9,22,9],[21,12,22,12],[19,0,20,0],[19,9,20,9],[51,12,52,12],[51,14,52,14],[52,1,52,2],[53,0,54,0],[53,9,54,9],[53,12,54,12],[53,14,54,14],[54,1,54,2],[47,9,48,9],[47,12,48,12],[47,14,48,14],[48,1,48,2],[49,0,50,0],[49,9,50,9],[49,12,50,12],[49,14,50,14],[50,1,50,2],[61,12,62,12],[61,14,62,14],[62,1,62,2],[63,0,64,0],[63,9,64,9],[63,12,64,12],[63,14,64,14],[64,1,64,2],[55,12,56,12],[55,14,56,14],[56,1,56,2],[57,0,58,0],[57,9,58,9],[57,12,58,12],[57,14,58,14],[58,1,58,2],[68,0,69,0],[68,9,69,9],[68,12,69,12],[68,14,69,14],[69,1,69,2],[66,0,67,0],[66,9,67,9],[70,0,71,0],[70,9,71,9],[82,0,83,0],[82,9,83,9],[82,12,83,12],[82,14,83,14],[83,1,83,2],[74,12,75,12],[74,14,75,14],[75,1,75,2],[76,0,77,0],[76,9,77,9],[76,12,77,12],[76,14,77,14],[77,1,77,2],[78,0,79,0],[78,9,79,9],[74,0,75,0],[74,9,75,9],[80,0,81,0],[80,9,81,9],[80,12,81,12],[80,14,81,14],[81,1,81,2],[78,12,79,12],[78,14,79,14],[84,12,85,12],[84,14,85,14],[85,1,85,2],[86,0,86,35],[87,0,88,0],[87,9,88,9],[87,12,88,12],[87,14,88,14],[88,1,88,2],[84,0,85,0],[84,9,85,9],[93,12,94,12],[93,14,94,14],[94,1,94,2],[95,0,96,0],[95,9,96,9],[95,12,96,12],[95,14,96,14],[96,1,96,2],[89,12,90,12],[89,14,90,14],[90,1,90,2],[91,0,92,0],[91,9,92,9],[91,12,92,12],[91,14,92,14],[92,1,92,2],[93,0,94,0],[93,9,94,9],[89,0,90,0],[89,9,90,9],[102,12,103,12],[102,14,103,14],[103,1,103,2],[104,0,105,0],[104,9,105,9],[104,12,105,12],[104,14,105,14],[105,1,105,2],[97,12,98,12],[97,14,98,14],[98,1,98,2],[99,0,99,35],[100,0,101,0],[100,9,101,9],[100,12,101,12],[100,14,101,14],[101,1,101,2],[102,0,103,0],[102,9,103,9],[97,0,98,0],[97,9,98,9],[106,0,107,0],[106,9,107,9],[106,12,107,12],[106,14,107,14],[107,1,107,2],[108,0,109,0],[108,9,109,9],[108,12,109,12],[108,14,109,14],[109,1,109,2],[110,0,111,0],[110,9,111,9],[110,12,111,12],[110,14,111,14],[111,1,111,2],[112,0,113,0],[112,9,113,9],[112,12,113,12],[112,14,113,14],[113,1,113,2],[114,0,115,0],[114,9,115,9],[114,12,115,12],[114,14,115,14],[115,1,115,2],[116,0,117,0],[116,9,117,9],[116,12,117,12],[116,14,117,14],[117,1,117,2],[118,0,119,0],[118,9,119,9],[118,12,119,12],[118,14,119,14],[119,1,119,2],[120,0,121,0],[120,9,121,9],[120,12,121,12],[120,14,121,14],[121,1,121,2],[122,0,123,0],[122,9,123,9],[122,12,123,12],[122,14,123,14],[123,1,123,2],[124,0,125,0],[124,9,125,9],[124,12,125,12],[124,14,125,14],[125,1,125,2],[126,0,127,0],[126,9,127,9],[126,12,127,12],[126,14,127,14],[127,1,127,2],[128,0,129,0],[128,9,129,9],[128,12,129,12],[128,14,129,14],[129,1,129,2],[130,0,131,0],[130,9,131,9],[130,12,131,12],[130,14,131,14],[131,1,131,2],[132,0,133,0],[132,9,133,9],[132,12,133,12],[132,14,133,14],[133,1,133,2],[134,0,135,0],[134,9,135,9],[134,12,135,12],[134,14,135,14],[135,1,135,2],[136,0,137,0],[136,9,137,9],[136,12,137,12],[136,14,137,14],[137,1,137,2],[138,0,139,0],[138,9,139,9],[138,12,139,12],[138,14,139,14],[139,1,139,2],[140,0,141,0],[140,9,141,9],[140,12,141,12],[140,14,141,14],[141,1,141,2],[142,0,143,0],[142,9,143,9],[142,12,143,12],[142,14,143,14],[143,1,143,2],[144,0,145,0],[144,9,145,9],[144,12,145,12],[144,14,145,14],[145,1,145,2],[146,0,147,0],[146,9,147,9],[146,12,147,12],[146,14,147,14],[147,1,147,2],[148,0,149,0],[148,9,149,9],[148,12,149,12],[148,14,149,14],[149,1,149,2],[150,0,151,0],[150,9,151,9],[150,12,151,12],[150,14,151,14],[151,1,151,2],[152,0,153,0],[152,9,153,9],[152,12,153,12],[152,14,153,14],[153,1,153,2],[79,1,79,2],[70,12,71,12],[70,14,71,14],[71,1,71,2],[72,0,73,0],[72,9,73,9],[72,12,73,12],[72,14,73,14],[19,12,20,12],[19,14,20,14],[20,1,20,2],[38,0,39,0],[38,9,39,9],[38,12,39,12],[38,14,39,14],[39,1,39,2],[59,0,60,0],[59,9,60,9],[59,12,60,12],[59,14,60,14],[60,1,60,2],[73,1,73,2],[66,14,67,14],[67,1,67,2]]}
["П/п №","ФИО","Должность","Осн.\nпрофессия","Смежная профессия (пом.бур 2, водит автом)","ОТ (5 программ)","Работа на высоте (до)","Высота ежегодная проверка знаний","Cтропальщик                                                                                                      ","Разряд","ПС с пола (раз в квартал)","Вышко\nмонтажник","Разряд","Машинист\nАГП","Разряд","Рабочий\nлюльки","Сосуды","Ремонт ГПМ","ГНВП","ПТМ (журнал)","ЭБ","Водительское (маш автокрана/погрузчика)","Маневрирование специализированной техники","Зимнее вождение","Защитное вождение","Ежегодное обучение водителей","НАКС","IWCF","Допуск к  работе КСАД","Анализ ГВС ","H2S ","Курс по первой помощи","ЗМО","ОПО","ЛЭП"]
[0,1,2,3,4,5,6,7,8,9,10,11,12,13,14,15,16,17,18,19,20,21,22,23,24,25,26,27,28,29,30,30,31,32,33,34]
["Вахта №1"]
[1,"Иванов Андрей","Бурильщик ЭиРБС на нефть и газ 8 р","123077",null,"17-044/322-1","2302","2302",3374,4,3374,"12/317",6,529,5,840,null,null,"001570",null,"022/Т322",null,null,null,null,null,null,null,null,null,null,"111-3.20"]
[null,null,null,"2023-06-24",null,"2023-06-24","2024-06-11","2023-06-24","2023-06-24",null,"2022-09-24","2023-07-17",null,"2023-07-17",null,"2023-07-17",null,null,"2023-06-25",null,"2023-06-25",null,null,null,null,null,null,null,null,null,null,"2022-06-02","2022-08-05"]
[2,"Балык Садир","Бурильщик ЭиРБС на нефть и газ 8 р","165205",null,"Т506/103",null,"3747","174-2-17",null,"174-2-17","97-16-01",null,null,null,null,null,null,"001824",null,"39"]
[null,null,null,"2023-06-24",null,"2023-06-24",null,"2022-10-02","2023-06-24",null,"2022-09-24","2022-08-09",null,null,null,null,null,null,"2023-11-26",null,"2022-08-12"]
[3,"Семенов Сын","Помощник бурильщика ЭиРБС (второй) 6 р.","28-3842",null,"Т506/32",null,"4576","88-16-06",null,"88-16-06","97-16-04",null,null,null,null,null,null,"002014",null,"152"]
{"$rows_left_out":146}
{"sheet":"ИТР","index":1,"n_rows":48,"n_cols":26,"rows_kept":48,"cut":false,"hidden":false,"merged":[[35,0,36,0],[36,1,36,2],[37,0,38,0],[38,1,38,2],[27,0,28,0],[28,1,28,2],[29,0,30,0],[30,1,30,2],[33,0,34,0],[34,1,34,2],[41,0,42,0],[42,1,42,2],[39,0,40,0],[40,1,40,2],[17,0,18,0],[18,1,18,2],[19,0,20,0],[20,1,20,2],[31,0,32,0],[32,1,32,2],[21,0,22,0],[22,1,22,2],[23,0,24,0],[24,1,24,2],[25,0,26,0],[26,1,26,2],[13,0,14,0],[14,1,14,2],[15,0,16,0],[16,1,16,2],[9,0,10,0],[10,1,10,2],[11,0,12,0],[12,1,12,2],[5,0,6,0],[6,1,6,2],[7,0,8,0],[8,1,8,2],[2,0,2,35],[3,0,4,0],[4,1,4,2],[43,0,44,0],[44,1,44,2],[45,0,46,0],[46,1,46,2],[47,0,48,0],[48,1,48,2]]}
["П/п №","ФИО","Должность","Работа на высоте 3гр (до)","ЭБ","ОТ (5 программ)","Работа на высоте 2гр (до)","Высота ежегодная проверка знаний","ПТМ","ГНВП","ПБ\nА1","ПБ\nБ2.4, Б2.6 (2.4) ","ПБ\nБ9.31 (9.3)","ПБ\nБ9.32 (9.4)","ПБ\nБ8.23 (8.3)","Водительское удостоверение до","Зимнее вождение","Защитное вождение","Ежегодное обучение водителей","Экология","IWCF","Допуск к  работе КСАД","Анализ ГВС ","H2S "]
[0,1,2,3,4,5,6,7,8,9,10,11,12,13,14,15,16,17,18,19,20,21,22,23,24,25]
["ИТР"]
[74,"Иыфвф Ильропаевич","Мастер буровой","1063","50","591","814","814","6700","001950","Протокол №12-18","Протокол №12-18","Протокол №12-18","Протокол №12-18","Протокол №12-18",null,null,null,null,null,"DL4S-00102811-SA-T45J"]
[null,null,null,"2025-04-10","2023-05-07","2024-02-03","2024-04-02","2022-04-02","2022-12-17","2024-02-04","2023-02-02","2023-02-02","2023-02-02","2023-02-02","2023-02-02",null,null,null,null,null,"2024-03-29"]
[75,"Жфывфывв Анфвыфывй Владимирович","Мастер буровой","3578"]
[null,null,null,"2023-08-28"]
[76,"Кузфывфы Алекспвапимирович","Мастер буровой"]
{"$rows_left_out":41}
{"sheet":"Высота","index":2,"n_rows":97,"n_cols":26,"rows_kept":97,"cut":false,"hidden":false,"merged":[[3,2,3,4],[3,5,3,6],[4,0,4,8],[7,0,7,8],[8,0,8,2],[8,3,8,7],[22,0,22,8],[23,0,25,0],[23,1,25,1],[23,2,25,2],[23,3,25,4],[23,5,25,6],[23,7,25,7],[23,8,25,8],[10,0,10,1],[10,2,10,8],[12,0,12,1],[12,2,12,8],[14,2,14,8],[16,0,16,8],[26,7,27,7],[26,8,27,8],[28,0,29,0],[28,1,29,1],[28,2,29,2],[28,3,29,4],[28,5,29,5],[28,6,29,6],[28,7,29,7],[28,8,29,8],[26,0,27,0],[26,1,27,1],[26,2,27,2],[26,3,27,4],[26,5,27,5],[26,6,27,6],[30,7,31,7],[30,8,31,8],[32,0,33,0],[32,1,33,1],[32,2,33,2],[32,3,33,4],[32,5,33,5],[32,6,33,6],[32,7,33,7],[32,8,33,8],[30,0,31,0],[30,1,31,1],[30,2,31,2],[30,3,31,4],[30,5,31,5],[30,6,31,6],[34,7,35,7],[34,8,35,8],[36,0,37,0],[36,1,37,1],[36,2,37,2],[36,3,37,4],[36,5,37,5],[36,6,37,6],[36,7,37,7],[36,8,37,8],[34,0,35,0],[34,1,35,1],[34,2,35,2],[34,3,35,4],[34,5,35,5],[34,6,35,6],[43,0,43,1],[43,3,43,8],[45,0,45,1],[45,3,45,8],[47,3,47,8],[52,2,52,4],[52,5,52,6],[38,7,39,7],[38,8,39,8],[40,0,41,0],[40,1,41,1],[40,2,41,2],[40,3,41,4],[40,5,41,5],[40,6,41,6],[40,7,41,7],[40,8,41,8],[38,0,39,0],[38,1,39,1],[38,2,39,2],[38,3,39,4],[38,5,39,5],[38,6,39,6],[61,0,61,1],[61,2,61,8],[63,2,63,8],[65,0,65,8],[53,0,53,8],[56,0,56,8],[57,0,57,2],[57,3,57,7],[59,0,59,1],[59,2,59,8],[70,3,70,8],[71,0,71,8],[72,0,74,0],[72,1,74,1],[72,2,74,2],[72,3,74,4],[72,5,74,6],[72,7,74,7],[72,8,74,8],[75,7,76,7],[75,8,76,8],[75,9,76,9],[77,0,78,0],[77,1,78,1],[77,2,78,2],[77,3,78,4],[77,5,78,5],[77,6,78,6],[77,7,78,7],[75,0,76,0],[75,1,76,1],[75,2,76,2],[75,3,76,4],[75,5,76,5],[75,6,76,6],[77,8,78,8],[77,9,78,9],[79,0,80,0],[79,1,80,1],[79,2,80,2],[79,3,80,4],[79,5,80,5],[79,6,80,6],[79,7,80,7],[79,8,80,8],[79,9,80,9],[81,0,82,0],[81,1,82,1],[81,2,82,2],[81,3,82,4],[81,5,82,5],[81,6,82,6],[81,7,82,7],[81,8,82,8],[81,9,82,9],[87,6,88,6],[87,7,88,7],[87,8,88,8],[83,7,84,7],[83,8,84,8],[83,9,84,9],[85,0,86,0],[85,1,86,1],[85,2,86,2],[85,3,86,4],[85,5,86,5],[85,6,86,6],[85,7,86,7],[83,0,84,0],[83,1,84,1],[83,2,84,2],[83,3,84,4],[83,5,84,5],[83,6,84,6],[92,0,92,1],[92,3,92,8],[94,0,94,1],[94,3,94,8],[96,3,96,8],[17,0,17,8],[66,0,66,8],[87,9,88,9],[89,0,90,0],[89,1,90,1],[89,2,90,2],[89,3,90,4],[89,5,90,5],[89,6,90,6],[89,7,90,7],[89,8,90,8],[89,9,90,9],[85,8,86,8],[85,9,86,9],[87,0,88,0],[87,1,88,1],[87,2,88,2],[87,3,88,4],[87,5,88,5]]}
[]
[]
[]
[null,null,"Протокол №",null,null,"T506/081/22"]
["заседания комиссии по проверке знаний работников\nООО «КСА ДОЙТАГ Раша»"]
[null,null,null,null,null,null,"Дата:",{"$f":"IF(VLOOKUP(V10,'Дата печать'!$A$4:$F$15,$V12,FALSE)=0,\"\",VLOOKUP(V11,'Дата печать'!$A$4:$F$15,V13,FALSE))","v":"2022-08-29"}]
[]
["В соответствии с приказом (распоряжением) работодателя (руководителя) организации"]
{"$rows_left_out":90}
{"sheet":"Журнал Вахта_ИТР","index":3,"n_rows":1004,"n_cols":55,"rows_kept":1004,"cut":false,"hidden":false,"merged":[]}
["Т","БУ:","T506",null,null,null,null,null,null,null,null,null,null,null,null,null,null,null,null,null,null,null,null,null,null,null,null,{"$f":"'Дата печать'!F1","v":"2022-08-29"}]
["№ п/п","Дата проведения обучения:","ФИО обучаемого:","Должность:","Осн.\nпрофессия","Смежная профессия (пом.бур 2, водит автом)","ОТ","Работа на высоте (до)","Высота ежегодная проверка знаний","Cтропальщик                                                                                                      ","Разряд","ПС с пола (раз в квартал)","Вышко\nмонтажник","Разряд","Машинист\nАГП","Разряд","Рабочий\nлюльки","Сосуды","Ремонт ГПМ","Удостоверение строп (ДО)","Председатель (должность / ФИО):","Член комиссии 1 (должность / ФИО):","Член комиссии 2 (должность / ФИО):","Вид проверки (очеред,внеочеред)","Результат (сдал / не сдал)"," ",null,"№","ФИО","Дата проведения обучения:","Основная профессия","ФИО обучающего","Организация:","Председатель:","Член комиссии:1","Член комиссии:2","Причина (очеред,внеочеред)","Результат","Должность:","Вид проверки (очеред,внеочеред)","Результат","Смежная профессия (пом.бур 2, водит автом)","ОТ","Работа на высоте (до)","Высота ежегодная проверка знаний","Cтропальщик                                                                                                      ","Разряд","ПС с пола (раз в квартал)","Вышко\nмонтажник","Разряд","Машинист\nАГП","Разряд","Рабочий\nлюльки","Сосуды","Ремонт ГПМ"]
["1",2,4,5,6,7,8,9,10,11,12,13,14,15,16,17,18,19,20,7,9,10,11,12,13," ",null,"1",2,3,4,5,6,7,8,9,10,11,12,13,14,15,16,17,18,19,20,21,22,23,24,25,26,27,28]
[1,null,{"$f":"'Вахта+Подменные'!B4","v":"Иванов Андрей"},{"$f":"'Вахта+Подменные'!C4","v":"Бурильщик ЭиРБС на нефть и газ 8 р"},{"$f":"'Вахта+Подменные'!D4","v":"123077"},{"$f":"'Вахта+Подменные'!E4","v":0},{"$f":"'Вахта+Подменные'!F4","v":"17-044/322-1"},{"$f":"'Вахта+Подменные'!G4","v":"2302"},{"$f":"'Вахта+Подменные'!H4","v":"2302"},{"$f":"'Вахта+Подменные'!I4","v":3374},{"$f":"'Вахта+Подменные'!J4","v":4},{"$f":"'Вахта+Подменные'!K4","v":3374},{"$f":"'Вахта+Подменные'!L4","v":"12/317"},{"$f":"'Вахта+Подменные'!M4","v":6},{"$f":"'Вахта+Подменные'!N4","v":529},{"$f":"'Вахта+Подменные'!O4","v":5},{"$f":"'Вахта+Подменные'!P4","v":840},{"$f":"'Вахта+Подменные'!Q4","v":0},{"$f":"'Вахта+Подменные'!R4","v":0},{"$f":"_xlfn.CONCAT('Журнал Вахта_ИТР'!$C$1)","v":"T506"},null,null,null,"Очередная","Сдал"," ",null,{"$f":"IF(AC4=\"\",\"\",MAX($AB$3:AB3)+1)","v":""},{"$f":"IF(C4=\"\",\"\",IF(B4=$AB$1,C4,\"\"))","v":""},{"$f":"IF(AB4=\"\",\"\",B4)","v":""},{"$f":"IF(AB4=\"\",\"\",E4)","v":""},{"$f":"IF(AB4=\"\",T4,T4)","v":"T506"},{"$f":"IF(AD4=\"\",\"\",#REF!)","v":""},{"$f":"IF(AD4=\"\",\"\",U4)","v":""},{"$f":"IF(AD4=\"\",\"\",V4)","v":""},{"$f":"IF(AD4=\"\",\"\",W4)","v":""},{"$f":"IF(AD4=\"\",\"\",X4)","v":""},{"$f":"IF(AI4=\"\",\"\",Y4)","v":""},{"$f":"IF(AD4=\"\",\"\",D4)","v":""},{"$f":"IF(AD4=\"\",\"\",X4)","v":""},{"$f":"IF(AD4=\"\",\"\",Y4)","v":""},{"$f":"IF(AD4=\"\",\"\",F4)","v":""},{"$f":"IF(AE4=\"\",\"\",G4)","v":""},{"$f":"IF(AD4=\"\",\"\",H4)","v":""},{"$f":"IF(AD4=\"\",\"\",I4)","v":""},"","","","","","","","","",""]
[2,"2022-08-29",{"$f":"'Вахта+Подменные'!B6","v":"Балык Садир"},{"$f":"'Вахта+Подменные'!C6","v":"Бурильщик ЭиРБС на нефть и газ 8 р"},{"$f":"'Вахта+Подменные'!D6","v":"165205"},{"$f":"'Вахта+Подменные'!E6","v":0},{"$f":"'Вахта+Подменные'!F6","v":"Т506/103"},{"$f":"'Вахта+Подменные'!G6","v":0},{"$f":"'Вахта+Подменные'!H6","v":"3747"},{"$f":"'Вахта+Подменные'!I6","v":"174-2-17"},{"$f":"'Вахта+Подменные'!J6","v":0},{"$f":"'Вахта+Подменные'!K6","v":"174-2-17"},{"$f":"'Вахта+Подменные'!L6","v":"97-16-01"},{"$f":"'Вахта+Подменные'!M6","v":0},{"$f":"'Вахта+Подменные'!N6","v":0},{"$f":"'Вахта+Подменные'!O6","v":0},{"$f":"'Вахта+Подменные'!P6","v":0},{"$f":"'Вахта+Подменные'!Q6","v":0},{"$f":"'Вахта+Подменные'!R6","v":0},{"$f":"_xlfn.CONCAT('Журнал Вахта_ИТР'!$C$1)","v":"T506"},"Руководитель проекта Ккококр С.Н.","Мастер буровой Кываыв Р.Р.","Специалист по ОТ и ПБ Ааываывав В.В.","Очередная","Сдал"," ",null,{"$f":"IF(AC5=\"\",\"\",MAX($AB$3:AB4)+1)","v":1},{"$f":"IF(C5=\"\",\"\",IF(B5=$AB$1,C5,\"\"))","v":"Балык Садир"},{"$f":"IF(AB5=\"\",\"\",B5)","v":"2022-08-29"},{"$f":"IF(AB5=\"\",\"\",E5)","v":"165205"},{"$f":"IF(AB5=\"\",T5,T5)","v":"T506"},{"$f":"IF(AD5=\"\",\"\",#REF!)","v":{"$error":"#REF!"}},{"$f":"IF(AD5=\"\",\"\",U5)","v":"Руководитель проекта Ккококр С.Н."},{"$f":"IF(AD5=\"\",\"\",V5)","v":"Мастер буровой Кываыв Р.Р."},{"$f":"IF(AD5=\"\",\"\",W5)","v":"Специалист по ОТ и ПБ Ааываывав В.В."},{"$f":"IF(AD5=\"\",\"\",X5)","v":"Очередная"},{"$f":"IF(AI5=\"\",\"\",Y5)","v":"Сдал"},{"$f":"IF(AD5=\"\",\"\",D5)","v":"Бурильщик ЭиРБС на нефть и газ 8 р"},{"$f":"IF(AD5=\"\",\"\",X5)","v":"Очередная"},{"$f":"IF(AD5=\"\",\"\",Y5)","v":"Сдал"},{"$f":"IF(AD5=\"\",\"\",F5)","v":0},{"$f":"IF(AE5=\"\",\"\",G5)","v":"Т506/103"},{"$f":"IF(AD5=\"\",\"\",H5)","v":0},{"$f":"IF(AD5=\"\",\"\",I5)","v":"3747"},{"$f":"IF(AH5=\"\",\"\",J5)","v":"174-2-17"},{"$f":"IF(AI5=\"\",\"\",K5)","v":0},{"$f":"IF(AJ5=\"\",\"\",L5)","v":"174-2-17"},{"$f":"IF(AK5=\"\",\"\",M5)","v":"97-16-01"},{"$f":"IF(AL5=\"\",\"\",N5)","v":0},{"$f":"IF(AM5=\"\",\"\",O5)","v":0},{"$f":"IF(AN5=\"\",\"\",P5)","v":0},{"$f":"IF(AO5=\"\",\"\",Q5)","v":0},{"$f":"IF(AP5=\"\",\"\",R5)","v":0},{"$f":"IF(AQ5=\"\",\"\",S5)","v":0}]
[3,"2022-08-29",{"$f":"'Вахта+Подменные'!B8","v":"Семенов Сын"},{"$f":"'Вахта+Подменные'!C8","v":"Помощник бурильщика ЭиРБС (второй) 6 р."},{"$f":"'Вахта+Подменные'!D8","v":"28-3842"},{"$f":"'Вахта+Подменные'!E8","v":0},{"$f":"'Вахта+Подменные'!F8","v":"Т506/32"},{"$f":"'Вахта+Подменные'!G8","v":0},{"$f":"'Вахта+Подменные'!H8","v":"4576"},{"$f":"'Вахта+Подменные'!I8","v":"88-16-06"},{"$f":"'Вахта+Подменные'!J8","v":0},{"$f":"'Вахта+Подменные'!K8","v":"88-16-06"},{"$f":"'Вахта+Подменные'!L8","v":"97-16-04"},{"$f":"'Вахта+Подменные'!M8","v":0},{"$f":"'Вахта+Подменные'!N8","v":0},{"$f":"'Вахта+Подменные'!O8","v":0},{"$f":"'Вахта+Подменные'!P8","v":0},{"$f":"'Вахта+Подменные'!Q8","v":0},{"$f":"'Вахта+Подменные'!R8","v":0},{"$f":"_xlfn.CONCAT('Журнал Вахта_ИТР'!$C$1)","v":"T506"},null,null,null,"Очередная","Сдал"," ",null,{"$f":"IF(AC6=\"\",\"\",MAX($AB$3:AB5)+1)","v":2},"Семенов Сын","2022-08-29","28-3842","T506",{"$f":"IF(AD6=\"\",\"\",#REF!)","v":{"$error":"#REF!"}},0,0,0,"Очередная","Сдал","Помощник бурильщика ЭиРБС (второй) 6 р.","Очередная","Сдал",0,"Т506/32",0,"4576","88-16-06",0,"88-16-06","97-16-04",0,0,0,0,0,0]
[4,null,{"$f":"'Вахта+Подменные'!B10","v":"Топай Отсюда"},{"$f":"'Вахта+Подменные'!C10","v":"Помощник бурильщика ЭиРБС (первый) 6 р."},{"$f":"'Вахта+Подменные'!D10","v":"1257"},{"$f":"'Вахта+Подменные'!E10","v":0},{"$f":"'Вахта+Подменные'!F10","v":"62-19-05"},{"$f":"'Вахта+Подменные'!G10","v":0},{"$f":"'Вахта+Подменные'!H10","v":"3285"},{"$f":"'Вахта+Подменные'!I10","v":"1844"},{"$f":"'Вахта+Подменные'!J10","v":0},{"$f":"'Вахта+Подменные'!K10","v":"1844"},{"$f":"'Вахта+Подменные'!L10","v":0},{"$f":"'Вахта+Подменные'!M10","v":0},{"$f":"'Вахта+Подменные'!N10","v":0},{"$f":"'Вахта+Подменные'!O10","v":0},{"$f":"'Вахта+Подменные'!P10","v":0},{"$f":"'Вахта+Подменные'!Q10","v":0},{"$f":"'Вахта+Подменные'!R10","v":0},{"$f":"_xlfn.CONCAT('Журнал Вахта_ИТР'!$C$1)","v":"T506"},null,null,null,"Очередная","Сдал"," ",null,{"$f":"IF(AC7=\"\",\"\",MAX($AB$3:AB6)+1)","v":""},"","","","T506",{"$f":"IF(AD7=\"\",\"\",#REF!)","v":""},"","","","","","","","","","","","","","","","","","","","","",""]
[5,null,{"$f":"'Вахта+Подменные'!B12","v":"Глучше завтра"},{"$f":"'Вахта+Подменные'!C12","v":"Помощник бурильщика ЭиРБС (первый) 6 р."},{"$f":"'Вахта+Подменные'!D12","v":" 52-17-01"},{"$f":"'Вахта+Подменные'!E12","v":0},{"$f":"'Вахта+Подменные'!F12","v":"Т506/31"},{"$f":"'Вахта+Подменные'!G12","v":0},{"$f":"'Вахта+Подменные'!H12","v":"4577"},{"$f":"'Вахта+Подменные'!I12","v":"81-17-10"},{"$f":"'Вахта+Подменные'!J12","v":0},{"$f":"'Вахта+Подменные'!K12","v":"81-17-10"},{"$f":"'Вахта+Подменные'!L12","v":"ПРП-25-15-0178"},{"$f":"'Вахта+Подменные'!M12","v":0},{"$f":"'Вахта+Подменные'!N12","v":0},{"$f":"'Вахта+Подменные'!O12","v":0},{"$f":"'Вахта+Подменные'!P12","v":0},{"$f":"'Вахта+Подменные'!Q12","v":0},{"$f":"'Вахта+Подменные'!R12","v":0},{"$f":"_xlfn.CONCAT('Журнал Вахта_ИТР'!$C$1)","v":"T506"},null,null,null,"Очередная","Сдал"," ",null,{"$f":"IF(AC8=\"\",\"\",MAX($AB$3:AB7)+1)","v":""},"","","","T506",{"$f":"IF(AD8=\"\",\"\",#REF!)","v":""},"","","","","","","","","","","","","","","","","","","","","",""]
{"$rows_left_out":997}
{"sheet":"Дата печать","index":4,"n_rows":30,"n_cols":13,"rows_kept":30,"cut":false,"hidden":false,"merged":[]}
["02-Печать данных",null,null,null,"Дата обучения:","2022-08-29"," "," "," "," "]
["№ п/п","Дата проведения обучения:","№ удостоверения:","ФИО обучаемого:",null,null,null," "," "," ","Должность:","Вид проверки (очеред,внеочеред)","Результат"]
["1",2,3,4,null,null,null,null,null," ",12,13,14]
[1,{"$f":"IFERROR(VLOOKUP($A4,'Журнал Вахта_ИТР'!$AB$4:$AG$1004,3,FALSE),\"\")","v":"2022-08-29"},{"$f":"IFERROR(VLOOKUP($A4,'Журнал Вахта_ИТР'!$AB$4:$AG$1004,4,FALSE),\"\")","v":"165205"},{"$f":"IFERROR(VLOOKUP($A4,'Журнал Вахта_ИТР'!$AB$4:$AG$1004,2,FALSE),\"\")","v":"Балык Садир"},{"$f":"IFERROR(VLOOKUP($A4,'Журнал Вахта_ИТР'!$AB$4:$AG$1004,5,FALSE),\"\")","v":"T506"},{"$f":"IFERROR(VLOOKUP($A4,'Журнал Вахта_ИТР'!$AB$4:$AG$1004,6,FALSE),\"\")","v":""},null,null,null," ",{"$f":"IFERROR(VLOOKUP($A4,'Журнал Вахта_ИТР'!$AB$4:$AO$1004,12,FALSE),\"\")","v":"Бурильщик ЭиРБС на нефть и газ 8 р"},{"$f":"IFERROR(VLOOKUP($A4,'Журнал Вахта_ИТР'!$AB$4:$AO$1004,13,FALSE),\"\")","v":"Очередная"},{"$f":"IFERROR(VLOOKUP($A4,'Журнал Вахта_ИТР'!$AB$4:$AO$1004,14,FALSE),\"\")","v":"Сдал"}]
[2,{"$f":"IFERROR(VLOOKUP($A5,'Журнал Вахта_ИТР'!$AB$4:$AG$1004,3,FALSE),\"\")","v":"2022-08-29"},{"$f":"IFERROR(VLOOKUP($A5,'Журнал Вахта_ИТР'!$AB$4:$AG$1004,4,FALSE),\"\")","v":"28-3842"},{"$f":"IFERROR(VLOOKUP($A5,'Журнал Вахта_ИТР'!$AB$4:$AG$1004,2,FALSE),\"\")","v":"Семенов Сын"},{"$f":"IFERROR(VLOOKUP($A5,'Журнал Вахта_ИТР'!$AB$4:$AG$1004,5,FALSE),\"\")","v":"T506"},{"$f":"IFERROR(VLOOKUP($A5,'Журнал Вахта_ИТР'!$AB$4:$AG$1004,6,FALSE),\"\")","v":""}," ",null,null," ",{"$f":"IFERROR(VLOOKUP($A5,'Журнал Вахта_ИТР'!$AB$4:$AO$1004,12,FALSE),\"\")","v":"Помощник бурильщика ЭиРБС (второй) 6 р."},{"$f":"IFERROR(VLOOKUP($A5,'Журнал Вахта_ИТР'!$AB$4:$AO$1004,13,FALSE),\"\")","v":"Очередная"},{"$f":"IFERROR(VLOOKUP($A5,'Журнал Вахта_ИТР'!$AB$4:$AO$1004,14,FALSE),\"\")","v":"Сдал"}]
[3,{"$f":"IFERROR(VLOOKUP($A6,'Журнал Вахта_ИТР'!$AB$4:$AG$1004,3,FALSE),\"\")","v":"2022-08-29"},{"$f":"IFERROR(VLOOKUP($A6,'Журнал Вахта_ИТР'!$AB$4:$AG$1004,4,FALSE),\"\")","v":"29100"},{"$f":"IFERROR(VLOOKUP($A6,'Журнал Вахта_ИТР'!$AB$4:$AG$1004,2,FALSE),\"\")","v":"Коношанов Торган"},{"$f":"IFERROR(VLOOKUP($A6,'Журнал Вахта_ИТР'!$AB$4:$AG$1004,5,FALSE),\"\")","v":"T506"},{"$f":"IFERROR(VLOOKUP($A6,'Журнал Вахта_ИТР'!$AB$4:$AG$1004,6,FALSE),\"\")","v":""}," ",null,null," ",{"$f":"IFERROR(VLOOKUP($A6,'Журнал Вахта_ИТР'!$AB$4:$AO$1004,12,FALSE),\"\")","v":"Помощник бурильщика ЭиРБС (второй) 6 р."},{"$f":"IFERROR(VLOOKUP($A6,'Журнал Вахта_ИТР'!$AB$4:$AO$1004,13,FALSE),\"\")","v":"Очередная"},{"$f":"IFERROR(VLOOKUP($A6,'Журнал Вахта_ИТР'!$AB$4:$AO$1004,14,FALSE),\"\")","v":"Сдал"}]
[4,{"$f":"IFERROR(VLOOKUP($A7,'Журнал Вахта_ИТР'!$AB$4:$AG$1004,3,FALSE),\"\")","v":""},{"$f":"IFERROR(VLOOKUP($A7,'Журнал Вахта_ИТР'!$AB$4:$AG$1004,4,FALSE),\"\")","v":""},{"$f":"IFERROR(VLOOKUP($A7,'Журнал Вахта_ИТР'!$AB$4:$AG$1004,2,FALSE),\"\")","v":""},{"$f":"IFERROR(VLOOKUP($A7,'Журнал Вахта_ИТР'!$AB$4:$AG$1004,5,FALSE),\"\")","v":""},{"$f":"IFERROR(VLOOKUP($A7,'Журнал Вахта_ИТР'!$AB$4:$AG$1004,6,FALSE),\"\")","v":""}," ",null,null," ",{"$f":"IFERROR(VLOOKUP($A7,'Журнал Вахта_ИТР'!$AB$4:$AO$1004,12,FALSE),\"\")","v":""},{"$f":"IFERROR(VLOOKUP($A7,'Журнал Вахта_ИТР'!$AB$4:$AO$1004,13,FALSE),\"\")","v":""},{"$f":"IFERROR(VLOOKUP($A7,'Журнал Вахта_ИТР'!$AB$4:$AO$1004,14,FALSE),\"\")","v":""}]
[5,{"$f":"IFERROR(VLOOKUP($A8,'Журнал Вахта_ИТР'!$AB$4:$AG$1004,3,FALSE),\"\")","v":""},{"$f":"IFERROR(VLOOKUP($A8,'Журнал Вахта_ИТР'!$AB$4:$AG$1004,4,FALSE),\"\")","v":""},{"$f":"IFERROR(VLOOKUP($A8,'Журнал Вахта_ИТР'!$AB$4:$AG$1004,2,FALSE),\"\")","v":""},{"$f":"IFERROR(VLOOKUP($A8,'Журнал Вахта_ИТР'!$AB$4:$AG$1004,5,FALSE),\"\")","v":""},{"$f":"IFERROR(VLOOKUP($A8,'Журнал Вахта_ИТР'!$AB$4:$AG$1004,6,FALSE),\"\")","v":""}," ",null,null,null,{"$f":"IFERROR(VLOOKUP($A8,'Журнал Вахта_ИТР'!$AB$4:$AO$1004,12,FALSE),\"\")","v":""},{"$f":"IFERROR(VLOOKUP($A8,'Журнал Вахта_ИТР'!$AB$4:$AO$1004,13,FALSE),\"\")","v":""},{"$f":"IFERROR(VLOOKUP($A8,'Журнал Вахта_ИТР'!$AB$4:$AO$1004,14,FALSE),\"\")","v":""}]
{"$rows_left_out":22}