{"text_format":"1","workbook":"xlsx","n_sheets":6,"sheets":["Состав блюд","Перечень блюд","Приход","Выгрузка из прих.накл.","Расход","Выгрузка из кальк.карт"],"not_rendered":{"charts":0,"images":0,"macros":1,"external_links":0,"defined_names":6,"comments":0,"pivot_tables":0},"unopened":[],"bounds":{"document_bytes":16777216,"sheet_cells":100000,"rows_first":2000,"rows_last":500,"rows_between":2000,"halvings":0,"cell_chars":16384,"cell_head_chars":4096},"cells_cut":0,"cells_raw":0,"read":"whole","date_system":"1900"}

{"sheet":"Состав блюд","index":0,"n_rows":269,"n_cols":32,"rows_kept":269,"cut":false,"hidden":false,"merged":[]}
["Первые блюда",null,null,null,null,null,"Вторые блюда",null,null,null,null,null,"Гарниры",null,null,null,null,null,"Салаты",null,null,null,null,null,"Напитки"]
["Борщ украинский",null,null,{"$f":"COUNTIF(A$2:A3,\"№\")","v":1},null,null,"Котлета по-киевски",null,null,{"$f":"COUNTIF(G$2:G3,\"№\")","v":1},null,null,"Рис отварной",null,null,{"$f":"COUNTIF(M$2:M3,\"№\")","v":1},null,null,"Салат \"Оливье\"",null,null,{"$f":"COUNTIF(S$2:S3,\"№\")","v":1},null,null,"Чай",null,null,{"$f":"COUNTIF(Y$2:Y3,\"№\")","v":1}]
["№","Наименование продукта","Норма, г",{"$f":"COUNTIF(A$2:A4,\"№\")","v":1},null,null,"№","Наименование продукта","Норма, г",{"$f":"COUNTIF(G$2:G4,\"№\")","v":1},null,null,"№","Наименование продукта","Норма, г",{"$f":"COUNTIF(M$2:M4,\"№\")","v":1},null,null,"№","Наименование продукта","Норма, г",{"$f":"COUNTIF(S$2:S4,\"№\")","v":1},null,null,"№","Наименование продукта","Норма, г",{"$f":"COUNTIF(Y$2:Y4,\"№\")","v":1},null,null,null,"Наименование продукта"]
[1,"Свекла",40,{"$f":"COUNTIF(A$2:A5,\"№\")","v":1},{"$f":"IF(COUNTIF(#REF!,'Состав блюд'!$A$2),SUMIF(#REF!,'Состав блюд'!$A$2,#REF!)*SUMIF(#REF!,'Состав блюд'!$A$2,#REF!)*'Состав блюд'!C4,0)/1000","v":{"$error":"#REF!"}},null,1,"Курица",40,{"$f":"COUNTIF(G$2:G5,\"№\")","v":1},{"$f":"IF(COUNTIF(#REF!,'Состав блюд'!$G$2),SUMIF(#REF!,'Состав блюд'!$G$2,#REF!)*SUMIF(#REF!,'Состав блюд'!$G$2,#REF!)*'Состав блюд'!I4,0)/1000","v":{"$error":"#REF!"}},null,1,"Рис",40,{"$f":"COUNTIF(M$2:M5,\"№\")","v":1},{"$f":"IF(COUNTIF(#REF!,'Состав блюд'!$M$2),SUMIF(#REF!,'Состав блюд'!$M$2,#REF!)*SUMIF(#REF!,'Состав блюд'!$M$2,#REF!)*'Состав блюд'!O4,0)/1000","v":{"$error":"#REF!"}},null,1,"Колбаса \"Докторская\"",40,{"$f":"COUNTIF(S$2:S5,\"№\")","v":1},{"$f":"IF(COUNTIF(#REF!,'Состав блюд'!$S$2),SUMIF(#REF!,'Состав блюд'!$S$2,#REF!)*SUMIF(#REF!,'Состав блюд'!$S$2,#REF!)*'Состав блюд'!U4,0)/1000","v":{"$error":"#REF!"}},null,1,"Чай",40,{"$f":"COUNTIF(Y$2:Y5,\"№\")","v":1},{"$f":"IF(COUNTIF(#REF!,'Состав блюд'!$Y$2),SUMIF(#REF!,'Состав блюд'!$Y$2,#REF!)*SUMIF(#REF!,'Состав блюд'!$Y$2,#REF!)*'Состав блюд'!AA4,0)/1000","v":{"$error":"#REF!"}},null,null,"Говядина"]
[2,"Свинина",10,{"$f":"COUNTIF(A$2:A6,\"№\")","v":1},{"$f":"IF(COUNTIF(#REF!,'Состав блюд'!$A$2),SUMIF(#REF!,'Состав блюд'!$A$2,#REF!)*SUMIF(#REF!,'Состав блюд'!$A$2,#REF!)*'Состав блюд'!C5,0)/1000","v":{"$error":"#REF!"}},null,2,"Сыр",10,{"$f":"COUNTIF(G$2:G6,\"№\")","v":1},{"$f":"IF(COUNTIF(#REF!,'Состав блюд'!$G$2),SUMIF(#REF!,'Состав блюд'!$G$2,#REF!)*SUMIF(#REF!,'Состав блюд'!$G$2,#REF!)*'Состав блюд'!I5,0)/1000","v":{"$error":"#REF!"}},null,2,"Соль",10,{"$f":"COUNTIF(M$2:M6,\"№\")","v":1},{"$f":"IF(COUNTIF(#REF!,'Состав блюд'!$M$2),SUMIF(#REF!,'Состав блюд'!$M$2,#REF!)*SUMIF(#REF!,'Состав блюд'!$M$2,#REF!)*'Состав блюд'!O5,0)/1000","v":{"$error":"#REF!"}},null,2,"Картофель",10,{"$f":"COUNTIF(S$2:S6,\"№\")","v":1},{"$f":"IF(COUNTIF(#REF!,'Состав блюд'!$S$2),SUMIF(#REF!,'Состав блюд'!$S$2,#REF!)*SUMIF(#REF!,'Состав блюд'!$S$2,#REF!)*'Состав блюд'!U5,0)/1000","v":{"$error":"#REF!"}},null,2,"Сахар",10,{"$f":"COUNTIF(Y$2:Y6,\"№\")","v":1},{"$f":"IF(COUNTIF(#REF!,'Состав блюд'!$Y$2),SUMIF(#REF!,'Состав блюд'!$Y$2,#REF!)*SUMIF(#REF!,'Состав блюд'!$Y$2,#REF!)*'Состав блюд'!AA5,0)/1000","v":{"$error":"#REF!"}},null,null,"Гречка"]
[3,"Соль",30,{"$f":"COUNTIF(A$2:A7,\"№\")","v":1},{"$f":"IF(COUNTIF(#REF!,'Состав блюд'!$A$2),SUMIF(#REF!,'Состав блюд'!$A$2,#REF!)*SUMIF(#REF!,'Состав блюд'!$A$2,#REF!)*'Состав блюд'!C6,0)/1000","v":{"$error":"#REF!"}},null,3,"Томатная паста",30,{"$f":"COUNTIF(G$2:G7,\"№\")","v":1},{"$f":"IF(COUNTIF(#REF!,'Состав блюд'!$G$2),SUMIF(#REF!,'Состав блюд'!$G$2,#REF!)*SUMIF(#REF!,'Состав блюд'!$G$2,#REF!)*'Состав блюд'!I6,0)/1000","v":{"$error":"#REF!"}},null,3,"Масло сливочное",30,{"$f":"COUNTIF(M$2:M7,\"№\")","v":1},{"$f":"IF(COUNTIF(#REF!,'Состав блюд'!$M$2),SUMIF(#REF!,'Состав блюд'!$M$2,#REF!)*SUMIF(#REF!,'Состав блюд'!$M$2,#REF!)*'Состав блюд'!O6,0)/1000","v":{"$error":"#REF!"}},null,3,"Морковь",30,{"$f":"COUNTIF(S$2:S7,\"№\")","v":1},{"$f":"IF(COUNTIF(#REF!,'Состав блюд'!$S$2),SUMIF(#REF!,'Состав блюд'!$S$2,#REF!)*SUMIF(#REF!,'Состав блюд'!$S$2,#REF!)*'Состав блюд'!U6,0)/1000","v":{"$error":"#REF!"}},null,3,null,null,{"$f":"COUNTIF(Y$2:Y7,\"№\")","v":1},{"$f":"IF(COUNTIF(#REF!,'Состав блюд'!$Y$2),SUMIF(#REF!,'Состав блюд'!$Y$2,#REF!)*SUMIF(#REF!,'Состав блюд'!$Y$2,#REF!)*'Состав блюд'!AA6,0)/1000","v":{"$error":"#REF!"}},null,null,"Какао в порошке"]
{"$rows_left_out":264}
{"sheet":"Перечень блюд","index":1,"n_rows":97,"n_cols":15,"rows_kept":97,"cut":false,"hidden":false,"merged":[]}
["№","Первые блюда",null,"№","Вторые блюда",null,"№","Гарниры",null,"№","Салаты",null,"№","Напитки"]
[1,{"$f":"IFERROR(INDEX('Состав блюд'!A:A,MATCH(A2,'Состав блюд'!D:D,)),\"\")","v":"Борщ украинский"},null,1,{"$f":"IFERROR(INDEX('Состав блюд'!G:G,MATCH(D2,'Состав блюд'!J:J,)),\"\")","v":"Котлета по-киевски"},null,1,{"$f":"IFERROR(INDEX('Состав блюд'!M:M,MATCH(G2,'Состав блюд'!P:P,)),\"\")","v":"Рис отварной"},null,1,{"$f":"IFERROR(INDEX('Состав блюд'!S:S,MATCH(J2,'Состав блюд'!V:V,)),\"\")","v":"Салат \"Оливье\""},null,1,{"$f":"IFERROR(INDEX('Состав блюд'!Y:Y,MATCH(M2,'Состав блюд'!AB:AB,)),\"\")","v":"Чай"}]
[2,{"$f":"IFERROR(INDEX('Состав блюд'!A:A,MATCH(A3,'Состав блюд'!D:D,)),\"\")","v":"Щи"},null,2,{"$f":"IFERROR(INDEX('Состав блюд'!G:G,MATCH(D3,'Состав блюд'!J:J,)),\"\")","v":"Жаркое по-домашнему"},null,2,{"$f":"IFERROR(INDEX('Состав блюд'!M:M,MATCH(G3,'Состав блюд'!P:P,)),\"\")","v":"Гречка отварная"},null,2,{"$f":"IFERROR(INDEX('Состав блюд'!S:S,MATCH(J3,'Состав блюд'!V:V,)),\"\")","v":"Салат \"Капустный\""},null,2,{"$f":"IFERROR(INDEX('Состав блюд'!Y:Y,MATCH(M3,'Состав блюд'!AB:AB,)),\"\")","v":"Какао"}]
[3,{"$f":"IFERROR(INDEX('Состав блюд'!A:A,MATCH(A4,'Состав блюд'!D:D,)),\"\")","v":"Суп вермишелевый"},null,3,{"$f":"IFERROR(INDEX('Состав блюд'!G:G,MATCH(D4,'Состав блюд'!J:J,)),\"\")","v":"Азу с рисом"},null,3,{"$f":"IFERROR(INDEX('Состав блюд'!M:M,MATCH(G4,'Состав блюд'!P:P,)),\"\")","v":"Пюре картофельное"},null,3,{"$f":"IFERROR(INDEX('Состав блюд'!S:S,MATCH(J4,'Состав блюд'!V:V,)),\"\")","v":"Салат \"Мимоза\""},null,3,{"$f":"IFERROR(INDEX('Состав блюд'!Y:Y,MATCH(M4,'Состав блюд'!AB:AB,)),\"\")","v":"Компот из яблок"}]
[4,{"$f":"IFERROR(INDEX('Состав блюд'!A:A,MATCH(A5,'Состав блюд'!D:D,)),\"\")","v":"Суп фасолевый"},null,4,{"$f":"IFERROR(INDEX('Состав блюд'!G:G,MATCH(D5,'Состав блюд'!J:J,)),\"\")","v":"Гречка по-купечески"},null,4,{"$f":"IFERROR(INDEX('Состав блюд'!M:M,MATCH(G5,'Состав блюд'!P:P,)),\"\")","v":"Картофель жареный"},null,4,{"$f":"IFERROR(INDEX('Состав блюд'!S:S,MATCH(J5,'Состав блюд'!V:V,)),\"\")","v":"Салат \"Крабовый\""},null,4,{"$f":"IFERROR(INDEX('Состав блюд'!Y:Y,MATCH(M5,'Состав блюд'!AB:AB,)),\"\")","v":"Компот из сухофруктов"}]
[5,{"$f":"IFERROR(INDEX('Состав блюд'!A:A,MATCH(A6,'Состав блюд'!D:D,)),\"\")","v":0},null,5,{"$f":"IFERROR(INDEX('Состав блюд'!G:G,MATCH(D6,'Состав блюд'!J:J,)),\"\")","v":0},null,5,{"$f":"IFERROR(INDEX('Состав блюд'!M:M,MATCH(G6,'Состав блюд'!P:P,)),\"\")","v":0},null,5,{"$f":"IFERROR(INDEX('Состав блюд'!S:S,MATCH(J6,'Состав блюд'!V:V,)),\"\")","v":0},null,5,{"$f":"IFERROR(INDEX('Состав блюд'!Y:Y,MATCH(M6,'Состав блюд'!AB:AB,)),\"\")","v":0}]
{"$rows_left_out":92}
{"sheet":"Приход","index":2,"n_rows":59,"n_cols":28,"rows_kept":59,"cut":false,"hidden":false,"merged":[[35,15,35,19],[36,15,36,19],[37,15,37,19],[38,15,38,19],[39,15,39,19],[40,15,40,19],[47,15,47,19],[48,15,48,19],[49,15,49,19],[41,15,41,19],[42,15,42,19],[43,15,43,19],[44,15,44,19],[45,15,45,19],[46,15,46,19],[43,22,43,23],[44,22,44,23],[45,22,45,23],[46,22,46,23],[47,22,47,23],[48,22,48,23],[37,22,37,23],[38,22,38,23],[39,22,39,23],[40,22,40,23],[41,22,41,23],[42,22,42,23],[41,20,41,21],[48,20,48,21],[49,20,49,21],[29,22,29,23],[30,22,30,23],[31,22,31,23],[32,22,32,23],[33,22,33,23],[34,22,34,23],[35,22,35,23],[36,22,36,23],[42,20,42,21],[43,20,43,21],[44,20,44,21],[45,20,45,21],[46,20,46,21],[47,20,47,21],[35,20,35,21],[36,20,36,21],[37,20,37,21],[38,20,38,21],[39,20,39,21],[40,20,40,21],[29,20,29,21],[47,6,47,12],[48,6,48,12],[39,13,39,14],[40,13,40,14],[41,13,41,14],[42,13,42,14],[43,13,43,14],[44,13,44,14],[39,6,39,12],[40,6,40,12],[29,6,29,12],[30,6,30,12],[31,6,31,12],[32,6,32,12],[33,6,33,12],[34,6,34,12],[31,20,31,21],[32,20,32,21],[33,20,33,21],[34,20,34,21],[30,20,30,21],[29,15,29,19],[30,15,30,19],[31,15,31,19],[32,15,32,19],[33,15,33,19],[29,13,29,14],[30,13,30,14],[31,13,31,14],[32,13,32,14],[33,13,33,14],[34,13,34,14],[34,15,34,19],[35,13,35,14],[36,13,36,14],[57,6,57,12],[57,13,57,14],[53,6,53,12],[53,13,53,14],[50,6,50,12],[50,13,50,14],[43,6,43,12],[41,6,41,12],[42,6,42,12],[37,13,37,14],[38,13,38,14],[49,6,49,12],[35,6,35,12],[36,6,36,12],[37,6,37,12],[38,6,38,12],[47,13,47,14],[48,13,48,14],[45,13,45,14],[44,6,44,12],[45,6,45,12],[46,6,46,12],[57,15,57,19],[57,20,57,21],[57,22,57,23],[55,6,55,12],[55,13,55,14],[55,15,55,19],[55,20,55,21],[55,22,55,23],[56,6,56,12],[56,13,56,14],[56,15,56,19],[56,20,56,21],[56,22,56,23],[53,15,53,19],[53,20,53,21],[53,22,53,23],[54,6,54,12],[54,13,54,14],[54,15,54,19],[54,20,54,21],[54,22,54,23],[51,6,51,12],[51,13,51,14],[51,15,51,19],[51,20,51,21],[51,22,51,23],[52,6,52,12],[52,13,52,14],[52,15,52,19],[52,20,52,21],[52,22,52,23],[26,6,26,12],[26,13,26,14],[26,15,26,19],[26,20,26,21],[26,22,26,23],[59,5,59,23],[58,5,58,21],[58,22,58,23],[27,6,27,12],[27,13,27,14],[27,15,27,19],[27,20,27,21],[27,22,27,23],[28,6,28,12],[28,13,28,14],[28,15,28,19],[28,20,28,21],[28,22,28,23],[50,15,50,19],[50,20,50,21],[50,22,50,23],[49,13,49,14],[49,22,49,23],[46,13,46,14],[24,6,24,12],[24,13,24,14],[24,15,24,19],[24,20,24,21],[24,22,24,23],[25,6,25,12],[25,13,25,14],[25,15,25,19],[25,20,25,21],[25,22,25,23],[22,6,22,12],[22,13,22,14],[22,15,22,19],[22,20,22,21],[22,22,22,23],[23,6,23,12],[23,13,23,14],[23,15,23,19],[23,20,23,21],[23,22,23,23],[20,6,20,12],[20,13,20,14],[20,15,20,19],[20,20,20,21],[20,22,20,23],[21,6,21,12],[21,13,21,14],[21,15,21,19],[21,20,21,21],[21,22,21,23],[18,6,18,12],[18,13,18,14],[18,15,18,19],[18,20,18,21],[18,22,18,23],[19,6,19,12],[19,13,19,14],[19,15,19,19],[19,20,19,21],[19,22,19,23],[16,6,16,12],[16,13,16,14],[16,15,16,19],[16,20,16,21],[16,22,16,23],[17,6,17,12],[17,13,17,14],[17,15,17,19],[17,20,17,21],[17,22,17,23],[12,5,12,23],[13,5,13,10],[13,11,13,17],[13,18,13,22],[7,26,11,26],[14,6,14,10],[14,11,14,17],[14,18,14,22],[15,5,15,23],[7,30,11,30],[8,5,8,11],[9,5,9,20],[9,21,9,23],[10,5,10,8],[10,9,10,20],[10,21,10,23],[11,5,11,16],[11,17,11,20],[11,21,11,23],[7,5,7,11],[7,12,8,20],[7,21,8,23],[0,5,0,23],[1,5,1,11],[1,12,1,23],[2,5,2,23],[3,5,3,20],[3,21,3,23],[7,27,11,27],[7,28,11,28],[7,29,11,29],[6,5,6,18],[6,19,6,20],[6,21,6,23],[4,5,4,15],[4,16,4,20],[4,21,4,23],[5,5,5,18],[5,19,5,20],[5,21,5,23]]}
[]
[null,null,null,null,null,null,null,null,null,null,null,null,"Унифицированная форма № ОП-1\nУтверждена постановлением Госкомстата\nРоссии от 25.12.98 № 132  ",null,null,null,null,null,null,null,null,null,null,null,null,null,"День",9]
[null,null,null,null,null,null,null,null,null,null,null,null,null,null,null,null,null,null,null,null,null,null,null,null,null,null,"Месяц",11]
[null,null,null,null,"Товар",null,null,null,null,null,null,null,null,null,null,null,null,null,null,null,null,"Код",null,null,null,null,"Год",2022]
[null,null,null,null,"Борщ украинский",null,null,null,null,null,null,null,null,null,null,null,"Форма по ОКУД",null,null,null,null,330501]
[null,null,null,null,{"$f":"IF(AND(E5<>\"\",INDEX('Состав блюд'!A:A,MATCH(INDEX('Перечень блюд'!A:A,MATCH(E$5,'Перечень блюд'!B:B,)),'Состав блюд'!D:D,)+ROW(E2))=ROW(E1)),INDEX('Состав блюд'!B:B,MATCH(INDEX('Перечень блюд'!A:A,MATCH(E$5,'Перечень блюд'!B:B,)),'Состав блюд'!D:D,)+ROW(E2)),\"\")","v":"Свекла"},null,null,null,null,null,null,null,null,null,null,null,null,null,null,"по ОКПО"]
{"$rows_left_out":54}
{"sheet":"Выгрузка из прих.накл.","index":3,"n_rows":12,"n_cols":33,"rows_kept":12,"cut":false,"hidden":false,"merged":[]}
["Дата","№ документа","Итого","Примечание","Говядина","Гречка","Какао в порошке","Капуста","Картофель","Колбаса \"Докторская\"","Курица","Лавровый лист","Лук","Майонез","Масло растительное","Масло сливочное","Морковь","Огурец свежий","Перец сладкий","Помидоры","Рис","Сахар","Свекла","Свинина","Соль","Сухари панировочные","Сыр","Томатная паста","Уксус 9%-ный","Чай","Яйца куриные","Фасоль","Арбуз"]
[]
["2022-11-08",1,5860,null,null,7,null,null,null,null,null,null,null,null,null,null,null,null,null,null,null,null,null,null,null,null,null,null,null,null,null,null,10]
["2022-11-08",1,"__________",null,null,60,null,null,null,null,null,null,null,null,null,null,null,null,null,null,null,null,null,null,null,null,null,null,null,null,null,null,12]
["2022-11-08",1,5860,null,null,7,null,null,null,null,null,null,null,null,null,null,null,null,null,null,null,null,null,null,null,null,null,null,null,null,null,null,10]
["2022-11-08",1,"__________",null,null,60,null,null,null,null,null,null,null,null,null,null,null,null,null,null,null,null,null,null,null,null,null,null,null,null,null,null,12]
{"$rows_left_out":7}
{"sheet":"Расход","index":4,"n_rows":171,"n_cols":34,"rows_kept":171,"cut":false,"hidden":false,"merged":[[7,30,11,30],[7,29,11,29],[170,5,170,6],[170,7,170,23],[7,26,11,26],[7,27,11,27],[7,28,11,28],[168,5,168,7],[168,10,168,13],[168,14,168,23],[169,5,169,9],[169,10,169,13],[169,14,169,23],[166,6,166,12],[166,13,166,14],[166,15,166,19],[166,20,166,21],[166,22,166,23],[167,5,167,9],[167,10,167,13],[167,14,167,23],[164,6,164,12],[164,13,164,14],[164,15,164,19],[164,20,164,21],[164,22,164,23],[165,6,165,12],[165,13,165,14],[165,15,165,19],[165,20,165,21],[165,22,165,23],[162,6,162,12],[162,13,162,14],[162,15,162,19],[162,20,162,21],[162,22,162,23],[163,6,163,12],[163,13,163,14],[163,15,163,19],[163,20,163,21],[163,22,163,23],[160,6,160,12],[160,13,160,14],[160,15,160,19],[160,20,160,21],[160,22,160,23],[161,6,161,12],[161,13,161,14],[161,15,161,19],[161,20,161,21],[161,22,161,23],[158,6,158,12],[158,13,158,14],[158,15,158,19],[158,20,158,21],[158,22,158,23],[159,6,159,12],[159,13,159,14],[159,15,159,19],[159,20,159,21],[159,22,159,23],[156,6,156,12],[156,13,156,14],[156,15,156,19],[156,20,156,21],[156,22,156,23],[157,6,157,12],[157,13,157,14],[157,15,157,19],[157,20,157,21],[157,22,157,23],[154,6,154,12],[154,13,154,14],[154,15,154,19],[154,20,154,21],[154,22,154,23],[155,6,155,12],[155,13,155,14],[155,15,155,19],[155,20,155,21],[155,22,155,23],[152,5,152,23],[153,6,153,12],[153,13,153,14],[153,15,153,19],[153,20,153,21],[153,22,153,23],[149,5,149,23],[150,5,150,10],[150,11,150,17],[150,18,150,22],[151,6,151,10],[151,11,151,17],[151,18,151,22],[146,5,146,20],[146,21,146,23],[147,5,147,8],[147,9,147,20],[147,21,147,23],[148,5,148,16],[148,17,148,20],[148,21,148,23],[143,5,143,18],[143,19,143,20],[143,21,143,23],[144,5,144,11],[144,12,145,20],[144,21,145,23],[145,5,145,11],[141,5,141,15],[141,16,141,20],[141,21,141,23],[142,5,142,18],[142,19,142,20],[142,21,142,23],[135,5,135,6],[135,7,135,23],[138,5,138,11],[138,12,138,23],[139,5,139,23],[140,5,140,20],[140,21,140,23],[133,5,133,7],[133,10,133,13],[133,14,133,23],[134,5,134,9],[134,10,134,13],[134,14,134,23],[131,6,131,12],[131,13,131,14],[131,15,131,19],[131,20,131,21],[131,22,131,23],[132,5,132,9],[132,10,132,13],[132,14,132,23],[129,6,129,12],[129,13,129,14],[129,15,129,19],[129,20,129,21],[129,22,129,23],[130,6,130,12],[130,13,130,14],[130,15,130,19],[130,20,130,21],[130,22,130,23],[127,6,127,12],[127,13,127,14],[127,15,127,19],[127,20,127,21],[127,22,127,23],[128,6,128,12],[128,13,128,14],[128,15,128,19],[128,20,128,21],[128,22,128,23],[125,6,125,12],[125,13,125,14],[125,15,125,19],[125,20,125,21],[125,22,125,23],[126,6,126,12],[126,13,126,14],[126,15,126,19],[126,20,126,21],[126,22,126,23],[123,6,123,12],[123,13,123,14],[123,15,123,19],[123,20,123,21],[123,22,123,23],[124,6,124,12],[124,13,124,14],[124,15,124,19],[124,20,124,21],[124,22,124,23],[121,6,121,12],[121,13,121,14],[121,15,121,19],[121,20,121,21],[121,22,121,23],[122,6,122,12],[122,13,122,14],[122,15,122,19],[122,20,122,21],[122,22,122,23],[119,6,119,12],[119,13,119,14],[119,15,119,19],[119,20,119,21],[119,22,119,23],[120,6,120,12],[120,13,120,14],[120,15,120,19],[120,20,120,21],[120,22,120,23],[117,5,117,23],[118,6,118,12],[118,13,118,14],[118,15,118,19],[118,20,118,21],[118,22,118,23],[114,5,114,23],[115,5,115,10],[115,11,115,17],[115,18,115,22],[116,6,116,10],[116,11,116,17],[116,18,116,22],[111,5,111,20],[111,21,111,23],[112,5,112,8],[112,9,112,20],[112,21,112,23],[113,5,113,16],[113,17,113,20],[113,21,113,23],[108,5,108,18],[108,19,108,20],[108,21,108,23],[109,5,109,11],[109,12,110,20],[109,21,110,23],[110,5,110,11],[106,5,106,15],[106,16,106,20],[106,21,106,23],[107,5,107,18],[107,19,107,20],[107,21,107,23],[101,5,101,6],[101,7,101,23],[103,5,103,11],[103,12,103,23],[104,5,104,23],[105,5,105,20],[105,21,105,23],[99,5,99,7],[99,10,99,13],[99,14,99,23],[100,5,100,9],[100,10,100,13],[100,14,100,23],[97,6,97,12],[97,13,97,14],[97,15,97,19],[97,20,97,21],[97,22,97,23],[98,5,98,9],[98,10,98,13],[98,14,98,23],[95,6,95,12],[95,13,95,14],[95,15,95,19],[95,20,95,21],[95,22,95,23],[96,6,96,12],[96,13,96,14],[96,15,96,19],[96,20,96,21],[96,22,96,23],[93,6,93,12],[93,13,93,14],[93,15,93,19],[93,20,93,21],[93,22,93,23],[94,6,94,12],[94,13,94,14],[94,15,94,19],[94,20,94,21],[94,22,94,23],[91,6,91,12],[91,13,91,14],[91,15,91,19],[91,20,91,21],[91,22,91,23],[92,6,92,12],[92,13,92,14],[92,15,92,19],[92,20,92,21],[92,22,92,23],[89,6,89,12],[89,13,89,14],[89,15,89,19],[89,20,89,21],[89,22,89,23],[90,6,90,12],[90,13,90,14],[90,15,90,19],[90,20,90,21],[90,22,90,23],[87,6,87,12],[87,13,87,14],[87,15,87,19],[87,20,87,21],[87,22,87,23],[88,6,88,12],[88,13,88,14],[88,15,88,19],[88,20,88,21],[88,22,88,23],[85,6,85,12],[85,13,85,14],[85,15,85,19],[85,20,85,21],[85,22,85,23],[86,6,86,12],[86,13,86,14],[86,15,86,19],[86,20,86,21],[86,22,86,23],[83,5,83,23],[84,6,84,12],[84,13,84,14],[84,15,84,19],[84,20,84,21],[84,22,84,23],[80,5,80,23],[81,5,81,10],[81,11,81,17],[81,18,81,22],[82,6,82,10],[82,11,82,17],[82,18,82,22],[78,5,78,8],[78,9,78,20],[78,21,78,23],[79,5,79,16],[79,17,79,20],[79,21,79,23],[75,5,75,11],[75,12,76,20],[75,21,76,23],[76,5,76,11],[77,5,77,20],[77,21,77,23],[73,5,73,18],[73,19,73,20],[73,21,73,23],[74,5,74,18],[74,19,74,20],[74,21,74,23],[69,5,69,11],[69,12,69,23],[70,5,70,23],[71,5,71,20],[71,21,71,23],[72,5,72,15],[72,16,72,20],[72,21,72,23],[67,5,67,6],[67,7,67,23],[31,14,31,23],[32,14,32,23],[65,14,65,23],[66,14,66,23],[65,5,65,7],[65,10,65,13],[66,5,66,9],[66,10,66,13],[63,6,63,12],[63,13,63,14],[63,15,63,19],[63,20,63,21],[63,22,63,23],[64,5,64,9],[64,10,64,13],[64,14,64,23],[61,6,61,12],[61,13,61,14],[61,15,61,19],[61,20,61,21],[61,22,61,23],[62,6,62,12],[62,13,62,14],[62,15,62,19],[62,20,62,21],[62,22,62,23],[59,6,59,12],[59,13,59,14],[59,15,59,19],[59,20,59,21],[59,22,59,23],[60,6,60,12],[60,13,60,14],[60,15,60,19],[60,20,60,21],[60,22,60,23],[57,6,57,12],[57,13,57,14],[57,15,57,19],[57,20,57,21],[57,22,57,23],[58,6,58,12],[58,13,58,14],[58,15,58,19],[58,20,58,21],[58,22,58,23],[55,6,55,12],[55,13,55,14],[55,15,55,19],[55,20,55,21],[55,22,55,23],[56,6,56,12],[56,13,56,14],[56,15,56,19],[56,20,56,21],[56,22,56,23],[53,6,53,12],[53,13,53,14],[53,15,53,19],[53,20,53,21],[53,22,53,23],[54,6,54,12],[54,13,54,14],[54,15,54,19],[54,20,54,21],[54,22,54,23],[51,6,51,12],[51,13,51,14],[51,15,51,19],[51,20,51,21],[51,22,51,23],[52,6,52,12],[52,13,52,14],[52,15,52,19],[52,20,52,21],[52,22,52,23],[49,5,49,23],[50,6,50,12],[50,13,50,14],[50,15,50,19],[50,20,50,21],[50,22,50,23],[46,5,46,23],[47,5,47,10],[47,11,47,17],[47,18,47,22],[48,6,48,10],[48,11,48,17],[48,18,48,22],[43,5,43,20],[43,21,43,23],[44,5,44,8],[44,9,44,20],[44,21,44,23],[45,5,45,16],[45,17,45,20],[45,21,45,23],[40,5,40,18],[40,19,40,20],[40,21,40,23],[41,5,41,11],[41,12,42,20],[41,21,42,23],[42,5,42,11],[37,5,37,20],[37,21,37,23],[38,5,38,15],[38,16,38,20],[38,21,38,23],[39,5,39,18],[39,19,39,20],[39,21,39,23],[33,5,33,6],[33,7,33,23],[34,5,34,23],[35,5,35,11],[35,12,35,23],[36,5,36,23],[31,5,31,7],[31,10,31,13],[32,5,32,9],[32,10,32,13],[29,6,29,12],[29,13,29,14],[29,15,29,19],[29,20,29,21],[29,22,29,23],[30,5,30,9],[30,10,30,13],[30,14,30,23],[27,6,27,12],[27,13,27,14],[27,15,27,19],[27,20,27,21],[27,22,27,23],[28,6,28,12],[28,13,28,14],[28,15,28,19],[28,20,28,21],[28,22,28,23],[25,6,25,12],[25,13,25,14],[25,15,25,19],[25,20,25,21],[25,22,25,23],[26,6,26,12],[26,13,26,14],[26,15,26,19],[26,20,26,21],[26,22,26,23],[23,6,23,12],[23,13,23,14],[23,15,23,19],[23,20,23,21],[23,22,23,23],[24,6,24,12],[24,13,24,14],[24,15,24,19],[24,20,24,21],[24,22,24,23],[21,6,21,12],[21,13,21,14],[21,15,21,19],[21,20,21,21],[21,22,21,23],[22,6,22,12],[22,13,22,14],[22,15,22,19],[22,20,22,21],[22,22,22,23],[19,6,19,12],[19,13,19,14],[19,15,19,19],[19,20,19,21],[19,22,19,23],[20,6,20,12],[20,13,20,14],[20,15,20,19],[20,20,20,21],[20,22,20,23],[17,6,17,12],[17,13,17,14],[17,15,17,19],[17,20,17,21],[17,22,17,23],[18,6,18,12],[18,13,18,14],[18,15,18,19],[18,20,18,21],[18,22,18,23],[15,5,15,23],[16,6,16,12],[16,13,16,14],[16,15,16,19],[16,20,16,21],[16,22,16,23],[12,5,12,23],[13,5,13,10],[13,11,13,17],[13,18,13,22],[14,6,14,10],[14,11,14,17],[14,18,14,22],[9,5,9,20],[9,21,9,23],[10,5,10,8],[10,9,10,20],[10,21,10,23],[11,5,11,16],[11,17,11,20],[11,21,11,23],[6,5,6,18],[6,19,6,20],[6,21,6,23],[7,5,7,11],[7,12,8,20],[7,21,8,23],[8,5,8,11],[4,5,4,15],[4,16,4,20],[4,21,4,23],[5,5,5,18],[5,19,5,20],[5,21,5,23],[0,5,0,23],[1,5,1,11],[1,12,1,23],[2,5,2,23],[3,5,3,20],[3,21,3,23]]}
[]
[null,null,null,null,null,null,null,null,null,null,null,null,"Унифицированная форма № ОП-1\nУтверждена постановлением Госкомстата\nРоссии от 25.12.98 № 132  ",null,null,null,null,null,null,null,null,null,null,null,null,null,"День",11]
[null,null,null,null,null,null,null,null,null,null,null,null,null,null,null,null,null,null,null,null,null,null,null,null,null,null,"Месяц",9,null,null,null,null,null,"добавить хлеб в закуски"]
[null,null,null,null,"Товар",null,null,null,null,null,null,null,null,null,null,null,null,null,null,null,null,"Код",null,null,null,null,"Год",2022,null,null,null,null,null,"добавить % отходов "]
[null,null,null,null,"Борщ украинский",null,null,null,null,null,null,null,null,null,null,null,"Форма по ОКУД",null,null,null,null,330501,null,null,null,null,null,null,null,null,null,null,null,"написать в составе блюд блюда по алфавиту"]
[null,null,null,null,{"$f":"IF(AND(E5<>\"\",INDEX('Состав блюд'!A:A,MATCH(INDEX('Перечень блюд'!A:A,MATCH(E$5,'Перечень блюд'!B:B,)),'Состав блюд'!D:D,)+ROW(E2))=ROW(E1)),INDEX('Состав блюд'!B:B,MATCH(INDEX('Перечень блюд'!A:A,MATCH(E$5,'Перечень блюд'!B:B,)),'Состав блюд'!D:D,)+ROW(E2)),\"\")","v":"Свекла"},"ООО",null,null,null,null,null,null,null,null,null,null,null,null,null,"по ОКПО",null,null,null,null,null,null,"Кол-во порций",100,null,null,null,null,null,"написать выход блюда в граммах"]
{"$rows_left_out":166}
{"sheet":"Выгрузка из кальк.карт","index":5,"n_rows":17,"n_cols":31,"rows_kept":17,"cut":false,"hidden":false,"merged":[]}
["Дата расхода","Блюдо","Кол-во порций","№ документа","Говядина","Гречка","Какао в порошке","Капуста","Картофель","Колбаса \"Докторская\"","Курица","Лавровый лист","Лук","Майонез","Масло растительное","Масло сливочное","Морковь","Огурец свежий","Перец сладкий","Помидоры","Рис","Сахар","Свекла","Свинина","Соль","Сухари панировочные","Сыр","Томатная паста","Уксус 9%-ный","Чай","Яйца куриные"]
["2022-09-01","Жаркое по-домашнему",700,2,null,null,null,null,3500,null,null,null,7000,null,7000,null,22400,null,null,null,null,null,null,70000,56000,null,null,3500]
["2022-09-05","Борщ украинский",700,1,null,null,null,7000,21000,null,null,22400,3500,null,7000,null,18200,null,7000,null,null,null,28000,null,7000,null,null,7000,7000]
["2022-10-05","Щи",700,1,3500,null,null,70000,3500,null,null,7000,7000,null,7000,null,22400,null,3500,null,null,null,null,null,56000]
["2022-11-05","Щи",700,1,3500,null,null,70000,3500,null,null,7000,7000,null,7000,null,22400,null,3500,null,null,null,null,null,56000]
["2022-09-05","Щи",700,1,3500,null,null,70000,3500,null,null,7000,7000,null,7000,null,22400,null,3500,null,null,null,null,null,56000]
{"$rows_left_out":11}