{"text_format":"1","workbook":"xlsx","n_sheets":9,"sheets":["параметры заявки","Списки","Исходные данные","список","Лист5","Лист2","Лист1","Сводная","по сотрудникам"],"not_rendered":{"charts":0,"images":0,"macros":1,"external_links":0,"defined_names":6,"comments":1,"pivot_tables":11},"unopened":[],"bounds":{"document_bytes":16777216,"sheet_cells":100000,"rows_first":2000,"rows_last":500,"rows_between":2000,"halvings":0,"cell_chars":16384,"cell_head_chars":4096},"cells_cut":0,"cells_raw":0,"read":"whole","date_system":"1900"}

{"sheet":"параметры заявки","index":0,"n_rows":40,"n_cols":8,"rows_kept":40,"cut":false,"hidden":false,"merged":[[30,3,30,7]]}
[null,null,"Параметры заявки :","Данные для заявки :",null,null,"обязательно к проставлению"]
[null,null,"сегодня дата",{"$f":"TODAY()","v":"2022-10-27"},null,null,"Разница со временем МСК"]
[null,null,"Текущее время (МСК) ",{"$f":"NOW()-G3","v":44861.667636921302},null,null,"04:00:00"]
[null,null,"сумма БГ",10010000,{"$f":"IF(Списки!J11=Списки!K11,\" \",\"неверный формат, должен быть числовой!\")","v":" "}]
[null,null,"срок БГ","2023-10-30",{"$f":"IF(Таблица7[[#This Row],[Данные для заявки :]]=0,\"*не заполнено\",\"\")","v":""}]
[null,null,"форма предприятия","ООО",{"$f":"IF(Таблица7[[#This Row],[Данные для заявки :]]=0,\"*не заполнено\",\"\")","v":""}]
[null,null,"дата регистрации предприятия","2020-01-01",{"$f":"IF(Таблица7[[#This Row],[Данные для заявки :]]=0,\"*не заполнено\",\"\")","v":""}]
[null,null,"ФЗ БГ ","44-ФЗ"]
[null,null,"Регион ","Республика Крым; Севастополь",{"$f":"IF(Таблица7[[#This Row],[Данные для заявки :]]=0,\"*не заполнено\",\"\")","v":""}]
[null,null,"Прочие параметры :","Выбор :"]
[null,null,"Коммерческие БГ ","пусто"]
[null,null,"Возврат аванса","пусто"]
[null,null,"БГ по форме заказчика","пусто"]
[null,null,"Закрытый аукцион","пусто"]
[null,null,"Многолот","пусто"]
[null,null,"Переобеспечение (продление сроков)","пусто"]
[null,null,"Требование к пакету документов до 1 млн.руб","пусто"]
[null,null,{"$f":"'Исходные данные'!C37","v":"Оплата от 3-его лица"},"пусто"]
[null,null,{"$f":"'Исходные данные'!C38","v":"БГ < 100 тысяч"},{"$f":"IF(Списки!J7=1,IF(D4=0,\"пусто\",IF(D4<100000,\"да\",\"нет\")),\"пусто\")","v":"нет"}]
[null,null,{"$f":"'Исходные данные'!C39","v":"БГ  > 100 тысяч < 500 тысяч"},{"$f":"IF(Списки!J7=1,IF(D4=0,\"пусто\",IF(D4<100000,\"нет\",IF(D4>100000,IF(D4<500000,\"да\",\"нет\")))),\"пусто\")","v":"нет"}]
[null,null,{"$f":"'Исходные данные'!C40","v":"БГ  > 500 тысяч < 1 млн"},{"$f":"IF(Списки!J7=1,IF(D4=0,\"пусто\",IF(D4<500000,\"нет\",IF(D4>500000,IF(D4<1000000,\"да\",\"нет\")))),\"пусто\")","v":"нет"}]
[null,null,{"$f":"'Исходные данные'!C41","v":"БГ  >  1 млн < 5 млн"},{"$f":"IF(Списки!J7=1,IF(D4=0,\"пусто\",IF(D4<1000000,\"нет\",IF(D4>1000000,IF(D4<5000000,\"да\",\"нет\")))),\"пусто\")","v":"нет"}]
[null,null,{"$f":"'Исходные данные'!C42","v":"БГ  >  5 млн и более"},{"$f":"IF(Списки!J7=1,IF(D4=0,\"пусто\",IF(D4>5000000,\"да\",\"нет\")),\"пусто\")","v":"да"}]
[null,null,{"$f":"'Исходные данные'!C43","v":"оператор Зайнетдинова Кристина "},"пусто"]
[null,null,{"$f":"'Исходные данные'!C44","v":"оператор Попова Анастасия "},"пусто"]
[null,null,{"$f":"'Исходные данные'!C45","v":"оператор Гаврикова Екатерина"},"пусто"]
[null,null,{"$f":"'Исходные данные'!C46","v":"вакансия"},"пусто"]
[null,null,{"$f":"'Исходные данные'!C47","v":"площадка"},"пусто"]
[null,null,{"$f":"'Исходные данные'!C48","v":"Банк"},"пусто"]
[]
[null,null,null,"площадка Банка"]
[null,null,"Банк подходящий по параметрам заявки","1","2","3","4","5"]
[null,null,"СеверГазБанк","СеверГазБанк"]
[null,null,"УралсибБанк","ВБЦ","Goodfin"]
[null,null,"МТС Банк","ВБЦ","Goodfin","Феникс"]
[null,null,"Киви банк","TenderHelp"]
[null,null,"МоскомБанк","МоскомБанк"]
[null,null,"ПромСвязьБанк","Goodfin"]
[null,null,"РГС Банк","Goodfin"]
[null,null,"Кредит Европа Банк","Yofin"]

{"sheet":"Списки","index":1,"n_rows":39,"n_cols":13,"rows_kept":39,"cut":false,"hidden":true,"merged":[]}
["пусто",null,null,null,null,null,null,null,null,{"$f":"IF('параметры заявки'!D4=0,\"пусто\",\"да\")","v":"да"}]
[{"$f":"IF(AND(J1=J2,J2=J3,J3=J4,J4=J5,J5=J6),\"да\",\"пусто\")","v":"да"},null,null,null,null,null,null,null,null,{"$f":"IF('параметры заявки'!D5=0,\"пусто\",\"да\")","v":"да"}]
[{"$f":"IF(AND(J1=J2,J2=J3,J3=J4,J4=J5,J5=J6),\"нет\",\"пусто\")","v":"нет"},null,null,null,null,null,null,null,null,{"$f":"IF('параметры заявки'!D6=0,\"пусто\",\"да\")","v":"да"}]
[null,null,null,null,null,null,null,null,null,{"$f":"IF('параметры заявки'!D7=0,\"пусто\",\"да\")","v":"да"}]
[null,null,null,null,null,null,null,null,null,{"$f":"IF('параметры заявки'!D8=0,\"пусто\",\"да\")","v":"да"}]
[null,null,null,null,null,null,null,null,null,{"$f":"IF('параметры заявки'!D9=0,\"пусто\",\"да\")","v":"да"}]
["пусто",null,null,null,null,null,null,null,null,{"$f":"IF(AND(J1=J2,J2=J3,J3=J4,J4=J5,J5=J6),1,0)","v":1}]
["паспорт"]
["все"]
[null,null,null,null,null,null,null,null,null,null,null,1,1]
["РФ",null,null,null,null,null,null,null,null,{"$f":"ISNUMBER('параметры заявки'!D4)","v":true},{"$f":"L10=M10","v":true}]
["Республика Адыгея"]
["Карачаево-Черкесская Республика"]
["Кабардино-Балкарская Республика"]
["Республика Северная Осетия – Алания"]
["Республика Ингушетия"]
["Чеченская Республика"]
["Республика Дагестан"]
["Республика Крым; Севастополь"]
["Республика Тыва"]
[]
[]
["44-ФЗ"]
["223-ФЗ"]
["185-ФЗ (615-ПП)"]
["Закон 44-ФЗ (275-ФЗ Гособоронзаказ)"]
["Закрытый аукцион"]
[]
["ООО"]
["ИП"]
["АО"]
["ПАО"]
["НАО"]
["ФГУП"]
["ГУП"]
["МУП"]
[]
[]
[{"$f":"NOW()","v":44861.834303587966},{"$f":"TIME(HOUR(A39),MINUTE(A39),SECOND(A39))","v":"20:01:24"}]

{"sheet":"Исходные данные","index":2,"n_rows":78,"n_cols":77,"rows_kept":78,"cut":false,"hidden":false,"merged":[[52,1,53,1],[54,1,55,1],[20,1,28,1],[15,1,19,1],[5,1,12,1],[13,1,14,1],[29,1,47,1],[48,1,49,1],[50,1,51,1]]}
[null,null,0,1,2,3,4,5,6,7,8,9,10,11,12,13,14,15,16,17,18,19,20,21,22,23,24,25,26,27,28,29,30,31,32,33,34,35,36,37,38,39,40,41,42,43,44,45,46,47,48,49,50,51,52,53,54,55,56,57,58,59,60,61,62,63,64,65,66,67,68,69,70,71,72,73,74]
[0,"площадка","площадка","СберБанк","СеверГазБанк","ВБЦ","ВБЦ","ВБЦ","ВБЦ","ВБЦ","ВБЦ","ВБЦ","ВБЦ","ВБЦ","ВБЦ","ВБЦ","ВБЦ","ВБЦ","TenderHelp","TenderHelp","TenderHelp","TenderHelp","TenderHelp","TenderHelp","TenderHelp","TenderHelp","TenderHelp","TenderHelp","TenderHuв","TenderHuв","АТФИН","АТФИН","АТФИН","АТФИН","АТФИН","АТФИН","МоскомБанк","ignetik","ignetik","МеталлИнвестБанк","ЛокоБанк","ТендерТех","ТендерТех","ТендерТех","ТендерТех","ТендерТех","ТендерТех","Гособлако","Альфа-банк","Goodfin","Goodfin","Goodfin","Goodfin","Goodfin","SBI Банк","Elfin","Elfin","Elfin","Elfin","А-План","А-План","Yofin","Yofin","Yofin","Yofin","МодульБанк","МоскоммерцБанк","Алеф-банк","Феникс","Феникс","Феникс","Реалист Банк","Банк Зенит","МеткомБанк","БизнесПоддержка","СовкомБанк","БизнесПоддержка"]
[1,"Банк","наименование банка","СберБанк","СеверГазБанк","ГазПромБанк","МКБ Банк","СМП Банк","АК Барс банк","Санкт-Петербург Банк","УралсибБанк","МинБанк","РосБанк","МТС Банк","Союз Банк","Русский Стандарт","Банк Зенит","Инбанк","МСП Банк","Банк Россия","Киви банк","Инбанк","ПромСвязьБанк","МеталлИнвестБанк","Санкт-Петербург Банк","Абсолют Банк","Альфа-банк","СберБанк","МеталлИнвестБанк","SBI Банк","ЭкспоБанк","Кредит Европа Банк","СДМ-Банк","Первоуральский Банк","Кубань Кредит Банк","Примсоцбанк","МоскомБанк","МТС Банк","Санкт-Петербург Банк","МеталлИнвестБанк","ЛокоБанк","РГС Банк","Союз Банк","УралсибБанк","ТКБ Банк","Росбанк","Банк Зенит","ПромСвязьБанк","Альфа-банк","ПочтаБанк","УралсибБанк","МТС Банк","ПромСвязьБанк","РГС Банк","SBI Банк","ГазПромБанк","МКБ Банк","Банк Зенит","Санкт-Петербург Банк","АТБ Банк","РГС Банк","Кредит Европа Банк","Кубань Кредит Банк","Банк Столичный Кредит","Алеф-банк","МодульБанк","МоскоммерцБанк","Алеф-банк","МТС Банк","АК Барс банк","Абсолют Банк","Реалист Банк","Банк Зенит","МеткомБанк","Инбанк","СовкомБанк","Киви банк"]
[2,"Лимит  БГ","МАХ лимит на БГ",50000000,115000000,150000000,150000000,50000000,100000000,50000000,30000000,42400000,50000000,30000000,15000000,20000000,100000000,14000000,1000000000,250000000,200000000,15000000,100000000,150000000,50000000,160000000,60000000,50000000,150000000,32000000,25000000,35000000,10000000,100000,35000000,6000000,5000000,30000000,20000000,150000000,150000000,150000000,15000000,30000000,20000000,50000000,100000000,150000000,70000000,30000000,30000000,30000000,150000000,150000000,32000000,150000000,150000000,30000000,50000000,40000000,150000000,35000000,50000000,60000000,18000000,12000000,20000000,18000000,30000000,100000000,160000000,20000000,100000000,30000000,15000000,500000000,200000000]
[3,"срок регистрации","срок регистрации предприятия (дней) ",180,1,180,365,180,180,180,90,180,365,90,180,180,180,180,180,365,90,180,365,180,180,90,180,180,180,180,90,90,365,365,90,90,90,90,180,180,180,90,180,30,0,365,180,90,180,180,90,90,90,90,180,180,365,180,180,90,90,90,90,90,180,30,180,180,90,180,90,1,180,1,180,90,180]
[4,"форма предприятия","ООО","да","да","да","да","да","да","да","да","да","да","да","да","да","да","да","да","да","да","да","да","да","да","да","да","да","да","да","да","да","да","да","да","да","да","да","да","да","да","да","да","да","да","да","да","да","да","да","да","да","да","да","да","да","да","да","да","да","да","да","да","да","да","да","да","да","да","да","да","да","да","да","да","да","да"]
[5,null,"ИП","да","да","нет","да","нет","да","да","да","да","нет","да","нет","нет","нет","да","да","да","да","да","да","да","да","да","да","да","да","да","да","да","да","да","да","да","да","да","да","да","да","да","нет","да","да","нет","да","да","да","нет","да","да","да","да","да","нет","да","нет","да","да","да","да","да","да","да","да","да","да","да","да","да","да","да","да","да","да","да"]
[6,null,"АО","да","да","да","да","да","да","да","да","да","да","да","да","да","да","да","да","да","да","да","да","да","да","да","да","да","да","да","да","да","да","да","да","да","да","да","да","да","да","да","да","да","да","да","да","да","да","да","да","да","да","да","да","да","да","да","да","да","да","да","да","да","да","да","да","да","да","да","да","да","да","да","да","да","да"]
[7,null,"ПАО","да","да","да","нет","да","да","да","да","да","да","да","да","да","да","да","да","да","да","да","да","да","да","да","да","да","да","да","да","да","да","нет","да","да","да","да","да","да","да","да","да","да","да","да","да","да","да","нет","да","да","да","да","да","да","нет","да","да","да","да","да","да","да","да","да","да","да","да","да","да","да","да","да","да","да","да"]
[8,null,"НАО","да","да","да","нет","да","да","да",null,null,"да","нет","нет","да","да","да","да","да","да","да","да","да","да","да","нет","да","да","да","да","да","да","нет","да","нет","да","нет","да","да","да","да","нет","да",null,"да","да","да","нет","нет",null,"нет","да","да","да","да","нет","да","да","да","да","нет","да","да","да","да","да","да","нет","да","да","да","да","да","да","да","да"]
[9,null,"ФГУП","да","да","нет","да","да","да","да","да","да","нет","нет","нет","да","да","да","да","да","да","да","да","да","да","да","нет","да","да","нет","да","да","да","нет","нет","да","да","нет","да","да","да","да","нет","да","да","нет","да","да","нет","нет","да","нет","да","да","нет","нет","да","да","да","да","да","да","нет","нет","нет","да","да","нет","нет","нет","да","да","да","да","да","да","да"]
[10,null,"ГУП","да","да","нет","да","да","да","да","да","да","нет","нет","нет","да","да","да","да","да","да","да","да","да","да","да","нет","да","да","нет","да","да","да","нет","нет","да","да","нет","да","да","да","да","нет","да","да","нет","да","да","нет","нет","да","нет","да","да","нет","нет","да","да","да","да","да","да","нет","нет","нет","да","да","нет","нет","нет","да","да","да","да","да","да","да"]
[11,null,"МУП","да","да","нет","да","да","да","да","да","да","нет","нет","нет","да","да","да","да","да","да","да","да","да","да","да","нет","да","да","нет","да","да","да","нет","нет","да","да","нет","да","да","да","да","нет","да","да","нет","да","да","нет","нет","да","нет","да","да","нет","нет","да","да","да","да","да","да","нет","нет","нет","да","да","нет","нет","нет","да","да","да","да","да","да","да"]
[12,"срок БГ","МАХ срок на БГ (месяцев)",37,37,62,63,62,65,62,40,62,38,36,86,37,72,38,84,60,66,38,62,72,62,72,61,37,72,36,62,61,60,12,61,40,30,36,61,72,60,61,86,60,60,38,61,62,84,61,40,36,62,61,36,62,63,61,62,38,61,61,61,24,61,60,48,61,36,65,72,97,61,72,38,80,66]
[13,null,"МАХ срок на БГ (год)","3г+1м","3г+1м","5г+2м","5г+3м","5г+2м","5г+5м","5г+2м","3г+3м","5г+2м","3г+2м","3г","7г+2м","3г+1м","6 лет","3г+2м","7г","5г","5г+6м","3г+2м","5г+2м","6г","5г+2м","6г","5г+1м","3г+1м","6г","3г","5г+2м","5г+1м","5г","1г","5г+1м","3г+4м","2г+6м","3г","5г+1м","6г","5г","5г+1м","7г+2м","5г+3м","5г+1м","3г+2м","5г+1м","5г+2м","7г","5г+1м","3г+3м","3г","5г+2м","5г+1м","3г","5г+2м","5г+3м","5г+1м","5г+2м","3г+2м","5г+1м","5г+1м","5г+1м","2г","5г+1м","5г","4г","5г+1м","3г","5г+5м","6г","8г+1м","5г+1м","6г","3г+2м","6г+8м","5г+6м"]
[14,"закон ФЗ","44-ФЗ","да","да","да","да","да","да","да","да","да","да","да","да","да","да","да","да","да","да","да","да","да","да","да","да","да","да","да","да","да","да","да","да","да","да","да","да","да","да","да","да","да","да","да","да","да","да","да","да","да","да","да","да","да","да","да","да","да","да","да","да","да","да","да","да","да","да","да","да","да","да","да","да","да","да"]
[15,null,"223-ФЗ","да","да","да","да","да","да","да","да","да","да","да","да","да","да","да","да","да","да","да","да","да","да","да","да","да","да","да","да","да","да","нет","да","да","да","да","да","да","да","да","да","да","да","да","да","да","да","да","да","да","да","да","да","да","да","да","да","да","да","да","да","да","да","да","да","да","да","да","да","да","да","да","да","да","да"]
[16,null,"185-ФЗ (615-ПП)","да","да","нет","да","да","нет","да","нет","да","да","да","да","да","да","нет","нет","да","да","нет","да","нет","да","да","да","да","нет","да","да","да","да","нет","нет","нет","да","да","нет","нет","да","нет","да","нет","да","да","да","да","да","да","нет","да","да","нет","да","нет","да","да","да","да","нет","да","да","нет","да","да","да","да","да","нет","да","да","да","да","нет","да","да"]
[17,null,"Закон 44-ФЗ (275-ФЗ Гособоронзаказ)","нет","нет","нет","нет","нет","нет","нет","нет","нет","нет","нет","нет","нет","нет","нет","нет","нет","нет","нет","да","нет","нет","да","нет","нет","нет","нет","нет","нет","нет","да","нет","нет","нет","нет","нет","нет","нет","да","нет","нет","нет","нет","нет","да","нет","нет","нет","нет","да","да","нет","нет","нет","нет","нет","нет","да","нет","нет","нет","нет",null,null,"нет","нет","нет","да",null,"нет","нет","нет","нет","нет"]
[18,null,"Закрытый аукцион",{"$f":"D33","v":"нет"},{"$f":"E33","v":"да"},"нет","да",0,"да","да","нет","да","нет","нет",0,"нет","да","нет","да","да","нет","нет","да","да","да","да","да","нет","нет","нет","нет","нет",0,0,0,0,"нет","нет","да","нет","нет","да",0,"нет","да","нет","да","да","да","нет","нет","нет","да","да","нет","нет","да","да","да","нет","да","нет","нет","нет",{"$f":"BM33","v":"нет"},"да",0,"нет","нет",{"$f":"BR33","v":"да"},"да","нет","да","да","нет","да","нет"]
[19,"Регион","Республика Адыгея","не работают","не работают","не работают","да","не работают","не работают","не работают","не работают","да","не работают","не работают","да","да","не работают","не работают","да","не работают","да","не работают","да","да","не работают","да","да","не работают","да","не работают","не работают","не работают","не работают","не работают","да","да","да","не работают","не работают","да","не работают","не работают","да","да","да","не работают","не работают","да","не работают","не работают","не работают","не работают","да","не работают","не работают","да","да","не работают","не работают","да","не работают","не работают","да","не работают","не работают","да","не работают","не работают","не работают","не работают","да","да","не работают","не работают","не работают","да","да"]
[20,null,"Карачаево-Черкесская Республика","не работают","не работают","не работают","да","не работают","не работают","не работают","не работают","да","не работают","не работают","да","да","не работают","не работают","да","не работают","да","не работают","да","да","не работают","да","да","не работают","да","не работают","не работают","не работают","не работают","не работают","не работают","не работают","не работают","не работают","не работают","да","не работают","не работают","да","да","да","не работают","не работают","да","не работают","не работают","не работают","не работают","да","не работают","не работают","да","да","не работают","не работают","не работают","не работают","не работают","не работают","не работают","не работают","да","не работают","не работают","не работают","не работают","да","да","не работают","не работают","не работают","да","да"]
[21,null,"Кабардино-Балкарская Республика","не работают","не работают","не работают","да","не работают","не работают","не работают","не работают","да","не работают","не работают","да","да","не работают","не работают","да","не работают","да","не работают","да","да","не работают","да","да","не работают","да","не работают","не работают","не работают","не работают","не работают","не работают","не работают","не работают","не работают","не работают","да","не работают","не работают","да","да","да","не работают","не работают","да","не работают","не работают","не работают","не работают","да","не работают","не работают","да","да","не работают","не работают","не работают","не работают","не работают","не работают","не работают","не работают","да","не работают","не работают","не работают","не работают","да","да","не работают","не работают","не работают","да","да"]
[22,null,"Республика Северная Осетия – Алания","не работают","не работают","не работают","да","не работают","не работают","не работают","не работают","да","не работают","не работают","да","да","не работают","не работают","да","не работают","да","не работают","да","да","не работают","да","да","не работают","да","не работают","не работают","не работают","не работают","не работают","не работают","не работают","не работают","не работают","не работают","да","не работают","не работают","да","да","да","не работают","не работают","да","не работают","не работают","не работают","не работают","да","не работают","не работают","да","да","не работают","не работают","не работают","не работают","не работают","не работают","не работают","не работают","да","не работают","не работают","не работают","не работают","да","да","не работают","не работают","не работают","да","да"]
[23,null,"Республика Ингушетия","не работают","не работают","не работают","да","не работают","не работают","не работают","не работают","не работают","не работают","не работают","да","да","не работают","не работают","да","не работают","да","не работают","да","да","не работают","да","да","не работают","да","не работают","не работают","не работают","не работают","не работают","не работают","не работают","не работают","не работают","не работают","да","не работают","не работают","да","да","да","не работают","не работают","да","не работают","не работают","не работают","не работают","да","не работают","не работают","да","да","не работают","не работают","не работают","не работают","не работают","не работают","не работают","не работают","да","не работают","не работают","не работают","не работают","да","да","не работают","не работают","не работают","да","да"]
[24,null,"Чеченская Республика","не работают","не работают","не работают","да","не работают","не работают","не работают","не работают","да","не работают","не работают","да","не работают","не работают","не работают","да","не работают","да","не работают","да","да","не работают","да","да","не работают","да","не работают","не работают","не работают","не работают","не работают","не работают","не работают","не работают","не работают","не работают","да","не работают","не работают","да","да","да","не работают","не работают","да","не работают","не работают","не работают","не работают","да","не работают","не работают","да","да","не работают","не работают","не работают","не работают","не работают","не работают","не работают","не работают","да","не работают","не работают","не работают","не работают","да","да","не работают","не работают","не работают","да","да"]
[25,null,"Республика Дагестан","не работают","не работают","не работают","да","не работают","не работают","не работают","не работают","не работают","не работают","не работают","да","не работают","не работают","не работают","да","не работают","да","не работают","да","да","не работают","да","не работают","не работают","да","не работают","не работают","не работают","не работают","не работают","не работают","не работают","не работают","не работают","не работают","да","не работают","не работают","да","да","да","не работают","не работают","да","не работают","не работают","не работают","не работают","да","не работают","не работают","да","да","не работают","не работают","не работают","не работают","не работают","не работают","не работают","не работают","да","не работают","не работают","не работают","не работают","да","да","не работают","не работают","не работают","да","да"]
[26,null,"Республика Крым; Севастополь","не работают","не работают","не работают","не работают","да","не работают","не работают","не работают","не работают","не работают","не работают","не работают","не работают","да","не работают","да","не работают","нет","не работают","не работают","да","не работают","да","не работают","не работают","да","не работают","не работают","не работают","не работают","не работают","не работают","не работают","да","не работают","не работают","да","не работают","не работают","не работают","не работают","не работают","не работают","да","не работают","не работают","не работают","не работают","не работают","не работают","не работают","не работают","не работают","не работают","да","не работают","не работают","не работают","не работают","не работают","не работают","да","да","не работают","да","не работают","не работают","да","не работают","да","не работают","не работают","не работают","нет"]
[27,null,"Республика Тыва","да","не работают","да","да","да","да","да","да","да","да","да","да","да","да","да","да","да","да","да","да","да","да","да","да","да",null,"да","да","да","да","да","да","да","да","да","да",null,"да","да","да","да","да","да","да","да","да","не работают","да","да","да","да","да","да","да","да","да","да","да","да","да","да","да","да","да","да","да","да","да","да","да","да","да","да","да"]
[28,"прочие","Коммерческие БГ ","нет","да","да","да","да","да","да",null,"нет","нет","нет","да","нет","да","нет","нет","нет","нет","нет",null,"да","да","да","да","нет","да","нет","нет","нет","нет","нет","нет","нет","нет","нет","нет","да","нет","нет","да","нет","нет","нет","да",null,"да","нет",null,"нет",null,"нет","нет","да","да","да","нет","нет","нет","да","нет","да","нет","нет","да","нет","нет","да","да","да","да","да","нет","да","нет"]
[29,null,"Возврат аванса","да","да","да","да","да","да","да","да","нет","да","нет",null,"нет","да","нет","да","да","да","нет","да","да","да","да","да","да","да","да","да","да","да","нет","да","да","да","нет","нет","да","нет","нет",null,"да","да","да","да","да","да","да","да","нет","да","нет","да","да","да","да","да","да","нет","да","да","да","да","да",null,"да","нет","да","да","да","да","да","нет","да","да"]
[30,null,"БГ по форме заказчика","да","да",null,"да",null,null,"да",null,null,null,"да",null,"нет","да","да","да",null,"да","да",null,null,"да","да",null,"да",null,"да","да",null,null,null,null,null,"да","да","да",null,null,null,null,null,null,null,"да",null,null,"да",null,"да",null,null,"да",null,"да","да","да",null,null,null,null,null,"нет",null,"да","нет","да",null,"да","да","да","да","да","да","да"]
[31,null,"Закрытый аукцион","нет","да","нет","да",null,"да","да","нет","да","нет","нет",null,"нет","да","нет","да","да","нет","нет","да","да","да","да","да","нет","нет","нет","нет","нет",null,null,null,null,"нет","нет","да","нет","нет","да",null,"нет","да","нет","да","да","да","нет","нет","нет","да","да","нет","нет","да","да","да","нет","да","нет","нет","нет","нет","да",null,"нет","нет","да","да","нет","да","да","нет","да","нет"]
[32,null,"Многолот","да","да",null,"да",null,null,null,null,null,null,null,null,"нет","да","да","нет","нет","да","да",null,null,null,null,null,"да",null,"да","да",null,null,null,null,null,null,null,null,null,null,"нет",null,null,"нет",null,"да","да",null,null,null,null,null,"нет","да",null,null,"да",null,null,"нет","да","да",null,"да","да","да","да",null,null,"да","да","да","да","да","да","да"]
[33,null,"Переобеспечение (продление сроков)","нет","да",null,null,"да",null,"да",null,null,null,"да",null,"нет","нет","нет","да","да","да","нет",null,null,"нет","да",null,"нет",null,null,"нет","да",null,null,null,null,null,"да","да",null,null,null,null,null,null,null,"да","да",null,null,null,"да",null,null,null,null,null,"нет","да","нет",null,"да","да",null,"да",null,null,"да","да",null,null,"да","да","да","да","да","да"]
[34,null,"Требование к пакету документов до 1 млн.руб","все","паспорт","все",null,null,null,"все",null,null,null,"паспорт",null,null,null,null,null,null,"паспорт",null,null,"все","все","все",null,"все","все","паспорт","паспорт","все","все","все","все","все","паспорт","паспорт","все","все","все","паспорт",null,"паспорт","паспорт",null,null,null,null,null,"все","паспорт","все","паспорт","паспорт","все",null,null,null,null,"паспорт",null,null,null,null,"паспорт",null,null,"паспорт",null,"все",null,null,"паспорт",null,"все"]
[35,null,"Оплата от 3-его лица","нет","нет",null,null,null,null,null,"нет",null,null,"нет",null,null,null,"нет","нет",null,"нет","нет","нет",null,null,"да",null,"нет","нет","нет","нет",null,"да",null,null,null,"нет","нет","нет","нет",null,"нет","да","да","да",null,null,"нет",null,null,"нет","нет","нет","нет","нет",null,null,null,null,null,"нет",null,"нет","нет","нет","да",null,"нет","нет",null,"да","нет",null,"нет","нет","нет","нет"]
[36,null,"БГ < 100 тысяч","да","нет","да","да","да","да","да","да","да","да","да","да","да","да","да","нет","нет","нет","нет","нет","нет","нет","нет","нет","нет","нет","нет","да","нет","нет","нет","нет","нет","нет","да","нет","нет","нет","нет","нет","нет","нет","нет","нет","нет","нет","нет","нет","нет","нет","нет","нет","нет","нет","нет","нет","нет","нет","нет","нет","нет","нет","да","нет","нет","нет","нет","нет","нет","нет","нет","нет","нет","нет"]
[37,null,"БГ  > 100 тысяч < 500 тысяч","да","да","да","да","да","да","да","да","да","да","да","да","да","да","да","нет","нет","нет","нет","нет","нет","нет","нет","нет","нет","нет","нет","да","нет","нет","нет","нет","нет","нет","да","нет","нет","нет","нет","нет","нет","нет","нет","нет","нет","нет","нет","нет","нет","нет","нет","нет","нет","нет","нет","нет","нет","нет","нет","нет","нет","нет","да","нет","нет","нет","нет","нет","нет","нет","нет","нет","нет","нет"]
[38,null,"БГ  > 500 тысяч < 1 млн","да","да","да","да","да","да","да","да","да","да","да","да","да","да","да","нет","нет","нет","нет","нет","нет","нет","нет","нет","нет","нет","нет","да","нет","нет","нет","нет","нет","нет","да","нет","да","да","нет","да","да","да","нет","нет","нет","нет","нет","нет","нет","нет","нет","нет","нет","нет","нет","нет","нет","нет","нет","нет","нет","нет","да","нет","нет","да","нет","нет","нет","нет","нет","да","нет","да"]
[39,null,"БГ  >  1 млн < 5 млн","да","да","да","да","да","да","да","да","да","да","да","да","да","да","да","нет","нет","да","да","нет","нет","нет","нет","нет","нет","нет","нет","да","да","да","нет","да","да","да","да","нет","да","да","да","да","да","да","да","да","да","да","да","да","да","да","да","да","да","да","да","да","нет","нет","да","да","да","да","да","да","да","да","да","да","да","да","да","да","да","да"]
[40,null,"БГ  >  5 млн и более","да","да","да","да","да","да","да","да","да","да","да","да","да","да","да","нет","нет","да","да","да","да","да","да","да","нет","да","да","да","да","да","да","да","да","да","да","нет","да","да","да","да","да","да","да","да","да","да","да","да","да","да","да","да","да","да","да","да","да","нет","да","да","да","да","да","да","да","да","да","да","да","да","да","да","да","да"]
[41,null,"оператор Зайнетдинова Кристина ","да","да","да","да","да","да","да","да","да","да","да","да","да","да","да","да","да","да","да","да","да","да","да","да","да","да","да","да","да","да","да","да","да","да","да","да","нет","нет","да","да","да","да","да","да","нет","да","нет","нет","нет","нет","нет","да","нет","нет","нет","нет","да","да","да","да","да","да","нет","да","да","нет","нет","нет","да","нет","нет","нет","нет","нет"]
[42,null,"оператор Попова Анастасия ","да","да","да","да","да","да","да","да","да","да","да","да","да","да","да","да","да","да","да","да","да","да","да","да","да","нет","нет","нет","нет","нет","нет","нет","нет","да","нет","нет","да","да","нет","нет","нет","нет","нет","нет","нет","нет","да","да","да","да","да","да","да","да","да","да","да","да","да","да","да","да","нет","нет","да","да","да","да","да","да","да","нет","нет","нет"]
[43,null,"оператор Гаврикова Екатерина"]
[44,null,"вакансия"]
[45,null,"площадка","нет","нет","да","да","да","да","да","да","да","да","да","да","да","да","да","да","да","да","да","да","да","да","да","да","да","да","да","да","да","да","да","да","да","нет","нет","да","нет","нет","да","да","да","да","да","да","нет","нет","да","да","да","да","да","нет","да","да","да","да","да","да","да","да","да","да","нет","нет","нет","да","да","да","нет","нет","нет","нет","нет","нет"]
[46,null,"Банк","да","да","да","да","да","да","да","да","да","да","да","да","да","да","да",null,null,null,null,null,null,null,null,null,null,null,null,null,null,"да","да","да","да","да","да",null,"да","да",null,null,null,null,null,null,"да","да",null,null,null,null,null,"да",null,null,null,null,"да","да","да",null,"да","да","да","да","да",null,null,"да","да","да","да","да","да","да"]
[null,"оператор ПК","Зайнетдинова Кристина (начало работы)","10:00:00","10:00:00",null,null,null,null,null,null,null,null,null,null,null,null,null,"11:00:00","11:00:00","11:00:00","11:00:00","11:00:00","11:00:00","11:00:00","11:00:00","11:00:00","11:00:00","нет","нет","08:00:00","08:00:00","08:00:00","08:00:00","08:00:00","08:00:00","15:00:00","08:00:00","нет","нет","нет","08:00:00","08:00:00","08:00:00","08:00:00","08:00:00","08:00:00","нет","нет","нет","нет","нет","нет","нет","10:00:00","нет","нет","нет","нет","14:00:00","14:00:00","14:00:00","14:00:00","14:00:00","14:00:00","нет","08:00:00","нет","нет","нет","нет","14:00:00","нет","нет","нет","нет","нет"]
[null,null,"Зайнетдинова Кристина (конец работы)","14:59:00","14:59:00",null,null,null,null,null,null,null,null,null,null,null,null,null,"17:59:00","17:59:00","17:59:00","17:59:00","17:59:00","17:59:00","17:59:00","17:59:00","17:59:00","17:59:00","нет","нет","13:59:00","13:59:00","13:59:00","13:59:00","13:59:00","13:59:00","20:00:00","20:00:00","нет","нет","нет","20:00:00","20:00:00","20:00:00","20:00:00","20:00:00","20:00:00","нет","нет","нет","нет","нет","нет","нет","14:59:00","нет","нет","нет","нет","20:00:00","20:00:00","20:00:00","20:00:00","20:00:00","20:00:00","нет","20:00:00","нет","нет","нет","нет","20:00:00","нет","нет","нет","нет","нет"]
[null,"оператор ПК","Попова Анастасия (начало работы)","05:00:00","05:00:00","05:00:00","05:00:00","05:00:00","05:00:00","05:00:00","05:00:00","05:00:00","05:00:00","05:00:00","05:00:00","05:00:00","05:00:00","05:00:00","05:00:00","05:00:00","05:00:00","05:00:00","05:00:00","05:00:00","05:00:00","05:00:00","05:00:00","05:00:00","нет","нет","нет","нет","нет","нет","нет","нет","05:00:00","нет","нет","05:00:00","05:00:00","нет","нет","нет","нет","нет","нет","нет","07:00:00","05:00:00","05:00:00","05:00:00","05:00:00","05:00:00","05:00:00","05:00:00","05:00:00","05:00:00","05:00:00","05:00:00","05:00:00","05:00:00","05:00:00","05:00:00","05:00:00","нет","нет","нет","05:00:00","05:00:00","05:00:00","05:00:00","05:00:00","05:00:00","нет","05:00:00","нет"]
[null,null,"Попова Анастасия (конец работы)","09:59:00","09:59:00","10:59:00","10:59:00","10:59:00","10:59:00","10:59:00","10:59:00","10:59:00","10:59:00","10:59:00","10:59:00","10:59:00","10:59:00","10:59:00","10:59:00","10:59:00","10:59:00","10:59:00","10:59:00","10:59:00","10:59:00","10:59:00","10:59:00","10:59:00","нет","нет","нет","нет","нет","нет","нет","нет","14:59:00","нет","нет","10:59:00","10:59:00","нет","нет","нет","нет","нет","нет","нет","20:00:00","14:59:00","14:59:00","14:59:00","14:59:00","14:59:00","09:59:00","14:59:00","14:59:00","14:59:00","14:59:00","13:59:00","13:59:00","13:59:00","13:59:00","13:59:00","13:59:00","нет","нет","нет","14:59:00","14:59:00","14:59:00","13:59:00","14:59:00","14:59:00","нет","19:59:00","нет"]
[null,"оператор ПК","Гаврикова Екатерина (начало работы)","15:00:00","15:00:00","11:00:00","11:00:00","11:00:00","11:00:00","11:00:00","11:00:00","11:00:00","11:00:00","11:00:00","11:00:00","11:00:00","11:00:00","11:00:00","18:00:00","18:00:00","18:00:00","18:00:00","18:00:00","18:00:00","18:00:00","18:00:00","18:00:00","18:00:00","нет","нет","14:00:00","14:00:00","14:00:00","14:00:00","14:00:00","14:00:00","нет","нет","нет","11:00:00","11:00:00","нет","нет","нет","нет","нет","нет","нет","нет","15:00:00","15:00:00","15:00:00","15:00:00","15:00:00","15:00:00","15:00:00","15:00:00","15:00:00","15:00:00","нет","нет","нет","нет","нет","нет","07:00:00","нет","нет","15:00:00","15:00:00","15:00:00","нет","15:00:00","15:00:00","нет","нет","нет"]
[null,null,"Гаврикова Екатерина (конец работы)","20:00:00","20:00:00","20:00:00","20:00:00","20:00:00","20:00:00","20:00:00","20:00:00","20:00:00","20:00:00","20:00:00","20:00:00","20:00:00","20:00:00","20:00:00","20:00:00","20:00:00","20:00:00","20:00:00","20:00:00","20:00:00","20:00:00","20:00:00","20:00:00","20:00:00","нет","нет","20:00:00","20:00:00","20:00:00","20:00:00","20:00:00","20:00:00","нет","нет","нет","20:00:00","20:00:00","нет","нет","нет","нет","нет","нет","нет","нет","20:00:00","20:00:00","20:00:00","20:00:00","20:00:00","20:00:00","20:00:00","20:00:00","20:00:00","20:00:00","нет","нет","нет","нет","нет","нет","20:00:00","нет","нет","20:00:00","20:00:00","20:00:00","нет","20:00:00","20:00:00","нет","нет","нет"]
[null,"оператор ПК","вакансия (начало работы)","нет","нет","нет","нет","нет","нет","нет","нет","нет","нет","нет","нет","нет","нет","нет","нет","нет","нет","нет","нет","нет","нет","нет","нет","нет","нет","нет","нет","нет","нет","нет","нет","нет","нет","нет","нет","нет","нет","нет","нет","нет","нет","нет","нет","нет","нет","нет","нет","нет","нет","нет","нет","нет","нет","нет","нет","нет","нет","нет","нет","нет","нет","нет","нет","нет","нет","нет","нет","нет","нет","нет","нет","нет","нет"]
[null,null,"вакансия (конец работы)","нет","нет","нет","нет","нет","нет","нет","нет","нет","нет","нет","нет","нет","нет","нет","нет","нет","нет","нет","нет","нет","нет","нет","нет","нет","нет","нет","нет","нет","нет","нет","нет","нет","нет","нет","нет","нет","нет","нет","нет","нет","нет","нет","нет","нет","нет","нет","нет","нет","нет","нет","нет","нет","нет","нет","нет","нет","нет","нет","нет","нет","нет","нет","нет","нет","нет","нет","нет","нет","нет","нет","нет","нет","нет"]
[]
[null,null,"форма предприятия",{"$f":"IF('параметры заявки'!$D$6='Исходные данные'!$C$6,IF('Исходные данные'!D6=\"да\",1,0),IF('параметры заявки'!$D$6='Исходные данные'!$C$7,IF('Исходные данные'!D7=\"да\",1,0),IF('параметры заявки'!$D$6='Исходные данные'!$C$8,IF('Исходные данные'!D8=\"да\",1,0),IF('параметры заявки'!$D$6='Исходные данные'!$C$9,IF('Исходные данные'!D9=\"да\",1,0),IF('параметры заявки'!$D$6='Исходные данные'!$C$10,IF('Исходные данные'!D10=\"да\",1,0),IF('Исходные данные'!$C$11='параметры заявки'!$D$6,IF('Исходные данные'!D11=\"да\",1,0),IF('параметры заявки'!$D$6='Исходные данные'!$C$12,IF('Исходные данные'!D12=\"да\",1,0),IF('параметры заявки'!$D$6='Исходные данные'!$C$13,IF('Исходные данные'!D13=\"да\",1,0)))))))))","v":1},{"$f":"IF('параметры заявки'!$D$6='Исходные данные'!$C$6,IF('Исходные данные'!E6=\"да\",1,0),IF('параметры заявки'!$D$6='Исходные данные'!$C$7,IF('Исходные данные'!E7=\"да\",1,0),IF('параметры заявки'!$D$6='Исходные данные'!$C$8,IF('Исходные данные'!E8=\"да\",1,0),IF('параметры заявки'!$D$6='Исходные данные'!$C$9,IF('Исходные данные'!E9=\"да\",1,0),IF('параметры заявки'!$D$6='Исходные данные'!$C$10,IF('Исходные данные'!E10=\"да\",1,0),IF('Исходные данные'!$C$11='параметры заявки'!$D$6,IF('Исходные данные'!E11=\"да\",1,0),IF('параметры заявки'!$D$6='Исходные данные'!$C$12,IF('Исходные данные'!E12=\"да\",1,0),IF('параметры заявки'!$D$6='Исходные данные'!$C$13,IF('Исходные данные'!E13=\"да\",1,0)))))))))","v":1},{"$f":"IF('параметры заявки'!$D$6='Исходные данные'!$C$6,IF('Исходные данные'!F6=\"да\",1,0),IF('параметры заявки'!$D$6='Исходные данные'!$C$7,IF('Исходные данные'!F7=\"да\",1,0),IF('параметры заявки'!$D$6='Исходные данные'!$C$8,IF('Исходные данные'!F8=\"да\",1,0),IF('параметры заявки'!$D$6='Исходные данные'!$C$9,IF('Исходные данные'!F9=\"да\",1,0),IF('параметры заявки'!$D$6='Исходные данные'!$C$10,IF('Исходные данные'!F10=\"да\",1,0),IF('Исходные данные'!$C$11='параметры заявки'!$D$6,IF('Исходные данные'!F11=\"да\",1,0),IF('параметры заявки'!$D$6='Исходные данные'!$C$12,IF('Исходные данные'!F12=\"да\",1,0),IF('параметры заявки'!$D$6='Исходные данные'!$C$13,IF('Исходные данные'!F13=\"да\",1,0)))))))))","v":1},{"$f":"IF('параметры заявки'!$D$6='Исходные данные'!$C$6,IF('Исходные данные'!G6=\"да\",1,0),IF('параметры заявки'!$D$6='Исходные данные'!$C$7,IF('Исходные данные'!G7=\"да\",1,0),IF('параметры заявки'!$D$6='Исходные данные'!$C$8,IF('Исходные данные'!G8=\"да\",1,0),IF('параметры заявки'!$D$6='Исходные данные'!$C$9,IF('Исходные данные'!G9=\"да\",1,0),IF('параметры заявки'!$D$6='Исходные данные'!$C$10,IF('Исходные данные'!G10=\"да\",1,0),IF('Исходные данные'!$C$11='параметры заявки'!$D$6,IF('Исходные данные'!G11=\"да\",1,0),IF('параметры заявки'!$D$6='Исходные данные'!$C$12,IF('Исходные данные'!G12=\"да\",1,0),IF('параметры заявки'!$D$6='Исходные данные'!$C$13,IF('Исходные данные'!G13=\"да\",1,0)))))))))","v":1},{"$f":"IF('параметры заявки'!$D$6='Исходные данные'!$C$6,IF('Исходные данные'!H6=\"да\",1,0),IF('параметры заявки'!$D$6='Исходные данные'!$C$7,IF('Исходные данные'!H7=\"да\",1,0),IF('параметры заявки'!$D$6='Исходные данные'!$C$8,IF('Исходные данные'!H8=\"да\",1,0),IF('параметры заявки'!$D$6='Исходные данные'!$C$9,IF('Исходные данные'!H9=\"да\",1,0),IF('параметры заявки'!$D$6='Исходные данные'!$C$10,IF('Исходные данные'!H10=\"да\",1,0),IF('Исходные данные'!$C$11='параметры заявки'!$D$6,IF('Исходные данные'!H11=\"да\",1,0),IF('параметры заявки'!$D$6='Исходные данные'!$C$12,IF('Исходные данные'!H12=\"да\",1,0),IF('параметры заявки'!$D$6='Исходные данные'!$C$13,IF('Исходные данные'!H13=\"да\",1,0)))))))))","v":1},{"$f":"IF('параметры заявки'!$D$6='Исходные данные'!$C$6,IF('Исходные данные'!I6=\"да\",1,0),IF('параметры заявки'!$D$6='Исходные данные'!$C$7,IF('Исходные данные'!I7=\"да\",1,0),IF('параметры заявки'!$D$6='Исходные данные'!$C$8,IF('Исходные данные'!I8=\"да\",1,0),IF('параметры заявки'!$D$6='Исходные данные'!$C$9,IF('Исходные данные'!I9=\"да\",1,0),IF('параметры заявки'!$D$6='Исходные данные'!$C$10,IF('Исходные данные'!I10=\"да\",1,0),IF('Исходные данные'!$C$11='параметры заявки'!$D$6,IF('Исходные данные'!I11=\"да\",1,0),IF('параметры заявки'!$D$6='Исходные данные'!$C$12,IF('Исходные данные'!I12=\"да\",1,0),IF('параметры заявки'!$D$6='Исходные данные'!$C$13,IF('Исходные данные'!I13=\"да\",1,0)))))))))","v":1},{"$f":"IF('параметры заявки'!$D$6='Исходные данные'!$C$6,IF('Исходные данные'!J6=\"да\",1,0),IF('параметры заявки'!$D$6='Исходные данные'!$C$7,IF('Исходные данные'!J7=\"да\",1,0),IF('параметры заявки'!$D$6='Исходные данные'!$C$8,IF('Исходные данные'!J8=\"да\",1,0),IF('параметры заявки'!$D$6='Исходные данные'!$C$9,IF('Исходные данные'!J9=\"да\",1,0),IF('параметры заявки'!$D$6='Исходные данные'!$C$10,IF('Исходные данные'!J10=\"да\",1,0),IF('Исходные данные'!$C$11='параметры заявки'!$D$6,IF('Исходные данные'!J11=\"да\",1,0),IF('параметры заявки'!$D$6='Исходные данные'!$C$12,IF('Исходные данные'!J12=\"да\",1,0),IF('параметры заявки'!$D$6='Исходные данные'!$C$13,IF('Исходные данные'!J13=\"да\",1,0)))))))))","v":1},{"$f":"IF('параметры заявки'!$D$6='Исходные данные'!$C$6,IF('Исходные данные'!K6=\"да\",1,0),IF('параметры заявки'!$D$6='Исходные данные'!$C$7,IF('Исходные данные'!K7=\"да\",1,0),IF('параметры заявки'!$D$6='Исходные данные'!$C$8,IF('Исходные данные'!K8=\"да\",1,0),IF('параметры заявки'!$D$6='Исходные данные'!$C$9,IF('Исходные данные'!K9=\"да\",1,0),IF('параметры заявки'!$D$6='Исходные данные'!$C$10,IF('Исходные данные'!K10=\"да\",1,0),IF('Исходные данные'!$C$11='параметры заявки'!$D$6,IF('Исходные данные'!K11=\"да\",1,0),IF('параметры заявки'!$D$6='Исходные данные'!$C$12,IF('Исходные данные'!K12=\"да\",1,0),IF('параметры заявки'!$D$6='Исходные данные'!$C$13,IF('Исходные данные'!K13=\"да\",1,0)))))))))","v":1},{"$f":"IF('параметры заявки'!$D$6='Исходные данные'!$C$6,IF('Исходные данные'!L6=\"да\",1,0),IF('параметры заявки'!$D$6='Исходные данные'!$C$7,IF('Исходные данные'!L7=\"да\",1,0),IF('параметры заявки'!$D$6='Исходные данные'!$C$8,IF('Исходные данные'!L8=\"да\",1,0),IF('параметры заявки'!$D$6='Исходные данные'!$C$9,IF('Исходные данные'!L9=\"да\",1,0),IF('параметры заявки'!$D$6='Исходные данные'!$C$10,IF('Исходные данные'!L10=\"да\",1,0),IF('Исходные данные'!$C$11='параметры заявки'!$D$6,IF('Исходные данные'!L11=\"да\",1,0),IF('параметры заявки'!$D$6='Исходные данные'!$C$12,IF('Исходные данные'!L12=\"да\",1,0),IF('параметры заявки'!$D$6='Исходные данные'!$C$13,IF('Исходные данные'!L13=\"да\",1,0)))))))))","v":1},{"$f":"IF('параметры заявки'!$D$6='Исходные данные'!$C$6,IF('Исходные данные'!M6=\"да\",1,0),IF('параметры заявки'!$D$6='Исходные данные'!$C$7,IF('Исходные данные'!M7=\"да\",1,0),IF('параметры заявки'!$D$6='Исходные данные'!$C$8,IF('Исходные данные'!M8=\"да\",1,0),IF('параметры заявки'!$D$6='Исходные данные'!$C$9,IF('Исходные данные'!M9=\"да\",1,0),IF('параметры заявки'!$D$6='Исходные данные'!$C$10,IF('Исходные данные'!M10=\"да\",1,0),IF('Исходные данные'!$C$11='параметры заявки'!$D$6,IF('Исходные данные'!M11=\"да\",1,0),IF('параметры заявки'!$D$6='Исходные данные'!$C$12,IF('Исходные данные'!M12=\"да\",1,0),IF('параметры заявки'!$D$6='Исходные данные'!$C$13,IF('Исходные данные'!M13=\"да\",1,0)))))))))","v":1},{"$f":"IF('параметры заявки'!$D$6='Исходные данные'!$C$6,IF('Исходные данные'!N6=\"да\",1,0),IF('параметры заявки'!$D$6='Исходные данные'!$C$7,IF('Исходные данные'!N7=\"да\",1,0),IF('параметры заявки'!$D$6='Исходные данные'!$C$8,IF('Исходные данные'!N8=\"да\",1,0),IF('параметры заявки'!$D$6='Исходные данные'!$C$9,IF('Исходные данные'!N9=\"да\",1,0),IF('параметры заявки'!$D$6='Исходные данные'!$C$10,IF('Исходные данные'!N10=\"да\",1,0),IF('Исходные данные'!$C$11='параметры заявки'!$D$6,IF('Исходные данные'!N11=\"да\",1,0),IF('параметры заявки'!$D$6='Исходные данные'!$C$12,IF('Исходные данные'!N12=\"да\",1,0),IF('параметры заявки'!$D$6='Исходные данные'!$C$13,IF('Исходные данные'!N13=\"да\",1,0)))))))))","v":1},{"$f":"IF('параметры заявки'!$D$6='Исходные данные'!$C$6,IF('Исходные данные'!O6=\"да\",1,0),IF('параметры заявки'!$D$6='Исходные данные'!$C$7,IF('Исходные данные'!O7=\"да\",1,0),IF('параметры заявки'!$D$6='Исходные данные'!$C$8,IF('Исходные данные'!O8=\"да\",1,0),IF('параметры заявки'!$D$6='Исходные данные'!$C$9,IF('Исходные данные'!O9=\"да\",1,0),IF('параметры заявки'!$D$6='Исходные данные'!$C$10,IF('Исходные данные'!O10=\"да\",1,0),IF('Исходные данные'!$C$11='параметры заявки'!$D$6,IF('Исходные данные'!O11=\"да\",1,0),IF('параметры заявки'!$D$6='Исходные данные'!$C$12,IF('Исходные данные'!O12=\"да\",1,0),IF('параметры заявки'!$D$6='Исходные данные'!$C$13,IF('Исходные данные'!O13=\"да\",1,0)))))))))","v":1},{"$f":"IF('параметры заявки'!$D$6='Исходные данные'!$C$6,IF('Исходные данные'!P6=\"да\",1,0),IF('параметры заявки'!$D$6='Исходные данные'!$C$7,IF('Исходные данные'!P7=\"да\",1,0),IF('параметры заявки'!$D$6='Исходные данные'!$C$8,IF('Исходные данные'!P8=\"да\",1,0),IF('параметры заявки'!$D$6='Исходные данные'!$C$9,IF('Исходные данные'!P9=\"да\",1,0),IF('параметры заявки'!$D$6='Исходные данные'!$C$10,IF('Исходные данные'!P10=\"да\",1,0),IF('Исходные данные'!$C$11='параметры заявки'!$D$6,IF('Исходные данные'!P11=\"да\",1,0),IF('параметры заявки'!$D$6='Исходные данные'!$C$12,IF('Исходные данные'!P12=\"да\",1,0),IF('параметры заявки'!$D$6='Исходные данные'!$C$13,IF('Исходные данные'!P13=\"да\",1,0)))))))))","v":1},{"$f":"IF('параметры заявки'!$D$6='Исходные данные'!$C$6,IF('Исходные данные'!Q6=\"да\",1,0),IF('параметры заявки'!$D$6='Исходные данные'!$C$7,IF('Исходные данные'!Q7=\"да\",1,0),IF('параметры заявки'!$D$6='Исходные данные'!$C$8,IF('Исходные данные'!Q8=\"да\",1,0),IF('параметры заявки'!$D$6='Исходные данные'!$C$9,IF('Исходные данные'!Q9=\"да\",1,0),IF('параметры заявки'!$D$6='Исходные данные'!$C$10,IF('Исходные данные'!Q10=\"да\",1,0),IF('Исходные данные'!$C$11='параметры заявки'!$D$6,IF('Исходные данные'!Q11=\"да\",1,0),IF('параметры заявки'!$D$6='Исходные данные'!$C$12,IF('Исходные данные'!Q12=\"да\",1,0),IF('параметры заявки'!$D$6='Исходные данные'!$C$13,IF('Исходные данные'!Q13=\"да\",1,0)))))))))","v":1},{"$f":"IF('параметры заявки'!$D$6='Исходные данные'!$C$6,IF('Исходные данные'!R6=\"да\",1,0),IF('параметры заявки'!$D$6='Исходные данные'!$C$7,IF('Исходные данные'!R7=\"да\",1,0),IF('параметры заявки'!$D$6='Исходные данные'!$C$8,IF('Исходные данные'!R8=\"да\",1,0),IF('параметры заявки'!$D$6='Исходные данные'!$C$9,IF('Исходные данные'!R9=\"да\",1,0),IF('параметры заявки'!$D$6='Исходные данные'!$C$10,IF('Исходные данные'!R10=\"да\",1,0),IF('Исходные данные'!$C$11='параметры заявки'!$D$6,IF('Исходные данные'!R11=\"да\",1,0),IF('параметры заявки'!$D$6='Исходные данные'!$C$12,IF('Исходные данные'!R12=\"да\",1,0),IF('параметры заявки'!$D$6='Исходные данные'!$C$13,IF('Исходные данные'!R13=\"да\",1,0)))))))))","v":1},{"$f":"IF('параметры заявки'!$D$6='Исходные данные'!$C$6,IF('Исходные данные'!S6=\"да\",1,0),IF('параметры заявки'!$D$6='Исходные данные'!$C$7,IF('Исходные данные'!S7=\"да\",1,0),IF('параметры заявки'!$D$6='Исходные данные'!$C$8,IF('Исходные данные'!S8=\"да\",1,0),IF('параметры заявки'!$D$6='Исходные данные'!$C$9,IF('Исходные данные'!S9=\"да\",1,0),IF('параметры заявки'!$D$6='Исходные данные'!$C$10,IF('Исходные данные'!S10=\"да\",1,0),IF('Исходные данные'!$C$11='параметры заявки'!$D$6,IF('Исходные данные'!S11=\"да\",1,0),IF('параметры заявки'!$D$6='Исходные данные'!$C$12,IF('Исходные данные'!S12=\"да\",1,0),IF('параметры заявки'!$D$6='Исходные данные'!$C$13,IF('Исходные данные'!S13=\"да\",1,0)))))))))","v":1},{"$f":"IF('параметры заявки'!$D$6='Исходные данные'!$C$6,IF('Исходные данные'!T6=\"да\",1,0),IF('параметры заявки'!$D$6='Исходные данные'!$C$7,IF('Исходные данные'!T7=\"да\",1,0),IF('параметры заявки'!$D$6='Исходные данные'!$C$8,IF('Исходные данные'!T8=\"да\",1,0),IF('параметры заявки'!$D$6='Исходные данные'!$C$9,IF('Исходные данные'!T9=\"да\",1,0),IF('параметры заявки'!$D$6='Исходные данные'!$C$10,IF('Исходные данные'!T10=\"да\",1,0),IF('Исходные данные'!$C$11='параметры заявки'!$D$6,IF('Исходные данные'!T11=\"да\",1,0),IF('параметры заявки'!$D$6='Исходные данные'!$C$12,IF('Исходные данные'!T12=\"да\",1,0),IF('параметры заявки'!$D$6='Исходные данные'!$C$13,IF('Исходные данные'!T13=\"да\",1,0)))))))))","v":1},{"$f":"IF('параметры заявки'!$D$6='Исходные данные'!$C$6,IF('Исходные данные'!U6=\"да\",1,0),IF('параметры заявки'!$D$6='Исходные данные'!$C$7,IF('Исходные данные'!U7=\"да\",1,0),IF('параметры заявки'!$D$6='Исходные данные'!$C$8,IF('Исходные данные'!U8=\"да\",1,0),IF('параметры заявки'!$D$6='Исходные данные'!$C$9,IF('Исходные данные'!U9=\"да\",1,0),IF('параметры заявки'!$D$6='Исходные данные'!$C$10,IF('Исходные данные'!U10=\"да\",1,0),IF('Исходные данные'!$C$11='параметры заявки'!$D$6,IF('Исходные данные'!U11=\"да\",1,0),IF('параметры заявки'!$D$6='Исходные данные'!$C$12,IF('Исходные данные'!U12=\"да\",1,0),IF('параметры заявки'!$D$6='Исходные данные'!$C$13,IF('Исходные данные'!U13=\"да\",1,0)))))))))","v":1},{"$f":"IF('параметры заявки'!$D$6='Исходные данные'!$C$6,IF('Исходные данные'!V6=\"да\",1,0),IF('параметры заявки'!$D$6='Исходные данные'!$C$7,IF('Исходные данные'!V7=\"да\",1,0),IF('параметры заявки'!$D$6='Исходные данные'!$C$8,IF('Исходные данные'!V8=\"да\",1,0),IF('параметры заявки'!$D$6='Исходные данные'!$C$9,IF('Исходные данные'!V9=\"да\",1,0),IF('параметры заявки'!$D$6='Исходные данные'!$C$10,IF('Исходные данные'!V10=\"да\",1,0),IF('Исходные данные'!$C$11='параметры заявки'!$D$6,IF('Исходные данные'!V11=\"да\",1,0),IF('параметры заявки'!$D$6='Исходные данные'!$C$12,IF('Исходные данные'!V12=\"да\",1,0),IF('параметры заявки'!$D$6='Исходные данные'!$C$13,IF('Исходные данные'!V13=\"да\",1,0)))))))))","v":1},{"$f":"IF('параметры заявки'!$D$6='Исходные данные'!$C$6,IF('Исходные данные'!W6=\"да\",1,0),IF('параметры заявки'!$D$6='Исходные данные'!$C$7,IF('Исходные данные'!W7=\"да\",1,0),IF('параметры заявки'!$D$6='Исходные данные'!$C$8,IF('Исходные данные'!W8=\"да\",1,0),IF('параметры заявки'!$D$6='Исходные данные'!$C$9,IF('Исходные данные'!W9=\"да\",1,0),IF('параметры заявки'!$D$6='Исходные данные'!$C$10,IF('Исходные данные'!W10=\"да\",1,0),IF('Исходные данные'!$C$11='параметры заявки'!$D$6,IF('Исходные данные'!W11=\"да\",1,0),IF('параметры заявки'!$D$6='Исходные данные'!$C$12,IF('Исходные данные'!W12=\"да\",1,0),IF('параметры заявки'!$D$6='Исходные данные'!$C$13,IF('Исходные данные'!W13=\"да\",1,0)))))))))","v":1},{"$f":"IF('параметры заявки'!$D$6='Исходные данные'!$C$6,IF('Исходные данные'!X6=\"да\",1,0),IF('параметры заявки'!$D$6='Исходные данные'!$C$7,IF('Исходные данные'!X7=\"да\",1,0),IF('параметры заявки'!$D$6='Исходные данные'!$C$8,IF('Исходные данные'!X8=\"да\",1,0),IF('параметры заявки'!$D$6='Исходные данные'!$C$9,IF('Исходные данные'!X9=\"да\",1,0),IF('параметры заявки'!$D$6='Исходные данные'!$C$10,IF('Исходные данные'!X10=\"да\",1,0),IF('Исходные данные'!$C$11='параметры заявки'!$D$6,IF('Исходные данные'!X11=\"да\",1,0),IF('параметры заявки'!$D$6='Исходные данные'!$C$12,IF('Исходные данные'!X12=\"да\",1,0),IF('параметры заявки'!$D$6='Исходные данные'!$C$13,IF('Исходные данные'!X13=\"да\",1,0)))))))))","v":1},{"$f":"IF('параметры заявки'!$D$6='Исходные данные'!$C$6,IF('Исходные данные'!Y6=\"да\",1,0),IF('параметры заявки'!$D$6='Исходные данные'!$C$7,IF('Исходные данные'!Y7=\"да\",1,0),IF('параметры заявки'!$D$6='Исходные данные'!$C$8,IF('Исходные данные'!Y8=\"да\",1,0),IF('параметры заявки'!$D$6='Исходные данные'!$C$9,IF('Исходные данные'!Y9=\"да\",1,0),IF('параметры заявки'!$D$6='Исходные данные'!$C$10,IF('Исходные данные'!Y10=\"да\",1,0),IF('Исходные данные'!$C$11='параметры заявки'!$D$6,IF('Исходные данные'!Y11=\"да\",1,0),IF('параметры заявки'!$D$6='Исходные данные'!$C$12,IF('Исходные данные'!Y12=\"да\",1,0),IF('параметры заявки'!$D$6='Исходные данные'!$C$13,IF('Исходные данные'!Y13=\"да\",1,0)))))))))","v":1},{"$f":"IF('параметры заявки'!$D$6='Исходные данные'!$C$6,IF('Исходные данные'!Z6=\"да\",1,0),IF('параметры заявки'!$D$6='Исходные данные'!$C$7,IF('Исходные данные'!Z7=\"да\",1,0),IF('параметры заявки'!$D$6='Исходные данные'!$C$8,IF('Исходные данные'!Z8=\"да\",1,0),IF('параметры заявки'!$D$6='Исходные данные'!$C$9,IF('Исходные данные'!Z9=\"да\",1,0),IF('параметры заявки'!$D$6='Исходные данные'!$C$10,IF('Исходные данные'!Z10=\"да\",1,0),IF('Исходные данные'!$C$11='параметры заявки'!$D$6,IF('Исходные данные'!Z11=\"да\",1,0),IF('параметры заявки'!$D$6='Исходные данные'!$C$12,IF('Исходные данные'!Z12=\"да\",1,0),IF('параметры заявки'!$D$6='Исходные данные'!$C$13,IF('Исходные данные'!Z13=\"да\",1,0)))))))))","v":1},{"$f":"IF('параметры заявки'!$D$6='Исходные данные'!$C$6,IF('Исходные данные'!AA6=\"да\",1,0),IF('параметры заявки'!$D$6='Исходные данные'!$C$7,IF('Исходные данные'!AA7=\"да\",1,0),IF('параметры заявки'!$D$6='Исходные данные'!$C$8,IF('Исходные данные'!AA8=\"да\",1,0),IF('параметры заявки'!$D$6='Исходные данные'!$C$9,IF('Исходные данные'!AA9=\"да\",1,0),IF('параметры заявки'!$D$6='Исходные данные'!$C$10,IF('Исходные данные'!AA10=\"да\",1,0),IF('Исходные данные'!$C$11='параметры заявки'!$D$6,IF('Исходные данные'!AA11=\"да\",1,0),IF('параметры заявки'!$D$6='Исходные данные'!$C$12,IF('Исходные данные'!AA12=\"да\",1,0),IF('параметры заявки'!$D$6='Исходные данные'!$C$13,IF('Исходные данные'!AA13=\"да\",1,0)))))))))","v":1},{"$f":"IF('параметры заявки'!$D$6='Исходные данные'!$C$6,IF('Исходные данные'!AB6=\"да\",1,0),IF('параметры заявки'!$D$6='Исходные данные'!$C$7,IF('Исходные данные'!AB7=\"да\",1,0),IF('параметры заявки'!$D$6='Исходные данные'!$C$8,IF('Исходные данные'!AB8=\"да\",1,0),IF('параметры заявки'!$D$6='Исходные данные'!$C$9,IF('Исходные данные'!AB9=\"да\",1,0),IF('параметры заявки'!$D$6='Исходные данные'!$C$10,IF('Исходные данные'!AB10=\"да\",1,0),IF('Исходные данные'!$C$11='параметры заявки'!$D$6,IF('Исходные данные'!AB11=\"да\",1,0),IF('параметры заявки'!$D$6='Исходные данные'!$C$12,IF('Исходные данные'!AB12=\"да\",1,0),IF('параметры заявки'!$D$6='Исходные данные'!$C$13,IF('Исходные данные'!AB13=\"да\",1,0)))))))))","v":1},{"$f":"IF('параметры заявки'!$D$6='Исходные данные'!$C$6,IF('Исходные данные'!AC6=\"да\",1,0),IF('параметры заявки'!$D$6='Исходные данные'!$C$7,IF('Исходные данные'!AC7=\"да\",1,0),IF('параметры заявки'!$D$6='Исходные данные'!$C$8,IF('Исходные данные'!AC8=\"да\",1,0),IF('параметры заявки'!$D$6='Исходные данные'!$C$9,IF('Исходные данные'!AC9=\"да\",1,0),IF('параметры заявки'!$D$6='Исходные данные'!$C$10,IF('Исходные данные'!AC10=\"да\",1,0),IF('Исходные данные'!$C$11='параметры заявки'!$D$6,IF('Исходные данные'!AC11=\"да\",1,0),IF('параметры заявки'!$D$6='Исходные данные'!$C$12,IF('Исходные данные'!AC12=\"да\",1,0),IF('параметры заявки'!$D$6='Исходные данные'!$C$13,IF('Исходные данные'!AC13=\"да\",1,0)))))))))","v":1},{"$f":"IF('параметры заявки'!$D$6='Исходные данные'!$C$6,IF('Исходные данные'!AD6=\"да\",1,0),IF('параметры заявки'!$D$6='Исходные данные'!$C$7,IF('Исходные данные'!AD7=\"да\",1,0),IF('параметры заявки'!$D$6='Исходные данные'!$C$8,IF('Исходные данные'!AD8=\"да\",1,0),IF('параметры заявки'!$D$6='Исходные данные'!$C$9,IF('Исходные данные'!AD9=\"да\",1,0),IF('параметры заявки'!$D$6='Исходные данные'!$C$10,IF('Исходные данные'!AD10=\"да\",1,0),IF('Исходные данные'!$C$11='параметры заявки'!$D$6,IF('Исходные данные'!AD11=\"да\",1,0),IF('параметры заявки'!$D$6='Исходные данные'!$C$12,IF('Исходные данные'!AD12=\"да\",1,0),IF('параметры заявки'!$D$6='Исходные данные'!$C$13,IF('Исходные данные'!AD13=\"да\",1,0)))))))))","v":1},{"$f":"IF('параметры заявки'!$D$6='Исходные данные'!$C$6,IF('Исходные данные'!AE6=\"да\",1,0),IF('параметры заявки'!$D$6='Исходные данные'!$C$7,IF('Исходные данные'!AE7=\"да\",1,0),IF('параметры заявки'!$D$6='Исходные данные'!$C$8,IF('Исходные данные'!AE8=\"да\",1,0),IF('параметры заявки'!$D$6='Исходные данные'!$C$9,IF('Исходные данные'!AE9=\"да\",1,0),IF('параметры заявки'!$D$6='Исходные данные'!$C$10,IF('Исходные данные'!AE10=\"да\",1,0),IF('Исходные данные'!$C$11='параметры заявки'!$D$6,IF('Исходные данные'!AE11=\"да\",1,0),IF('параметры заявки'!$D$6='Исходные данные'!$C$12,IF('Исходные данные'!AE12=\"да\",1,0),IF('параметры заявки'!$D$6='Исходные данные'!$C$13,IF('Исходные данные'!AE13=\"да\",1,0)))))))))","v":1},{"$f":"IF('параметры заявки'!$D$6='Исходные данные'!$C$6,IF('Исходные данные'!AF6=\"да\",1,0),IF('параметры заявки'!$D$6='Исходные данные'!$C$7,IF('Исходные данные'!AF7=\"да\",1,0),IF('параметры заявки'!$D$6='Исходные данные'!$C$8,IF('Исходные данные'!AF8=\"да\",1,0),IF('параметры заявки'!$D$6='Исходные данные'!$C$9,IF('Исходные данные'!AF9=\"да\",1,0),IF('параметры заявки'!$D$6='Исходные данные'!$C$10,IF('Исходные данные'!AF10=\"да\",1,0),IF('Исходные данные'!$C$11='параметры заявки'!$D$6,IF('Исходные данные'!AF11=\"да\",1,0),IF('параметры заявки'!$D$6='Исходные данные'!$C$12,IF('Исходные данные'!AF12=\"да\",1,0),IF('параметры заявки'!$D$6='Исходные данные'!$C$13,IF('Исходные данные'!AF13=\"да\",1,0)))))))))","v":1},{"$f":"IF('параметры заявки'!$D$6='Исходные данные'!$C$6,IF('Исходные данные'!AG6=\"да\",1,0),IF('параметры заявки'!$D$6='Исходные данные'!$C$7,IF('Исходные данные'!AG7=\"да\",1,0),IF('параметры заявки'!$D$6='Исходные данные'!$C$8,IF('Исходные данные'!AG8=\"да\",1,0),IF('параметры заявки'!$D$6='Исходные данные'!$C$9,IF('Исходные данные'!AG9=\"да\",1,0),IF('параметры заявки'!$D$6='Исходные данные'!$C$10,IF('Исходные данные'!AG10=\"да\",1,0),IF('Исходные данные'!$C$11='параметры заявки'!$D$6,IF('Исходные данные'!AG11=\"да\",1,0),IF('параметры заявки'!$D$6='Исходные данные'!$C$12,IF('Исходные данные'!AG12=\"да\",1,0),IF('параметры заявки'!$D$6='Исходные данные'!$C$13,IF('Исходные данные'!AG13=\"да\",1,0)))))))))","v":1},{"$f":"IF('параметры заявки'!$D$6='Исходные данные'!$C$6,IF('Исходные данные'!AH6=\"да\",1,0),IF('параметры заявки'!$D$6='Исходные данные'!$C$7,IF('Исходные данные'!AH7=\"да\",1,0),IF('параметры заявки'!$D$6='Исходные данные'!$C$8,IF('Исходные данные'!AH8=\"да\",1,0),IF('параметры заявки'!$D$6='Исходные данные'!$C$9,IF('Исходные данные'!AH9=\"да\",1,0),IF('параметры заявки'!$D$6='Исходные данные'!$C$10,IF('Исходные данные'!AH10=\"да\",1,0),IF('Исходные данные'!$C$11='параметры заявки'!$D$6,IF('Исходные данные'!AH11=\"да\",1,0),IF('параметры заявки'!$D$6='Исходные данные'!$C$12,IF('Исходные данные'!AH12=\"да\",1,0),IF('параметры заявки'!$D$6='Исходные данные'!$C$13,IF('Исходные данные'!AH13=\"да\",1,0)))))))))","v":1},{"$f":"IF('параметры заявки'!$D$6='Исходные данные'!$C$6,IF('Исходные данные'!AI6=\"да\",1,0),IF('параметры заявки'!$D$6='Исходные данные'!$C$7,IF('Исходные данные'!AI7=\"да\",1,0),IF('параметры заявки'!$D$6='Исходные данные'!$C$8,IF('Исходные данные'!AI8=\"да\",1,0),IF('параметры заявки'!$D$6='Исходные данные'!$C$9,IF('Исходные данные'!AI9=\"да\",1,0),IF('параметры заявки'!$D$6='Исходные данные'!$C$10,IF('Исходные данные'!AI10=\"да\",1,0),IF('Исходные данные'!$C$11='параметры заявки'!$D$6,IF('Исходные данные'!AI11=\"да\",1,0),IF('параметры заявки'!$D$6='Исходные данные'!$C$12,IF('Исходные данные'!AI12=\"да\",1,0),IF('параметры заявки'!$D$6='Исходные данные'!$C$13,IF('Исходные данные'!AI13=\"да\",1,0)))))))))","v":1},{"$f":"IF('параметры заявки'!$D$6='Исходные данные'!$C$6,IF('Исходные данные'!AJ6=\"да\",1,0),IF('параметры заявки'!$D$6='Исходные данные'!$C$7,IF('Исходные данные'!AJ7=\"да\",1,0),IF('параметры заявки'!$D$6='Исходные данные'!$C$8,IF('Исходные данные'!AJ8=\"да\",1,0),IF('параметры заявки'!$D$6='Исходные данные'!$C$9,IF('Исходные данные'!AJ9=\"да\",1,0),IF('параметры заявки'!$D$6='Исходные данные'!$C$10,IF('Исходные данные'!AJ10=\"да\",1,0),IF('Исходные данные'!$C$11='параметры заявки'!$D$6,IF('Исходные данные'!AJ11=\"да\",1,0),IF('параметры заявки'!$D$6='Исходные данные'!$C$12,IF('Исходные данные'!AJ12=\"да\",1,0),IF('параметры заявки'!$D$6='Исходные данные'!$C$13,IF('Исходные данные'!AJ13=\"да\",1,0)))))))))","v":1},{"$f":"IF('параметры заявки'!$D$6='Исходные данные'!$C$6,IF('Исходные данные'!AK6=\"да\",1,0),IF('параметры заявки'!$D$6='Исходные данные'!$C$7,IF('Исходные данные'!AK7=\"да\",1,0),IF('параметры заявки'!$D$6='Исходные данные'!$C$8,IF('Исходные данные'!AK8=\"да\",1,0),IF('параметры заявки'!$D$6='Исходные данные'!$C$9,IF('Исходные данные'!AK9=\"да\",1,0),IF('параметры заявки'!$D$6='Исходные данные'!$C$10,IF('Исходные данные'!AK10=\"да\",1,0),IF('Исходные данные'!$C$11='параметры заявки'!$D$6,IF('Исходные данные'!AK11=\"да\",1,0),IF('параметры заявки'!$D$6='Исходные данные'!$C$12,IF('Исходные данные'!AK12=\"да\",1,0),IF('параметры заявки'!$D$6='Исходные данные'!$C$13,IF('Исходные данные'!AK13=\"да\",1,0)))))))))","v":1},{"$f":"IF('параметры заявки'!$D$6='Исходные данные'!$C$6,IF('Исходные данные'!AL6=\"да\",1,0),IF('параметры заявки'!$D$6='Исходные данные'!$C$7,IF('Исходные данные'!AL7=\"да\",1,0),IF('параметры заявки'!$D$6='Исходные данные'!$C$8,IF('Исходные данные'!AL8=\"да\",1,0),IF('параметры заявки'!$D$6='Исходные данные'!$C$9,IF('Исходные данные'!AL9=\"да\",1,0),IF('параметры заявки'!$D$6='Исходные данные'!$C$10,IF('Исходные данные'!AL10=\"да\",1,0),IF('Исходные данные'!$C$11='параметры заявки'!$D$6,IF('Исходные данные'!AL11=\"да\",1,0),IF('параметры заявки'!$D$6='Исходные данные'!$C$12,IF('Исходные данные'!AL12=\"да\",1,0),IF('параметры заявки'!$D$6='Исходные данные'!$C$13,IF('Исходные данные'!AL13=\"да\",1,0)))))))))","v":1},{"$f":"IF('параметры заявки'!$D$6='Исходные данные'!$C$6,IF('Исходные данные'!AM6=\"да\",1,0),IF('параметры заявки'!$D$6='Исходные данные'!$C$7,IF('Исходные данные'!AM7=\"да\",1,0),IF('параметры заявки'!$D$6='Исходные данные'!$C$8,IF('Исходные данные'!AM8=\"да\",1,0),IF('параметры заявки'!$D$6='Исходные данные'!$C$9,IF('Исходные данные'!AM9=\"да\",1,0),IF('параметры заявки'!$D$6='Исходные данные'!$C$10,IF('Исходные данные'!AM10=\"да\",1,0),IF('Исходные данные'!$C$11='параметры заявки'!$D$6,IF('Исходные данные'!AM11=\"да\",1,0),IF('параметры заявки'!$D$6='Исходные данные'!$C$12,IF('Исходные данные'!AM12=\"да\",1,0),IF('параметры заявки'!$D$6='Исходные данные'!$C$13,IF('Исходные данные'!AM13=\"да\",1,0)))))))))","v":1},{"$f":"IF('параметры заявки'!$D$6='Исходные данные'!$C$6,IF('Исходные данные'!AN6=\"да\",1,0),IF('параметры заявки'!$D$6='Исходные данные'!$C$7,IF('Исходные данные'!AN7=\"да\",1,0),IF('параметры заявки'!$D$6='Исходные данные'!$C$8,IF('Исходные данные'!AN8=\"да\",1,0),IF('параметры заявки'!$D$6='Исходные данные'!$C$9,IF('Исходные данные'!AN9=\"да\",1,0),IF('параметры заявки'!$D$6='Исходные данные'!$C$10,IF('Исходные данные'!AN10=\"да\",1,0),IF('Исходные данные'!$C$11='параметры заявки'!$D$6,IF('Исходные данные'!AN11=\"да\",1,0),IF('параметры заявки'!$D$6='Исходные данные'!$C$12,IF('Исходные данные'!AN12=\"да\",1,0),IF('параметры заявки'!$D$6='Исходные данные'!$C$13,IF('Исходные данные'!AN13=\"да\",1,0)))))))))","v":1},{"$f":"IF('параметры заявки'!$D$6='Исходные данные'!$C$6,IF('Исходные данные'!AO6=\"да\",1,0),IF('параметры заявки'!$D$6='Исходные данные'!$C$7,IF('Исходные данные'!AO7=\"да\",1,0),IF('параметры заявки'!$D$6='Исходные данные'!$C$8,IF('Исходные данные'!AO8=\"да\",1,0),IF('параметры заявки'!$D$6='Исходные данные'!$C$9,IF('Исходные данные'!AO9=\"да\",1,0),IF('параметры заявки'!$D$6='Исходные данные'!$C$10,IF('Исходные данные'!AO10=\"да\",1,0),IF('Исходные данные'!$C$11='параметры заявки'!$D$6,IF('Исходные данные'!AO11=\"да\",1,0),IF('параметры заявки'!$D$6='Исходные данные'!$C$12,IF('Исходные данные'!AO12=\"да\",1,0),IF('параметры заявки'!$D$6='Исходные данные'!$C$13,IF('Исходные данные'!AO13=\"да\",1,0)))))))))","v":1},{"$f":"IF('параметры заявки'!$D$6='Исходные данные'!$C$6,IF('Исходные данные'!AP6=\"да\",1,0),IF('параметры заявки'!$D$6='Исходные данные'!$C$7,IF('Исходные данные'!AP7=\"да\",1,0),IF('параметры заявки'!$D$6='Исходные данные'!$C$8,IF('Исходные данные'!AP8=\"да\",1,0),IF('параметры заявки'!$D$6='Исходные данные'!$C$9,IF('Исходные данные'!AP9=\"да\",1,0),IF('параметры заявки'!$D$6='Исходные данные'!$C$10,IF('Исходные данные'!AP10=\"да\",1,0),IF('Исходные данные'!$C$11='параметры заявки'!$D$6,IF('Исходные данные'!AP11=\"да\",1,0),IF('параметры заявки'!$D$6='Исходные данные'!$C$12,IF('Исходные данные'!AP12=\"да\",1,0),IF('параметры заявки'!$D$6='Исходные данные'!$C$13,IF('Исходные данные'!AP13=\"да\",1,0)))))))))","v":1},{"$f":"IF('параметры заявки'!$D$6='Исходные данные'!$C$6,IF('Исходные данные'!AQ6=\"да\",1,0),IF('параметры заявки'!$D$6='Исходные данные'!$C$7,IF('Исходные данные'!AQ7=\"да\",1,0),IF('параметры заявки'!$D$6='Исходные данные'!$C$8,IF('Исходные данные'!AQ8=\"да\",1,0),IF('параметры заявки'!$D$6='Исходные данные'!$C$9,IF('Исходные данные'!AQ9=\"да\",1,0),IF('параметры заявки'!$D$6='Исходные данные'!$C$10,IF('Исходные данные'!AQ10=\"да\",1,0),IF('Исходные данные'!$C$11='параметры заявки'!$D$6,IF('Исходные данные'!AQ11=\"да\",1,0),IF('параметры заявки'!$D$6='Исходные данные'!$C$12,IF('Исходные данные'!AQ12=\"да\",1,0),IF('параметры заявки'!$D$6='Исходные данные'!$C$13,IF('Исходные данные'!AQ13=\"да\",1,0)))))))))","v":1},{"$f":"IF('параметры заявки'!$D$6='Исходные данные'!$C$6,IF('Исходные данные'!AR6=\"да\",1,0),IF('параметры заявки'!$D$6='Исходные данные'!$C$7,IF('Исходные данные'!AR7=\"да\",1,0),IF('параметры заявки'!$D$6='Исходные данные'!$C$8,IF('Исходные данные'!AR8=\"да\",1,0),IF('параметры заявки'!$D$6='Исходные данные'!$C$9,IF('Исходные данные'!AR9=\"да\",1,0),IF('параметры заявки'!$D$6='Исходные данные'!$C$10,IF('Исходные данные'!AR10=\"да\",1,0),IF('Исходные данные'!$C$11='параметры заявки'!$D$6,IF('Исходные данные'!AR11=\"да\",1,0),IF('параметры заявки'!$D$6='Исходные данные'!$C$12,IF('Исходные данные'!AR12=\"да\",1,0),IF('параметры заявки'!$D$6='Исходные данные'!$C$13,IF('Исходные данные'!AR13=\"да\",1,0)))))))))","v":1},{"$f":"IF('параметры заявки'!$D$6='Исходные данные'!$C$6,IF('Исходные данные'!AS6=\"да\",1,0),IF('параметры заявки'!$D$6='Исходные данные'!$C$7,IF('Исходные данные'!AS7=\"да\",1,0),IF('параметры заявки'!$D$6='Исходные данные'!$C$8,IF('Исходные данные'!AS8=\"да\",1,0),IF('параметры заявки'!$D$6='Исходные данные'!$C$9,IF('Исходные данные'!AS9=\"да\",1,0),IF('параметры заявки'!$D$6='Исходные данные'!$C$10,IF('Исходные данные'!AS10=\"да\",1,0),IF('Исходные данные'!$C$11='параметры заявки'!$D$6,IF('Исходные данные'!AS11=\"да\",1,0),IF('параметры заявки'!$D$6='Исходные данные'!$C$12,IF('Исходные данные'!AS12=\"да\",1,0),IF('параметры заявки'!$D$6='Исходные данные'!$C$13,IF('Исходные данные'!AS13=\"да\",1,0)))))))))","v":1},{"$f":"IF('параметры заявки'!$D$6='Исходные данные'!$C$6,IF('Исходные данные'!AT6=\"да\",1,0),IF('параметры заявки'!$D$6='Исходные данные'!$C$7,IF('Исходные данные'!AT7=\"да\",1,0),IF('параметры заявки'!$D$6='Исходные данные'!$C$8,IF('Исходные данные'!AT8=\"да\",1,0),IF('параметры заявки'!$D$6='Исходные данные'!$C$9,IF('Исходные данные'!AT9=\"да\",1,0),IF('параметры заявки'!$D$6='Исходные данные'!$C$10,IF('Исходные данные'!AT10=\"да\",1,0),IF('Исходные данные'!$C$11='параметры заявки'!$D$6,IF('Исходные данные'!AT11=\"да\",1,0),IF('параметры заявки'!$D$6='Исходные данные'!$C$12,IF('Исходные данные'!AT12=\"да\",1,0),IF('параметры заявки'!$D$6='Исходные данные'!$C$13,IF('Исходные данные'!AT13=\"да\",1,0)))))))))","v":1},{"$f":"IF('параметры заявки'!$D$6='Исходные данные'!$C$6,IF('Исходные данные'!AU6=\"да\",1,0),IF('параметры заявки'!$D$6='Исходные данные'!$C$7,IF('Исходные данные'!AU7=\"да\",1,0),IF('параметры заявки'!$D$6='Исходные данные'!$C$8,IF('Исходные данные'!AU8=\"да\",1,0),IF('параметры заявки'!$D$6='Исходные данные'!$C$9,IF('Исходные данные'!AU9=\"да\",1,0),IF('параметры заявки'!$D$6='Исходные данные'!$C$10,IF('Исходные данные'!AU10=\"да\",1,0),IF('Исходные данные'!$C$11='параметры заявки'!$D$6,IF('Исходные данные'!AU11=\"да\",1,0),IF('параметры заявки'!$D$6='Исходные данные'!$C$12,IF('Исходные данные'!AU12=\"да\",1,0),IF('параметры заявки'!$D$6='Исходные данные'!$C$13,IF('Исходные данные'!AU13=\"да\",1,0)))))))))","v":1},{"$f":"IF('параметры заявки'!$D$6='Исходные данные'!$C$6,IF('Исходные данные'!AV6=\"да\",1,0),IF('параметры заявки'!$D$6='Исходные данные'!$C$7,IF('Исходные данные'!AV7=\"да\",1,0),IF('параметры заявки'!$D$6='Исходные данные'!$C$8,IF('Исходные данные'!AV8=\"да\",1,0),IF('параметры заявки'!$D$6='Исходные данные'!$C$9,IF('Исходные данные'!AV9=\"да\",1,0),IF('параметры заявки'!$D$6='Исходные данные'!$C$10,IF('Исходные данные'!AV10=\"да\",1,0),IF('Исходные данные'!$C$11='параметры заявки'!$D$6,IF('Исходные данные'!AV11=\"да\",1,0),IF('параметры заявки'!$D$6='Исходные данные'!$C$12,IF('Исходные данные'!AV12=\"да\",1,0),IF('параметры заявки'!$D$6='Исходные данные'!$C$13,IF('Исходные данные'!AV13=\"да\",1,0)))))))))","v":1},{"$f":"IF('параметры заявки'!$D$6='Исходные данные'!$C$6,IF('Исходные данные'!AW6=\"да\",1,0),IF('параметры заявки'!$D$6='Исходные данные'!$C$7,IF('Исходные данные'!AW7=\"да\",1,0),IF('параметры заявки'!$D$6='Исходные данные'!$C$8,IF('Исходные данные'!AW8=\"да\",1,0),IF('параметры заявки'!$D$6='Исходные данные'!$C$9,IF('Исходные данные'!AW9=\"да\",1,0),IF('параметры заявки'!$D$6='Исходные данные'!$C$10,IF('Исходные данные'!AW10=\"да\",1,0),IF('Исходные данные'!$C$11='параметры заявки'!$D$6,IF('Исходные данные'!AW11=\"да\",1,0),IF('параметры заявки'!$D$6='Исходные данные'!$C$12,IF('Исходные данные'!AW12=\"да\",1,0),IF('параметры заявки'!$D$6='Исходные данные'!$C$13,IF('Исходные данные'!AW13=\"да\",1,0)))))))))","v":1},{"$f":"IF('параметры заявки'!$D$6='Исходные данные'!$C$6,IF('Исходные данные'!AX6=\"да\",1,0),IF('параметры заявки'!$D$6='Исходные данные'!$C$7,IF('Исходные данные'!AX7=\"да\",1,0),IF('параметры заявки'!$D$6='Исходные данные'!$C$8,IF('Исходные данные'!AX8=\"да\",1,0),IF('параметры заявки'!$D$6='Исходные данные'!$C$9,IF('Исходные данные'!AX9=\"да\",1,0),IF('параметры заявки'!$D$6='Исходные данные'!$C$10,IF('Исходные данные'!AX10=\"да\",1,0),IF('Исходные данные'!$C$11='параметры заявки'!$D$6,IF('Исходные данные'!AX11=\"да\",1,0),IF('параметры заявки'!$D$6='Исходные данные'!$C$12,IF('Исходные данные'!AX12=\"да\",1,0),IF('параметры заявки'!$D$6='Исходные данные'!$C$13,IF('Исходные данные'!AX13=\"да\",1,0)))))))))","v":1},{"$f":"IF('параметры заявки'!$D$6='Исходные данные'!$C$6,IF('Исходные данные'!AY6=\"да\",1,0),IF('параметры заявки'!$D$6='Исходные данные'!$C$7,IF('Исходные данные'!AY7=\"да\",1,0),IF('параметры заявки'!$D$6='Исходные данные'!$C$8,IF('Исходные данные'!AY8=\"да\",1,0),IF('параметры заявки'!$D$6='Исходные данные'!$C$9,IF('Исходные данные'!AY9=\"да\",1,0),IF('параметры заявки'!$D$6='Исходные данные'!$C$10,IF('Исходные данные'!AY10=\"да\",1,0),IF('Исходные данные'!$C$11='параметры заявки'!$D$6,IF('Исходные данные'!AY11=\"да\",1,0),IF('параметры заявки'!$D$6='Исходные данные'!$C$12,IF('Исходные данные'!AY12=\"да\",1,0),IF('параметры заявки'!$D$6='Исходные данные'!$C$13,IF('Исходные данные'!AY13=\"да\",1,0)))))))))","v":1},{"$f":"IF('параметры заявки'!$D$6='Исходные данные'!$C$6,IF('Исходные данные'!AZ6=\"да\",1,0),IF('параметры заявки'!$D$6='Исходные данные'!$C$7,IF('Исходные данные'!AZ7=\"да\",1,0),IF('параметры заявки'!$D$6='Исходные данные'!$C$8,IF('Исходные данные'!AZ8=\"да\",1,0),IF('параметры заявки'!$D$6='Исходные данные'!$C$9,IF('Исходные данные'!AZ9=\"да\",1,0),IF('параметры заявки'!$D$6='Исходные данные'!$C$10,IF('Исходные данные'!AZ10=\"да\",1,0),IF('Исходные данные'!$C$11='параметры заявки'!$D$6,IF('Исходные данные'!AZ11=\"да\",1,0),IF('параметры заявки'!$D$6='Исходные данные'!$C$12,IF('Исходные данные'!AZ12=\"да\",1,0),IF('параметры заявки'!$D$6='Исходные данные'!$C$13,IF('Исходные данные'!AZ13=\"да\",1,0)))))))))","v":1},{"$f":"IF('параметры заявки'!$D$6='Исходные данные'!$C$6,IF('Исходные данные'!BA6=\"да\",1,0),IF('параметры заявки'!$D$6='Исходные данные'!$C$7,IF('Исходные данные'!BA7=\"да\",1,0),IF('параметры заявки'!$D$6='Исходные данные'!$C$8,IF('Исходные данные'!BA8=\"да\",1,0),IF('параметры заявки'!$D$6='Исходные данные'!$C$9,IF('Исходные данные'!BA9=\"да\",1,0),IF('параметры заявки'!$D$6='Исходные данные'!$C$10,IF('Исходные данные'!BA10=\"да\",1,0),IF('Исходные данные'!$C$11='параметры заявки'!$D$6,IF('Исходные данные'!BA11=\"да\",1,0),IF('параметры заявки'!$D$6='Исходные данные'!$C$12,IF('Исходные данные'!BA12=\"да\",1,0),IF('параметры заявки'!$D$6='Исходные данные'!$C$13,IF('Исходные данные'!BA13=\"да\",1,0)))))))))","v":1},{"$f":"IF('параметры заявки'!$D$6='Исходные данные'!$C$6,IF('Исходные данные'!BB6=\"да\",1,0),IF('параметры заявки'!$D$6='Исходные данные'!$C$7,IF('Исходные данные'!BB7=\"да\",1,0),IF('параметры заявки'!$D$6='Исходные данные'!$C$8,IF('Исходные данные'!BB8=\"да\",1,0),IF('параметры заявки'!$D$6='Исходные данные'!$C$9,IF('Исходные данные'!BB9=\"да\",1,0),IF('параметры заявки'!$D$6='Исходные данные'!$C$10,IF('Исходные данные'!BB10=\"да\",1,0),IF('Исходные данные'!$C$11='параметры заявки'!$D$6,IF('Исходные данные'!BB11=\"да\",1,0),IF('параметры заявки'!$D$6='Исходные данные'!$C$12,IF('Исходные данные'!BB12=\"да\",1,0),IF('параметры заявки'!$D$6='Исходные данные'!$C$13,IF('Исходные данные'!BB13=\"да\",1,0)))))))))","v":1},{"$f":"IF('параметры заявки'!$D$6='Исходные данные'!$C$6,IF('Исходные данные'!BC6=\"да\",1,0),IF('параметры заявки'!$D$6='Исходные данные'!$C$7,IF('Исходные данные'!BC7=\"да\",1,0),IF('параметры заявки'!$D$6='Исходные данные'!$C$8,IF('Исходные данные'!BC8=\"да\",1,0),IF('параметры заявки'!$D$6='Исходные данные'!$C$9,IF('Исходные данные'!BC9=\"да\",1,0),IF('параметры заявки'!$D$6='Исходные данные'!$C$10,IF('Исходные данные'!BC10=\"да\",1,0),IF('Исходные данные'!$C$11='параметры заявки'!$D$6,IF('Исходные данные'!BC11=\"да\",1,0),IF('параметры заявки'!$D$6='Исходные данные'!$C$12,IF('Исходные данные'!BC12=\"да\",1,0),IF('параметры заявки'!$D$6='Исходные данные'!$C$13,IF('Исходные данные'!BC13=\"да\",1,0)))))))))","v":1},{"$f":"IF('параметры заявки'!$D$6='Исходные данные'!$C$6,IF('Исходные данные'!BD6=\"да\",1,0),IF('параметры заявки'!$D$6='Исходные данные'!$C$7,IF('Исходные данные'!BD7=\"да\",1,0),IF('параметры заявки'!$D$6='Исходные данные'!$C$8,IF('Исходные данные'!BD8=\"да\",1,0),IF('параметры заявки'!$D$6='Исходные данные'!$C$9,IF('Исходные данные'!BD9=\"да\",1,0),IF('параметры заявки'!$D$6='Исходные данные'!$C$10,IF('Исходные данные'!BD10=\"да\",1,0),IF('Исходные данные'!$C$11='параметры заявки'!$D$6,IF('Исходные данные'!BD11=\"да\",1,0),IF('параметры заявки'!$D$6='Исходные данные'!$C$12,IF('Исходные данные'!BD12=\"да\",1,0),IF('параметры заявки'!$D$6='Исходные данные'!$C$13,IF('Исходные данные'!BD13=\"да\",1,0)))))))))","v":1},{"$f":"IF('параметры заявки'!$D$6='Исходные данные'!$C$6,IF('Исходные данные'!BE6=\"да\",1,0),IF('параметры заявки'!$D$6='Исходные данные'!$C$7,IF('Исходные данные'!BE7=\"да\",1,0),IF('параметры заявки'!$D$6='Исходные данные'!$C$8,IF('Исходные данные'!BE8=\"да\",1,0),IF('параметры заявки'!$D$6='Исходные данные'!$C$9,IF('Исходные данные'!BE9=\"да\",1,0),IF('параметры заявки'!$D$6='Исходные данные'!$C$10,IF('Исходные данные'!BE10=\"да\",1,0),IF('Исходные данные'!$C$11='параметры заявки'!$D$6,IF('Исходные данные'!BE11=\"да\",1,0),IF('параметры заявки'!$D$6='Исходные данные'!$C$12,IF('Исходные данные'!BE12=\"да\",1,0),IF('параметры заявки'!$D$6='Исходные данные'!$C$13,IF('Исходные данные'!BE13=\"да\",1,0)))))))))","v":1},{"$f":"IF('параметры заявки'!$D$6='Исходные данные'!$C$6,IF('Исходные данные'!BF6=\"да\",1,0),IF('параметры заявки'!$D$6='Исходные данные'!$C$7,IF('Исходные данные'!BF7=\"да\",1,0),IF('параметры заявки'!$D$6='Исходные данные'!$C$8,IF('Исходные данные'!BF8=\"да\",1,0),IF('параметры заявки'!$D$6='Исходные данные'!$C$9,IF('Исходные данные'!BF9=\"да\",1,0),IF('параметры заявки'!$D$6='Исходные данные'!$C$10,IF('Исходные данные'!BF10=\"да\",1,0),IF('Исходные данные'!$C$11='параметры заявки'!$D$6,IF('Исходные данные'!BF11=\"да\",1,0),IF('параметры заявки'!$D$6='Исходные данные'!$C$12,IF('Исходные данные'!BF12=\"да\",1,0),IF('параметры заявки'!$D$6='Исходные данные'!$C$13,IF('Исходные данные'!BF13=\"да\",1,0)))))))))","v":1},{"$f":"IF('параметры заявки'!$D$6='Исходные данные'!$C$6,IF('Исходные данные'!BG6=\"да\",1,0),IF('параметры заявки'!$D$6='Исходные данные'!$C$7,IF('Исходные данные'!BG7=\"да\",1,0),IF('параметры заявки'!$D$6='Исходные данные'!$C$8,IF('Исходные данные'!BG8=\"да\",1,0),IF('параметры заявки'!$D$6='Исходные данные'!$C$9,IF('Исходные данные'!BG9=\"да\",1,0),IF('параметры заявки'!$D$6='Исходные данные'!$C$10,IF('Исходные данные'!BG10=\"да\",1,0),IF('Исходные данные'!$C$11='параметры заявки'!$D$6,IF('Исходные данные'!BG11=\"да\",1,0),IF('параметры заявки'!$D$6='Исходные данные'!$C$12,IF('Исходные данные'!BG12=\"да\",1,0),IF('параметры заявки'!$D$6='Исходные данные'!$C$13,IF('Исходные данные'!BG13=\"да\",1,0)))))))))","v":1},{"$f":"IF('параметры заявки'!$D$6='Исходные данные'!$C$6,IF('Исходные данные'!BH6=\"да\",1,0),IF('параметры заявки'!$D$6='Исходные данные'!$C$7,IF('Исходные данные'!BH7=\"да\",1,0),IF('параметры заявки'!$D$6='Исходные данные'!$C$8,IF('Исходные данные'!BH8=\"да\",1,0),IF('параметры заявки'!$D$6='Исходные данные'!$C$9,IF('Исходные данные'!BH9=\"да\",1,0),IF('параметры заявки'!$D$6='Исходные данные'!$C$10,IF('Исходные данные'!BH10=\"да\",1,0),IF('Исходные данные'!$C$11='параметры заявки'!$D$6,IF('Исходные данные'!BH11=\"да\",1,0),IF('параметры заявки'!$D$6='Исходные данные'!$C$12,IF('Исходные данные'!BH12=\"да\",1,0),IF('параметры заявки'!$D$6='Исходные данные'!$C$13,IF('Исходные данные'!BH13=\"да\",1,0)))))))))","v":1},{"$f":"IF('параметры заявки'!$D$6='Исходные данные'!$C$6,IF('Исходные данные'!BI6=\"да\",1,0),IF('параметры заявки'!$D$6='Исходные данные'!$C$7,IF('Исходные данные'!BI7=\"да\",1,0),IF('параметры заявки'!$D$6='Исходные данные'!$C$8,IF('Исходные данные'!BI8=\"да\",1,0),IF('параметры заявки'!$D$6='Исходные данные'!$C$9,IF('Исходные данные'!BI9=\"да\",1,0),IF('параметры заявки'!$D$6='Исходные данные'!$C$10,IF('Исходные данные'!BI10=\"да\",1,0),IF('Исходные данные'!$C$11='параметры заявки'!$D$6,IF('Исходные данные'!BI11=\"да\",1,0),IF('параметры заявки'!$D$6='Исходные данные'!$C$12,IF('Исходные данные'!BI12=\"да\",1,0),IF('параметры заявки'!$D$6='Исходные данные'!$C$13,IF('Исходные данные'!BI13=\"да\",1,0)))))))))","v":1},{"$f":"IF('параметры заявки'!$D$6='Исходные данные'!$C$6,IF('Исходные данные'!BJ6=\"да\",1,0),IF('параметры заявки'!$D$6='Исходные данные'!$C$7,IF('Исходные данные'!BJ7=\"да\",1,0),IF('параметры заявки'!$D$6='Исходные данные'!$C$8,IF('Исходные данные'!BJ8=\"да\",1,0),IF('параметры заявки'!$D$6='Исходные данные'!$C$9,IF('Исходные данные'!BJ9=\"да\",1,0),IF('параметры заявки'!$D$6='Исходные данные'!$C$10,IF('Исходные данные'!BJ10=\"да\",1,0),IF('Исходные данные'!$C$11='параметры заявки'!$D$6,IF('Исходные данные'!BJ11=\"да\",1,0),IF('параметры заявки'!$D$6='Исходные данные'!$C$12,IF('Исходные данные'!BJ12=\"да\",1,0),IF('параметры заявки'!$D$6='Исходные данные'!$C$13,IF('Исходные данные'!BJ13=\"да\",1,0)))))))))","v":1},{"$f":"IF('параметры заявки'!$D$6='Исходные данные'!$C$6,IF('Исходные данные'!BK6=\"да\",1,0),IF('параметры заявки'!$D$6='Исходные данные'!$C$7,IF('Исходные данные'!BK7=\"да\",1,0),IF('параметры заявки'!$D$6='Исходные данные'!$C$8,IF('Исходные данные'!BK8=\"да\",1,0),IF('параметры заявки'!$D$6='Исходные данные'!$C$9,IF('Исходные данные'!BK9=\"да\",1,0),IF('параметры заявки'!$D$6='Исходные данные'!$C$10,IF('Исходные данные'!BK10=\"да\",1,0),IF('Исходные данные'!$C$11='параметры заявки'!$D$6,IF('Исходные данные'!BK11=\"да\",1,0),IF('параметры заявки'!$D$6='Исходные данные'!$C$12,IF('Исходные данные'!BK12=\"да\",1,0),IF('параметры заявки'!$D$6='Исходные данные'!$C$13,IF('Исходные данные'!BK13=\"да\",1,0)))))))))","v":1},{"$f":"IF('параметры заявки'!$D$6='Исходные данные'!$C$6,IF('Исходные данные'!BL6=\"да\",1,0),IF('параметры заявки'!$D$6='Исходные данные'!$C$7,IF('Исходные данные'!BL7=\"да\",1,0),IF('параметры заявки'!$D$6='Исходные данные'!$C$8,IF('Исходные данные'!BL8=\"да\",1,0),IF('параметры заявки'!$D$6='Исходные данные'!$C$9,IF('Исходные данные'!BL9=\"да\",1,0),IF('параметры заявки'!$D$6='Исходные данные'!$C$10,IF('Исходные данные'!BL10=\"да\",1,0),IF('Исходные данные'!$C$11='параметры заявки'!$D$6,IF('Исходные данные'!BL11=\"да\",1,0),IF('параметры заявки'!$D$6='Исходные данные'!$C$12,IF('Исходные данные'!BL12=\"да\",1,0),IF('параметры заявки'!$D$6='Исходные данные'!$C$13,IF('Исходные данные'!BL13=\"да\",1,0)))))))))","v":1},{"$f":"IF('параметры заявки'!$D$6='Исходные данные'!$C$6,IF('Исходные данные'!BM6=\"да\",1,0),IF('параметры заявки'!$D$6='Исходные данные'!$C$7,IF('Исходные данные'!BM7=\"да\",1,0),IF('параметры заявки'!$D$6='Исходные данные'!$C$8,IF('Исходные данные'!BM8=\"да\",1,0),IF('параметры заявки'!$D$6='Исходные данные'!$C$9,IF('Исходные данные'!BM9=\"да\",1,0),IF('параметры заявки'!$D$6='Исходные данные'!$C$10,IF('Исходные данные'!BM10=\"да\",1,0),IF('Исходные данные'!$C$11='параметры заявки'!$D$6,IF('Исходные данные'!BM11=\"да\",1,0),IF('параметры заявки'!$D$6='Исходные данные'!$C$12,IF('Исходные данные'!BM12=\"да\",1,0),IF('параметры заявки'!$D$6='Исходные данные'!$C$13,IF('Исходные данные'!BM13=\"да\",1,0)))))))))","v":1},{"$f":"IF('параметры заявки'!$D$6='Исходные данные'!$C$6,IF('Исходные данные'!BN6=\"да\",1,0),IF('параметры заявки'!$D$6='Исходные данные'!$C$7,IF('Исходные данные'!BN7=\"да\",1,0),IF('параметры заявки'!$D$6='Исходные данные'!$C$8,IF('Исходные данные'!BN8=\"да\",1,0),IF('параметры заявки'!$D$6='Исходные данные'!$C$9,IF('Исходные данные'!BN9=\"да\",1,0),IF('параметры заявки'!$D$6='Исходные данные'!$C$10,IF('Исходные данные'!BN10=\"да\",1,0),IF('Исходные данные'!$C$11='параметры заявки'!$D$6,IF('Исходные данные'!BN11=\"да\",1,0),IF('параметры заявки'!$D$6='Исходные данные'!$C$12,IF('Исходные данные'!BN12=\"да\",1,0),IF('параметры заявки'!$D$6='Исходные данные'!$C$13,IF('Исходные данные'!BN13=\"да\",1,0)))))))))","v":1},{"$f":"IF('параметры заявки'!$D$6='Исходные данные'!$C$6,IF('Исходные данные'!BO6=\"да\",1,0),IF('параметры заявки'!$D$6='Исходные данные'!$C$7,IF('Исходные данные'!BO7=\"да\",1,0),IF('параметры заявки'!$D$6='Исходные данные'!$C$8,IF('Исходные данные'!BO8=\"да\",1,0),IF('параметры заявки'!$D$6='Исходные данные'!$C$9,IF('Исходные данные'!BO9=\"да\",1,0),IF('параметры заявки'!$D$6='Исходные данные'!$C$10,IF('Исходные данные'!BO10=\"да\",1,0),IF('Исходные данные'!$C$11='параметры заявки'!$D$6,IF('Исходные данные'!BO11=\"да\",1,0),IF('параметры заявки'!$D$6='Исходные данные'!$C$12,IF('Исходные данные'!BO12=\"да\",1,0),IF('параметры заявки'!$D$6='Исходные данные'!$C$13,IF('Исходные данные'!BO13=\"да\",1,0)))))))))","v":1},{"$f":"IF('параметры заявки'!$D$6='Исходные данные'!$C$6,IF('Исходные данные'!BP6=\"да\",1,0),IF('параметры заявки'!$D$6='Исходные данные'!$C$7,IF('Исходные данные'!BP7=\"да\",1,0),IF('параметры заявки'!$D$6='Исходные данные'!$C$8,IF('Исходные данные'!BP8=\"да\",1,0),IF('параметры заявки'!$D$6='Исходные данные'!$C$9,IF('Исходные данные'!BP9=\"да\",1,0),IF('параметры заявки'!$D$6='Исходные данные'!$C$10,IF('Исходные данные'!BP10=\"да\",1,0),IF('Исходные данные'!$C$11='параметры заявки'!$D$6,IF('Исходные данные'!BP11=\"да\",1,0),IF('параметры заявки'!$D$6='Исходные данные'!$C$12,IF('Исходные данные'!BP12=\"да\",1,0),IF('параметры заявки'!$D$6='Исходные данные'!$C$13,IF('Исходные данные'!BP13=\"да\",1,0)))))))))","v":1},{"$f":"IF('параметры заявки'!$D$6='Исходные данные'!$C$6,IF('Исходные данные'!BQ6=\"да\",1,0),IF('параметры заявки'!$D$6='Исходные данные'!$C$7,IF('Исходные данные'!BQ7=\"да\",1,0),IF('параметры заявки'!$D$6='Исходные данные'!$C$8,IF('Исходные данные'!BQ8=\"да\",1,0),IF('параметры заявки'!$D$6='Исходные данные'!$C$9,IF('Исходные данные'!BQ9=\"да\",1,0),IF('параметры заявки'!$D$6='Исходные данные'!$C$10,IF('Исходные данные'!BQ10=\"да\",1,0),IF('Исходные данные'!$C$11='параметры заявки'!$D$6,IF('Исходные данные'!BQ11=\"да\",1,0),IF('параметры заявки'!$D$6='Исходные данные'!$C$12,IF('Исходные данные'!BQ12=\"да\",1,0),IF('параметры заявки'!$D$6='Исходные данные'!$C$13,IF('Исходные данные'!BQ13=\"да\",1,0)))))))))","v":1},{"$f":"IF('параметры заявки'!$D$6='Исходные данные'!$C$6,IF('Исходные данные'!BR6=\"да\",1,0),IF('параметры заявки'!$D$6='Исходные данные'!$C$7,IF('Исходные данные'!BR7=\"да\",1,0),IF('параметры заявки'!$D$6='Исходные данные'!$C$8,IF('Исходные данные'!BR8=\"да\",1,0),IF('параметры заявки'!$D$6='Исходные данные'!$C$9,IF('Исходные данные'!BR9=\"да\",1,0),IF('параметры заявки'!$D$6='Исходные данные'!$C$10,IF('Исходные данные'!BR10=\"да\",1,0),IF('Исходные данные'!$C$11='параметры заявки'!$D$6,IF('Исходные данные'!BR11=\"да\",1,0),IF('параметры заявки'!$D$6='Исходные данные'!$C$12,IF('Исходные данные'!BR12=\"да\",1,0),IF('параметры заявки'!$D$6='Исходные данные'!$C$13,IF('Исходные данные'!BR13=\"да\",1,0)))))))))","v":1},{"$f":"IF('параметры заявки'!$D$6='Исходные данные'!$C$6,IF('Исходные данные'!BS6=\"да\",1,0),IF('параметры заявки'!$D$6='Исходные данные'!$C$7,IF('Исходные данные'!BS7=\"да\",1,0),IF('параметры заявки'!$D$6='Исходные данные'!$C$8,IF('Исходные данные'!BS8=\"да\",1,0),IF('параметры заявки'!$D$6='Исходные данные'!$C$9,IF('Исходные данные'!BS9=\"да\",1,0),IF('параметры заявки'!$D$6='Исходные данные'!$C$10,IF('Исходные данные'!BS10=\"да\",1,0),IF('Исходные данные'!$C$11='параметры заявки'!$D$6,IF('Исходные данные'!BS11=\"да\",1,0),IF('параметры заявки'!$D$6='Исходные данные'!$C$12,IF('Исходные данные'!BS12=\"да\",1,0),IF('параметры заявки'!$D$6='Исходные данные'!$C$13,IF('Исходные данные'!BS13=\"да\",1,0)))))))))","v":1},{"$f":"IF('параметры заявки'!$D$6='Исходные данные'!$C$6,IF('Исходные данные'!BT6=\"да\",1,0),IF('параметры заявки'!$D$6='Исходные данные'!$C$7,IF('Исходные данные'!BT7=\"да\",1,0),IF('параметры заявки'!$D$6='Исходные данные'!$C$8,IF('Исходные данные'!BT8=\"да\",1,0),IF('параметры заявки'!$D$6='Исходные данные'!$C$9,IF('Исходные данные'!BT9=\"да\",1,0),IF('параметры заявки'!$D$6='Исходные данные'!$C$10,IF('Исходные данные'!BT10=\"да\",1,0),IF('Исходные данные'!$C$11='параметры заявки'!$D$6,IF('Исходные данные'!BT11=\"да\",1,0),IF('параметры заявки'!$D$6='Исходные данные'!$C$12,IF('Исходные данные'!BT12=\"да\",1,0),IF('параметры заявки'!$D$6='Исходные данные'!$C$13,IF('Исходные данные'!BT13=\"да\",1,0)))))))))","v":1},{"$f":"IF('параметры заявки'!$D$6='Исходные данные'!$C$6,IF('Исходные данные'!BU6=\"да\",1,0),IF('параметры заявки'!$D$6='Исходные данные'!$C$7,IF('Исходные данные'!BU7=\"да\",1,0),IF('параметры заявки'!$D$6='Исходные данные'!$C$8,IF('Исходные данные'!BU8=\"да\",1,0),IF('параметры заявки'!$D$6='Исходные данные'!$C$9,IF('Исходные данные'!BU9=\"да\",1,0),IF('параметры заявки'!$D$6='Исходные данные'!$C$10,IF('Исходные данные'!BU10=\"да\",1,0),IF('Исходные данные'!$C$11='параметры заявки'!$D$6,IF('Исходные данные'!BU11=\"да\",1,0),IF('параметры заявки'!$D$6='Исходные данные'!$C$12,IF('Исходные данные'!BU12=\"да\",1,0),IF('параметры заявки'!$D$6='Исходные данные'!$C$13,IF('Исходные данные'!BU13=\"да\",1,0)))))))))","v":1},{"$f":"IF('параметры заявки'!$D$6='Исходные данные'!$C$6,IF('Исходные данные'!BV6=\"да\",1,0),IF('параметры заявки'!$D$6='Исходные данные'!$C$7,IF('Исходные данные'!BV7=\"да\",1,0),IF('параметры заявки'!$D$6='Исходные данные'!$C$8,IF('Исходные данные'!BV8=\"да\",1,0),IF('параметры заявки'!$D$6='Исходные данные'!$C$9,IF('Исходные данные'!BV9=\"да\",1,0),IF('параметры заявки'!$D$6='Исходные данные'!$C$10,IF('Исходные данные'!BV10=\"да\",1,0),IF('Исходные данные'!$C$11='параметры заявки'!$D$6,IF('Исходные данные'!BV11=\"да\",1,0),IF('параметры заявки'!$D$6='Исходные данные'!$C$12,IF('Исходные данные'!BV12=\"да\",1,0),IF('параметры заявки'!$D$6='Исходные данные'!$C$13,IF('Исходные данные'!BV13=\"да\",1,0)))))))))","v":1},{"$f":"IF('параметры заявки'!$D$6='Исходные данные'!$C$6,IF('Исходные данные'!BW6=\"да\",1,0),IF('параметры заявки'!$D$6='Исходные данные'!$C$7,IF('Исходные данные'!BW7=\"да\",1,0),IF('параметры заявки'!$D$6='Исходные данные'!$C$8,IF('Исходные данные'!BW8=\"да\",1,0),IF('параметры заявки'!$D$6='Исходные данные'!$C$9,IF('Исходные данные'!BW9=\"да\",1,0),IF('параметры заявки'!$D$6='Исходные данные'!$C$10,IF('Исходные данные'!BW10=\"да\",1,0),IF('Исходные данные'!$C$11='параметры заявки'!$D$6,IF('Исходные данные'!BW11=\"да\",1,0),IF('параметры заявки'!$D$6='Исходные данные'!$C$12,IF('Исходные данные'!BW12=\"да\",1,0),IF('параметры заявки'!$D$6='Исходные данные'!$C$13,IF('Исходные данные'!BW13=\"да\",1,0)))))))))","v":1},{"$f":"IF('параметры заявки'!$D$6='Исходные данные'!$C$6,IF('Исходные данные'!BX6=\"да\",1,0),IF('параметры заявки'!$D$6='Исходные данные'!$C$7,IF('Исходные данные'!BX7=\"да\",1,0),IF('параметры заявки'!$D$6='Исходные данные'!$C$8,IF('Исходные данные'!BX8=\"да\",1,0),IF('параметры заявки'!$D$6='Исходные данные'!$C$9,IF('Исходные данные'!BX9=\"да\",1,0),IF('параметры заявки'!$D$6='Исходные данные'!$C$10,IF('Исходные данные'!BX10=\"да\",1,0),IF('Исходные данные'!$C$11='параметры заявки'!$D$6,IF('Исходные данные'!BX11=\"да\",1,0),IF('параметры заявки'!$D$6='Исходные данные'!$C$12,IF('Исходные данные'!BX12=\"да\",1,0),IF('параметры заявки'!$D$6='Исходные данные'!$C$13,IF('Исходные данные'!BX13=\"да\",1,0)))))))))","v":1},{"$f":"IF('параметры заявки'!$D$6='Исходные данные'!$C$6,IF('Исходные данные'!BY6=\"да\",1,0),IF('параметры заявки'!$D$6='Исходные данные'!$C$7,IF('Исходные данные'!BY7=\"да\",1,0),IF('параметры заявки'!$D$6='Исходные данные'!$C$8,IF('Исходные данные'!BY8=\"да\",1,0),IF('параметры заявки'!$D$6='Исходные данные'!$C$9,IF('Исходные данные'!BY9=\"да\",1,0),IF('параметры заявки'!$D$6='Исходные данные'!$C$10,IF('Исходные данные'!BY10=\"да\",1,0),IF('Исходные данные'!$C$11='параметры заявки'!$D$6,IF('Исходные данные'!BY11=\"да\",1,0),IF('параметры заявки'!$D$6='Исходные данные'!$C$12,IF('Исходные данные'!BY12=\"да\",1,0),IF('параметры заявки'!$D$6='Исходные данные'!$C$13,IF('Исходные данные'!BY13=\"да\",1,0)))))))))","v":1}]
[null,null,"Регион ",{"$f":"IF('параметры заявки'!$D$9=\"РФ\",1,IF('параметры заявки'!$D$9='Исходные данные'!$C$23,IF('Исходные данные'!D23=\"да\",1,0),IF('параметры заявки'!$D$9='Исходные данные'!$C$24,IF('Исходные данные'!D24=\"да\",1,0),IF('параметры заявки'!$D$9='Исходные данные'!$C$25,IF('Исходные данные'!D25=\"да\",1,0),IF('параметры заявки'!$D$9='Исходные данные'!$C$26,IF('Исходные данные'!D26=\"да\",1,0),IF('параметры заявки'!$D$9='Исходные данные'!$C$27,IF('Исходные данные'!D27=\"да\",1,0),IF('параметры заявки'!$D$9='Исходные данные'!$C$28,IF('Исходные данные'!D28=\"да\",1,0),IF('параметры заявки'!$D$9='Исходные данные'!$C$29,IF('Исходные данные'!D29=\"да\",1,0),IF('параметры заявки'!$D$9='Исходные данные'!$C$21,IF('Исходные данные'!D21=\"да\",1,0),IF('параметры заявки'!$D$9='Исходные данные'!$C$22,IF('Исходные данные'!D22=\"да\",1,0)))))))))))","v":0},{"$f":"IF('параметры заявки'!$D$9=\"РФ\",1,IF('параметры заявки'!$D$9='Исходные данные'!$C$23,IF('Исходные данные'!E23=\"да\",1,0),IF('параметры заявки'!$D$9='Исходные данные'!$C$24,IF('Исходные данные'!E24=\"да\",1,0),IF('параметры заявки'!$D$9='Исходные данные'!$C$25,IF('Исходные данные'!E25=\"да\",1,0),IF('параметры заявки'!$D$9='Исходные данные'!$C$26,IF('Исходные данные'!E26=\"да\",1,0),IF('параметры заявки'!$D$9='Исходные данные'!$C$27,IF('Исходные данные'!E27=\"да\",1,0),IF('параметры заявки'!$D$9='Исходные данные'!$C$28,IF('Исходные данные'!E28=\"да\",1,0),IF('параметры заявки'!$D$9='Исходные данные'!$C$29,IF('Исходные данные'!E29=\"да\",1,0),IF('параметры заявки'!$D$9='Исходные данные'!$C$21,IF('Исходные данные'!E21=\"да\",1,0),IF('параметры заявки'!$D$9='Исходные данные'!$C$22,IF('Исходные данные'!E22=\"да\",1,0)))))))))))","v":0},{"$f":"IF('параметры заявки'!$D$9=\"РФ\",1,IF('параметры заявки'!$D$9='Исходные данные'!$C$23,IF('Исходные данные'!F23=\"да\",1,0),IF('параметры заявки'!$D$9='Исходные данные'!$C$24,IF('Исходные данные'!F24=\"да\",1,0),IF('параметры заявки'!$D$9='Исходные данные'!$C$25,IF('Исходные данные'!F25=\"да\",1,0),IF('параметры заявки'!$D$9='Исходные данные'!$C$26,IF('Исходные данные'!F26=\"да\",1,0),IF('параметры заявки'!$D$9='Исходные данные'!$C$27,IF('Исходные данные'!F27=\"да\",1,0),IF('параметры заявки'!$D$9='Исходные данные'!$C$28,IF('Исходные данные'!F28=\"да\",1,0),IF('параметры заявки'!$D$9='Исходные данные'!$C$29,IF('Исходные данные'!F29=\"да\",1,0),IF('параметры заявки'!$D$9='Исходные данные'!$C$21,IF('Исходные данные'!F21=\"да\",1,0),IF('параметры заявки'!$D$9='Исходные данные'!$C$22,IF('Исходные данные'!F22=\"да\",1,0)))))))))))","v":0},{"$f":"IF('параметры заявки'!$D$9=\"РФ\",1,IF('параметры заявки'!$D$9='Исходные данные'!$C$23,IF('Исходные данные'!G23=\"да\",1,0),IF('параметры заявки'!$D$9='Исходные данные'!$C$24,IF('Исходные данные'!G24=\"да\",1,0),IF('параметры заявки'!$D$9='Исходные данные'!$C$25,IF('Исходные данные'!G25=\"да\",1,0),IF('параметры заявки'!$D$9='Исходные данные'!$C$26,IF('Исходные данные'!G26=\"да\",1,0),IF('параметры заявки'!$D$9='Исходные данные'!$C$27,IF('Исходные данные'!G27=\"да\",1,0),IF('параметры заявки'!$D$9='Исходные данные'!$C$28,IF('Исходные данные'!G28=\"да\",1,0),IF('параметры заявки'!$D$9='Исходные данные'!$C$29,IF('Исходные данные'!G29=\"да\",1,0),IF('параметры заявки'!$D$9='Исходные данные'!$C$21,IF('Исходные данные'!G21=\"да\",1,0),IF('параметры заявки'!$D$9='Исходные данные'!$C$22,IF('Исходные данные'!G22=\"да\",1,0)))))))))))","v":0},{"$f":"IF('параметры заявки'!$D$9=\"РФ\",1,IF('параметры заявки'!$D$9='Исходные данные'!$C$23,IF('Исходные данные'!H23=\"да\",1,0),IF('параметры заявки'!$D$9='Исходные данные'!$C$24,IF('Исходные данные'!H24=\"да\",1,0),IF('параметры заявки'!$D$9='Исходные данные'!$C$25,IF('Исходные данные'!H25=\"да\",1,0),IF('параметры заявки'!$D$9='Исходные данные'!$C$26,IF('Исходные данные'!H26=\"да\",1,0),IF('параметры заявки'!$D$9='Исходные данные'!$C$27,IF('Исходные данные'!H27=\"да\",1,0),IF('параметры заявки'!$D$9='Исходные данные'!$C$28,IF('Исходные данные'!H28=\"да\",1,0),IF('параметры заявки'!$D$9='Исходные данные'!$C$29,IF('Исходные данные'!H29=\"да\",1,0),IF('параметры заявки'!$D$9='Исходные данные'!$C$21,IF('Исходные данные'!H21=\"да\",1,0),IF('параметры заявки'!$D$9='Исходные данные'!$C$22,IF('Исходные данные'!H22=\"да\",1,0)))))))))))","v":1},{"$f":"IF('параметры заявки'!$D$9=\"РФ\",1,IF('параметры заявки'!$D$9='Исходные данные'!$C$23,IF('Исходные данные'!I23=\"да\",1,0),IF('параметры заявки'!$D$9='Исходные данные'!$C$24,IF('Исходные данные'!I24=\"да\",1,0),IF('параметры заявки'!$D$9='Исходные данные'!$C$25,IF('Исходные данные'!I25=\"да\",1,0),IF('параметры заявки'!$D$9='Исходные данные'!$C$26,IF('Исходные данные'!I26=\"да\",1,0),IF('параметры заявки'!$D$9='Исходные данные'!$C$27,IF('Исходные данные'!I27=\"да\",1,0),IF('параметры заявки'!$D$9='Исходные данные'!$C$28,IF('Исходные данные'!I28=\"да\",1,0),IF('параметры заявки'!$D$9='Исходные данные'!$C$29,IF('Исходные данные'!I29=\"да\",1,0),IF('параметры заявки'!$D$9='Исходные данные'!$C$21,IF('Исходные данные'!I21=\"да\",1,0),IF('параметры заявки'!$D$9='Исходные данные'!$C$22,IF('Исходные данные'!I22=\"да\",1,0)))))))))))","v":0},{"$f":"IF('параметры заявки'!$D$9=\"РФ\",1,IF('параметры заявки'!$D$9='Исходные данные'!$C$23,IF('Исходные данные'!J23=\"да\",1,0),IF('параметры заявки'!$D$9='Исходные данные'!$C$24,IF('Исходные данные'!J24=\"да\",1,0),IF('параметры заявки'!$D$9='Исходные данные'!$C$25,IF('Исходные данные'!J25=\"да\",1,0),IF('параметры заявки'!$D$9='Исходные данные'!$C$26,IF('Исходные данные'!J26=\"да\",1,0),IF('параметры заявки'!$D$9='Исходные данные'!$C$27,IF('Исходные данные'!J27=\"да\",1,0),IF('параметры заявки'!$D$9='Исходные данные'!$C$28,IF('Исходные данные'!J28=\"да\",1,0),IF('параметры заявки'!$D$9='Исходные данные'!$C$29,IF('Исходные данные'!J29=\"да\",1,0),IF('параметры заявки'!$D$9='Исходные данные'!$C$21,IF('Исходные данные'!J21=\"да\",1,0),IF('параметры заявки'!$D$9='Исходные данные'!$C$22,IF('Исходные данные'!J22=\"да\",1,0)))))))))))","v":0},{"$f":"IF('параметры заявки'!$D$9=\"РФ\",1,IF('параметры заявки'!$D$9='Исходные данные'!$C$23,IF('Исходные данные'!K23=\"да\",1,0),IF('параметры заявки'!$D$9='Исходные данные'!$C$24,IF('Исходные данные'!K24=\"да\",1,0),IF('параметры заявки'!$D$9='Исходные данные'!$C$25,IF('Исходные данные'!K25=\"да\",1,0),IF('параметры заявки'!$D$9='Исходные данные'!$C$26,IF('Исходные данные'!K26=\"да\",1,0),IF('параметры заявки'!$D$9='Исходные данные'!$C$27,IF('Исходные данные'!K27=\"да\",1,0),IF('параметры заявки'!$D$9='Исходные данные'!$C$28,IF('Исходные данные'!K28=\"да\",1,0),IF('параметры заявки'!$D$9='Исходные данные'!$C$29,IF('Исходные данные'!K29=\"да\",1,0),IF('параметры заявки'!$D$9='Исходные данные'!$C$21,IF('Исходные данные'!K21=\"да\",1,0),IF('параметры заявки'!$D$9='Исходные данные'!$C$22,IF('Исходные данные'!K22=\"да\",1,0)))))))))))","v":0},{"$f":"IF('параметры заявки'!$D$9=\"РФ\",1,IF('параметры заявки'!$D$9='Исходные данные'!$C$23,IF('Исходные данные'!L23=\"да\",1,0),IF('параметры заявки'!$D$9='Исходные данные'!$C$24,IF('Исходные данные'!L24=\"да\",1,0),IF('параметры заявки'!$D$9='Исходные данные'!$C$25,IF('Исходные данные'!L25=\"да\",1,0),IF('параметры заявки'!$D$9='Исходные данные'!$C$26,IF('Исходные данные'!L26=\"да\",1,0),IF('параметры заявки'!$D$9='Исходные данные'!$C$27,IF('Исходные данные'!L27=\"да\",1,0),IF('параметры заявки'!$D$9='Исходные данные'!$C$28,IF('Исходные данные'!L28=\"да\",1,0),IF('параметры заявки'!$D$9='Исходные данные'!$C$29,IF('Исходные данные'!L29=\"да\",1,0),IF('параметры заявки'!$D$9='Исходные данные'!$C$21,IF('Исходные данные'!L21=\"да\",1,0),IF('параметры заявки'!$D$9='Исходные данные'!$C$22,IF('Исходные данные'!L22=\"да\",1,0)))))))))))","v":0},{"$f":"IF('параметры заявки'!$D$9=\"РФ\",1,IF('параметры заявки'!$D$9='Исходные данные'!$C$23,IF('Исходные данные'!M23=\"да\",1,0),IF('параметры заявки'!$D$9='Исходные данные'!$C$24,IF('Исходные данные'!M24=\"да\",1,0),IF('параметры заявки'!$D$9='Исходные данные'!$C$25,IF('Исходные данные'!M25=\"да\",1,0),IF('параметры заявки'!$D$9='Исходные данные'!$C$26,IF('Исходные данные'!M26=\"да\",1,0),IF('параметры заявки'!$D$9='Исходные данные'!$C$27,IF('Исходные данные'!M27=\"да\",1,0),IF('параметры заявки'!$D$9='Исходные данные'!$C$28,IF('Исходные данные'!M28=\"да\",1,0),IF('параметры заявки'!$D$9='Исходные данные'!$C$29,IF('Исходные данные'!M29=\"да\",1,0),IF('параметры заявки'!$D$9='Исходные данные'!$C$21,IF('Исходные данные'!M21=\"да\",1,0),IF('параметры заявки'!$D$9='Исходные данные'!$C$22,IF('Исходные данные'!M22=\"да\",1,0)))))))))))","v":0},{"$f":"IF('параметры заявки'!$D$9=\"РФ\",1,IF('параметры заявки'!$D$9='Исходные данные'!$C$23,IF('Исходные данные'!N23=\"да\",1,0),IF('параметры заявки'!$D$9='Исходные данные'!$C$24,IF('Исходные данные'!N24=\"да\",1,0),IF('параметры заявки'!$D$9='Исходные данные'!$C$25,IF('Исходные данные'!N25=\"да\",1,0),IF('параметры заявки'!$D$9='Исходные данные'!$C$26,IF('Исходные данные'!N26=\"да\",1,0),IF('параметры заявки'!$D$9='Исходные данные'!$C$27,IF('Исходные данные'!N27=\"да\",1,0),IF('параметры заявки'!$D$9='Исходные данные'!$C$28,IF('Исходные данные'!N28=\"да\",1,0),IF('параметры заявки'!$D$9='Исходные данные'!$C$29,IF('Исходные данные'!N29=\"да\",1,0),IF('параметры заявки'!$D$9='Исходные данные'!$C$21,IF('Исходные данные'!N21=\"да\",1,0),IF('параметры заявки'!$D$9='Исходные данные'!$C$22,IF('Исходные данные'!N22=\"да\",1,0)))))))))))","v":0},{"$f":"IF('параметры заявки'!$D$9=\"РФ\",1,IF('параметры заявки'!$D$9='Исходные данные'!$C$23,IF('Исходные данные'!O23=\"да\",1,0),IF('параметры заявки'!$D$9='Исходные данные'!$C$24,IF('Исходные данные'!O24=\"да\",1,0),IF('параметры заявки'!$D$9='Исходные данные'!$C$25,IF('Исходные данные'!O25=\"да\",1,0),IF('параметры заявки'!$D$9='Исходные данные'!$C$26,IF('Исходные данные'!O26=\"да\",1,0),IF('параметры заявки'!$D$9='Исходные данные'!$C$27,IF('Исходные данные'!O27=\"да\",1,0),IF('параметры заявки'!$D$9='Исходные данные'!$C$28,IF('Исходные данные'!O28=\"да\",1,0),IF('параметры заявки'!$D$9='Исходные данные'!$C$29,IF('Исходные данные'!O29=\"да\",1,0),IF('параметры заявки'!$D$9='Исходные данные'!$C$21,IF('Исходные данные'!O21=\"да\",1,0),IF('параметры заявки'!$D$9='Исходные данные'!$C$22,IF('Исходные данные'!O22=\"да\",1,0)))))))))))","v":0},{"$f":"IF('параметры заявки'!$D$9=\"РФ\",1,IF('параметры заявки'!$D$9='Исходные данные'!$C$23,IF('Исходные данные'!P23=\"да\",1,0),IF('параметры заявки'!$D$9='Исходные данные'!$C$24,IF('Исходные данные'!P24=\"да\",1,0),IF('параметры заявки'!$D$9='Исходные данные'!$C$25,IF('Исходные данные'!P25=\"да\",1,0),IF('параметры заявки'!$D$9='Исходные данные'!$C$26,IF('Исходные данные'!P26=\"да\",1,0),IF('параметры заявки'!$D$9='Исходные данные'!$C$27,IF('Исходные данные'!P27=\"да\",1,0),IF('параметры заявки'!$D$9='Исходные данные'!$C$28,IF('Исходные данные'!P28=\"да\",1,0),IF('параметры заявки'!$D$9='Исходные данные'!$C$29,IF('Исходные данные'!P29=\"да\",1,0),IF('параметры заявки'!$D$9='Исходные данные'!$C$21,IF('Исходные данные'!P21=\"да\",1,0),IF('параметры заявки'!$D$9='Исходные данные'!$C$22,IF('Исходные данные'!P22=\"да\",1,0)))))))))))","v":0},{"$f":"IF('параметры заявки'!$D$9=\"РФ\",1,IF('параметры заявки'!$D$9='Исходные данные'!$C$23,IF('Исходные данные'!Q23=\"да\",1,0),IF('параметры заявки'!$D$9='Исходные данные'!$C$24,IF('Исходные данные'!Q24=\"да\",1,0),IF('параметры заявки'!$D$9='Исходные данные'!$C$25,IF('Исходные данные'!Q25=\"да\",1,0),IF('параметры заявки'!$D$9='Исходные данные'!$C$26,IF('Исходные данные'!Q26=\"да\",1,0),IF('параметры заявки'!$D$9='Исходные данные'!$C$27,IF('Исходные данные'!Q27=\"да\",1,0),IF('параметры заявки'!$D$9='Исходные данные'!$C$28,IF('Исходные данные'!Q28=\"да\",1,0),IF('параметры заявки'!$D$9='Исходные данные'!$C$29,IF('Исходные данные'!Q29=\"да\",1,0),IF('параметры заявки'!$D$9='Исходные данные'!$C$21,IF('Исходные данные'!Q21=\"да\",1,0),IF('параметры заявки'!$D$9='Исходные данные'!$C$22,IF('Исходные данные'!Q22=\"да\",1,0)))))))))))","v":1},{"$f":"IF('параметры заявки'!$D$9=\"РФ\",1,IF('параметры заявки'!$D$9='Исходные данные'!$C$23,IF('Исходные данные'!R23=\"да\",1,0),IF('параметры заявки'!$D$9='Исходные данные'!$C$24,IF('Исходные данные'!R24=\"да\",1,0),IF('параметры заявки'!$D$9='Исходные данные'!$C$25,IF('Исходные данные'!R25=\"да\",1,0),IF('параметры заявки'!$D$9='Исходные данные'!$C$26,IF('Исходные данные'!R26=\"да\",1,0),IF('параметры заявки'!$D$9='Исходные данные'!$C$27,IF('Исходные данные'!R27=\"да\",1,0),IF('параметры заявки'!$D$9='Исходные данные'!$C$28,IF('Исходные данные'!R28=\"да\",1,0),IF('параметры заявки'!$D$9='Исходные данные'!$C$29,IF('Исходные данные'!R29=\"да\",1,0),IF('параметры заявки'!$D$9='Исходные данные'!$C$21,IF('Исходные данные'!R21=\"да\",1,0),IF('параметры заявки'!$D$9='Исходные данные'!$C$22,IF('Исходные данные'!R22=\"да\",1,0)))))))))))","v":0},{"$f":"IF('параметры заявки'!$D$9=\"РФ\",1,IF('параметры заявки'!$D$9='Исходные данные'!$C$23,IF('Исходные данные'!S23=\"да\",1,0),IF('параметры заявки'!$D$9='Исходные данные'!$C$24,IF('Исходные данные'!S24=\"да\",1,0),IF('параметры заявки'!$D$9='Исходные данные'!$C$25,IF('Исходные данные'!S25=\"да\",1,0),IF('параметры заявки'!$D$9='Исходные данные'!$C$26,IF('Исходные данные'!S26=\"да\",1,0),IF('параметры заявки'!$D$9='Исходные данные'!$C$27,IF('Исходные данные'!S27=\"да\",1,0),IF('параметры заявки'!$D$9='Исходные данные'!$C$28,IF('Исходные данные'!S28=\"да\",1,0),IF('параметры заявки'!$D$9='Исходные данные'!$C$29,IF('Исходные данные'!S29=\"да\",1,0),IF('параметры заявки'!$D$9='Исходные данные'!$C$21,IF('Исходные данные'!S21=\"да\",1,0),IF('параметры заявки'!$D$9='Исходные данные'!$C$22,IF('Исходные данные'!S22=\"да\",1,0)))))))))))","v":1},{"$f":"IF('параметры заявки'!$D$9=\"РФ\",1,IF('параметры заявки'!$D$9='Исходные данные'!$C$23,IF('Исходные данные'!T23=\"да\",1,0),IF('параметры заявки'!$D$9='Исходные данные'!$C$24,IF('Исходные данные'!T24=\"да\",1,0),IF('параметры заявки'!$D$9='Исходные данные'!$C$25,IF('Исходные данные'!T25=\"да\",1,0),IF('параметры заявки'!$D$9='Исходные данные'!$C$26,IF('Исходные данные'!T26=\"да\",1,0),IF('параметры заявки'!$D$9='Исходные данные'!$C$27,IF('Исходные данные'!T27=\"да\",1,0),IF('параметры заявки'!$D$9='Исходные данные'!$C$28,IF('Исходные данные'!T28=\"да\",1,0),IF('параметры заявки'!$D$9='Исходные данные'!$C$29,IF('Исходные данные'!T29=\"да\",1,0),IF('параметры заявки'!$D$9='Исходные данные'!$C$21,IF('Исходные данные'!T21=\"да\",1,0),IF('параметры заявки'!$D$9='Исходные данные'!$C$22,IF('Исходные данные'!T22=\"да\",1,0)))))))))))","v":0},{"$f":"IF('параметры заявки'!$D$9=\"РФ\",1,IF('параметры заявки'!$D$9='Исходные данные'!$C$23,IF('Исходные данные'!U23=\"да\",1,0),IF('параметры заявки'!$D$9='Исходные данные'!$C$24,IF('Исходные данные'!U24=\"да\",1,0),IF('параметры заявки'!$D$9='Исходные данные'!$C$25,IF('Исходные данные'!U25=\"да\",1,0),IF('параметры заявки'!$D$9='Исходные данные'!$C$26,IF('Исходные данные'!U26=\"да\",1,0),IF('параметры заявки'!$D$9='Исходные данные'!$C$27,IF('Исходные данные'!U27=\"да\",1,0),IF('параметры заявки'!$D$9='Исходные данные'!$C$28,IF('Исходные данные'!U28=\"да\",1,0),IF('параметры заявки'!$D$9='Исходные данные'!$C$29,IF('Исходные данные'!U29=\"да\",1,0),IF('параметры заявки'!$D$9='Исходные данные'!$C$21,IF('Исходные данные'!U21=\"да\",1,0),IF('параметры заявки'!$D$9='Исходные данные'!$C$22,IF('Исходные данные'!U22=\"да\",1,0)))))))))))","v":0},{"$f":"IF('параметры заявки'!$D$9=\"РФ\",1,IF('параметры заявки'!$D$9='Исходные данные'!$C$23,IF('Исходные данные'!V23=\"да\",1,0),IF('параметры заявки'!$D$9='Исходные данные'!$C$24,IF('Исходные данные'!V24=\"да\",1,0),IF('параметры заявки'!$D$9='Исходные данные'!$C$25,IF('Исходные данные'!V25=\"да\",1,0),IF('параметры заявки'!$D$9='Исходные данные'!$C$26,IF('Исходные данные'!V26=\"да\",1,0),IF('параметры заявки'!$D$9='Исходные данные'!$C$27,IF('Исходные данные'!V27=\"да\",1,0),IF('параметры заявки'!$D$9='Исходные данные'!$C$28,IF('Исходные данные'!V28=\"да\",1,0),IF('параметры заявки'!$D$9='Исходные данные'!$C$29,IF('Исходные данные'!V29=\"да\",1,0),IF('параметры заявки'!$D$9='Исходные данные'!$C$21,IF('Исходные данные'!V21=\"да\",1,0),IF('параметры заявки'!$D$9='Исходные данные'!$C$22,IF('Исходные данные'!V22=\"да\",1,0)))))))))))","v":0},{"$f":"IF('параметры заявки'!$D$9=\"РФ\",1,IF('параметры заявки'!$D$9='Исходные данные'!$C$23,IF('Исходные данные'!W23=\"да\",1,0),IF('параметры заявки'!$D$9='Исходные данные'!$C$24,IF('Исходные данные'!W24=\"да\",1,0),IF('параметры заявки'!$D$9='Исходные данные'!$C$25,IF('Исходные данные'!W25=\"да\",1,0),IF('параметры заявки'!$D$9='Исходные данные'!$C$26,IF('Исходные данные'!W26=\"да\",1,0),IF('параметры заявки'!$D$9='Исходные данные'!$C$27,IF('Исходные данные'!W27=\"да\",1,0),IF('параметры заявки'!$D$9='Исходные данные'!$C$28,IF('Исходные данные'!W28=\"да\",1,0),IF('параметры заявки'!$D$9='Исходные данные'!$C$29,IF('Исходные данные'!W29=\"да\",1,0),IF('параметры заявки'!$D$9='Исходные данные'!$C$21,IF('Исходные данные'!W21=\"да\",1,0),IF('параметры заявки'!$D$9='Исходные данные'!$C$22,IF('Исходные данные'!W22=\"да\",1,0)))))))))))","v":0},{"$f":"IF('параметры заявки'!$D$9=\"РФ\",1,IF('параметры заявки'!$D$9='Исходные данные'!$C$23,IF('Исходные данные'!X23=\"да\",1,0),IF('параметры заявки'!$D$9='Исходные данные'!$C$24,IF('Исходные данные'!X24=\"да\",1,0),IF('параметры заявки'!$D$9='Исходные данные'!$C$25,IF('Исходные данные'!X25=\"да\",1,0),IF('параметры заявки'!$D$9='Исходные данные'!$C$26,IF('Исходные данные'!X26=\"да\",1,0),IF('параметры заявки'!$D$9='Исходные данные'!$C$27,IF('Исходные данные'!X27=\"да\",1,0),IF('параметры заявки'!$D$9='Исходные данные'!$C$28,IF('Исходные данные'!X28=\"да\",1,0),IF('параметры заявки'!$D$9='Исходные данные'!$C$29,IF('Исходные данные'!X29=\"да\",1,0),IF('параметры заявки'!$D$9='Исходные данные'!$C$21,IF('Исходные данные'!X21=\"да\",1,0),IF('параметры заявки'!$D$9='Исходные данные'!$C$22,IF('Исходные данные'!X22=\"да\",1,0)))))))))))","v":1},{"$f":"IF('параметры заявки'!$D$9=\"РФ\",1,IF('параметры заявки'!$D$9='Исходные данные'!$C$23,IF('Исходные данные'!Y23=\"да\",1,0),IF('параметры заявки'!$D$9='Исходные данные'!$C$24,IF('Исходные данные'!Y24=\"да\",1,0),IF('параметры заявки'!$D$9='Исходные данные'!$C$25,IF('Исходные данные'!Y25=\"да\",1,0),IF('параметры заявки'!$D$9='Исходные данные'!$C$26,IF('Исходные данные'!Y26=\"да\",1,0),IF('параметры заявки'!$D$9='Исходные данные'!$C$27,IF('Исходные данные'!Y27=\"да\",1,0),IF('параметры заявки'!$D$9='Исходные данные'!$C$28,IF('Исходные данные'!Y28=\"да\",1,0),IF('параметры заявки'!$D$9='Исходные данные'!$C$29,IF('Исходные данные'!Y29=\"да\",1,0),IF('параметры заявки'!$D$9='Исходные данные'!$C$21,IF('Исходные данные'!Y21=\"да\",1,0),IF('параметры заявки'!$D$9='Исходные данные'!$C$22,IF('Исходные данные'!Y22=\"да\",1,0)))))))))))","v":0},{"$f":"IF('параметры заявки'!$D$9=\"РФ\",1,IF('параметры заявки'!$D$9='Исходные данные'!$C$23,IF('Исходные данные'!Z23=\"да\",1,0),IF('параметры заявки'!$D$9='Исходные данные'!$C$24,IF('Исходные данные'!Z24=\"да\",1,0),IF('параметры заявки'!$D$9='Исходные данные'!$C$25,IF('Исходные данные'!Z25=\"да\",1,0),IF('параметры заявки'!$D$9='Исходные данные'!$C$26,IF('Исходные данные'!Z26=\"да\",1,0),IF('параметры заявки'!$D$9='Исходные данные'!$C$27,IF('Исходные данные'!Z27=\"да\",1,0),IF('параметры заявки'!$D$9='Исходные данные'!$C$28,IF('Исходные данные'!Z28=\"да\",1,0),IF('параметры заявки'!$D$9='Исходные данные'!$C$29,IF('Исходные данные'!Z29=\"да\",1,0),IF('параметры заявки'!$D$9='Исходные данные'!$C$21,IF('Исходные данные'!Z21=\"да\",1,0),IF('параметры заявки'!$D$9='Исходные данные'!$C$22,IF('Исходные данные'!Z22=\"да\",1,0)))))))))))","v":1},{"$f":"IF('параметры заявки'!$D$9=\"РФ\",1,IF('параметры заявки'!$D$9='Исходные данные'!$C$23,IF('Исходные данные'!AA23=\"да\",1,0),IF('параметры заявки'!$D$9='Исходные данные'!$C$24,IF('Исходные данные'!AA24=\"да\",1,0),IF('параметры заявки'!$D$9='Исходные данные'!$C$25,IF('Исходные данные'!AA25=\"да\",1,0),IF('параметры заявки'!$D$9='Исходные данные'!$C$26,IF('Исходные данные'!AA26=\"да\",1,0),IF('параметры заявки'!$D$9='Исходные данные'!$C$27,IF('Исходные данные'!AA27=\"да\",1,0),IF('параметры заявки'!$D$9='Исходные данные'!$C$28,IF('Исходные данные'!AA28=\"да\",1,0),IF('параметры заявки'!$D$9='Исходные данные'!$C$29,IF('Исходные данные'!AA29=\"да\",1,0),IF('параметры заявки'!$D$9='Исходные данные'!$C$21,IF('Исходные данные'!AA21=\"да\",1,0),IF('параметры заявки'!$D$9='Исходные данные'!$C$22,IF('Исходные данные'!AA22=\"да\",1,0)))))))))))","v":0},{"$f":"IF('параметры заявки'!$D$9=\"РФ\",1,IF('параметры заявки'!$D$9='Исходные данные'!$C$23,IF('Исходные данные'!AB23=\"да\",1,0),IF('параметры заявки'!$D$9='Исходные данные'!$C$24,IF('Исходные данные'!AB24=\"да\",1,0),IF('параметры заявки'!$D$9='Исходные данные'!$C$25,IF('Исходные данные'!AB25=\"да\",1,0),IF('параметры заявки'!$D$9='Исходные данные'!$C$26,IF('Исходные данные'!AB26=\"да\",1,0),IF('параметры заявки'!$D$9='Исходные данные'!$C$27,IF('Исходные данные'!AB27=\"да\",1,0),IF('параметры заявки'!$D$9='Исходные данные'!$C$28,IF('Исходные данные'!AB28=\"да\",1,0),IF('параметры заявки'!$D$9='Исходные данные'!$C$29,IF('Исходные данные'!AB29=\"да\",1,0),IF('параметры заявки'!$D$9='Исходные данные'!$C$21,IF('Исходные данные'!AB21=\"да\",1,0),IF('параметры заявки'!$D$9='Исходные данные'!$C$22,IF('Исходные данные'!AB22=\"да\",1,0)))))))))))","v":0},{"$f":"IF('параметры заявки'!$D$9=\"РФ\",1,IF('параметры заявки'!$D$9='Исходные данные'!$C$23,IF('Исходные данные'!AC23=\"да\",1,0),IF('параметры заявки'!$D$9='Исходные данные'!$C$24,IF('Исходные данные'!AC24=\"да\",1,0),IF('параметры заявки'!$D$9='Исходные данные'!$C$25,IF('Исходные данные'!AC25=\"да\",1,0),IF('параметры заявки'!$D$9='Исходные данные'!$C$26,IF('Исходные данные'!AC26=\"да\",1,0),IF('параметры заявки'!$D$9='Исходные данные'!$C$27,IF('Исходные данные'!AC27=\"да\",1,0),IF('параметры заявки'!$D$9='Исходные данные'!$C$28,IF('Исходные данные'!AC28=\"да\",1,0),IF('параметры заявки'!$D$9='Исходные данные'!$C$29,IF('Исходные данные'!AC29=\"да\",1,0),IF('параметры заявки'!$D$9='Исходные данные'!$C$21,IF('Исходные данные'!AC21=\"да\",1,0),IF('параметры заявки'!$D$9='Исходные данные'!$C$22,IF('Исходные данные'!AC22=\"да\",1,0)))))))))))","v":1},{"$f":"IF('параметры заявки'!$D$9=\"РФ\",1,IF('параметры заявки'!$D$9='Исходные данные'!$C$23,IF('Исходные данные'!AD23=\"да\",1,0),IF('параметры заявки'!$D$9='Исходные данные'!$C$24,IF('Исходные данные'!AD24=\"да\",1,0),IF('параметры заявки'!$D$9='Исходные данные'!$C$25,IF('Исходные данные'!AD25=\"да\",1,0),IF('параметры заявки'!$D$9='Исходные данные'!$C$26,IF('Исходные данные'!AD26=\"да\",1,0),IF('параметры заявки'!$D$9='Исходные данные'!$C$27,IF('Исходные данные'!AD27=\"да\",1,0),IF('параметры заявки'!$D$9='Исходные данные'!$C$28,IF('Исходные данные'!AD28=\"да\",1,0),IF('параметры заявки'!$D$9='Исходные данные'!$C$29,IF('Исходные данные'!AD29=\"да\",1,0),IF('параметры заявки'!$D$9='Исходные данные'!$C$21,IF('Исходные данные'!AD21=\"да\",1,0),IF('параметры заявки'!$D$9='Исходные данные'!$C$22,IF('Исходные данные'!AD22=\"да\",1,0)))))))))))","v":0},{"$f":"IF('параметры заявки'!$D$9=\"РФ\",1,IF('параметры заявки'!$D$9='Исходные данные'!$C$23,IF('Исходные данные'!AE23=\"да\",1,0),IF('параметры заявки'!$D$9='Исходные данные'!$C$24,IF('Исходные данные'!AE24=\"да\",1,0),IF('параметры заявки'!$D$9='Исходные данные'!$C$25,IF('Исходные данные'!AE25=\"да\",1,0),IF('параметры заявки'!$D$9='Исходные данные'!$C$26,IF('Исходные данные'!AE26=\"да\",1,0),IF('параметры заявки'!$D$9='Исходные данные'!$C$27,IF('Исходные данные'!AE27=\"да\",1,0),IF('параметры заявки'!$D$9='Исходные данные'!$C$28,IF('Исходные данные'!AE28=\"да\",1,0),IF('параметры заявки'!$D$9='Исходные данные'!$C$29,IF('Исходные данные'!AE29=\"да\",1,0),IF('параметры заявки'!$D$9='Исходные данные'!$C$21,IF('Исходные данные'!AE21=\"да\",1,0),IF('параметры заявки'!$D$9='Исходные данные'!$C$22,IF('Исходные данные'!AE22=\"да\",1,0)))))))))))","v":0},{"$f":"IF('параметры заявки'!$D$9=\"РФ\",1,IF('параметры заявки'!$D$9='Исходные данные'!$C$23,IF('Исходные данные'!AF23=\"да\",1,0),IF('параметры заявки'!$D$9='Исходные данные'!$C$24,IF('Исходные данные'!AF24=\"да\",1,0),IF('параметры заявки'!$D$9='Исходные данные'!$C$25,IF('Исходные данные'!AF25=\"да\",1,0),IF('параметры заявки'!$D$9='Исходные данные'!$C$26,IF('Исходные данные'!AF26=\"да\",1,0),IF('параметры заявки'!$D$9='Исходные данные'!$C$27,IF('Исходные данные'!AF27=\"да\",1,0),IF('параметры заявки'!$D$9='Исходные данные'!$C$28,IF('Исходные данные'!AF28=\"да\",1,0),IF('параметры заявки'!$D$9='Исходные данные'!$C$29,IF('Исходные данные'!AF29=\"да\",1,0),IF('параметры заявки'!$D$9='Исходные данные'!$C$21,IF('Исходные данные'!AF21=\"да\",1,0),IF('параметры заявки'!$D$9='Исходные данные'!$C$22,IF('Исходные данные'!AF22=\"да\",1,0)))))))))))","v":0},{"$f":"IF('параметры заявки'!$D$9=\"РФ\",1,IF('параметры заявки'!$D$9='Исходные данные'!$C$23,IF('Исходные данные'!AG23=\"да\",1,0),IF('параметры заявки'!$D$9='Исходные данные'!$C$24,IF('Исходные данные'!AG24=\"да\",1,0),IF('параметры заявки'!$D$9='Исходные данные'!$C$25,IF('Исходные данные'!AG25=\"да\",1,0),IF('параметры заявки'!$D$9='Исходные данные'!$C$26,IF('Исходные данные'!AG26=\"да\",1,0),IF('параметры заявки'!$D$9='Исходные данные'!$C$27,IF('Исходные данные'!AG27=\"да\",1,0),IF('параметры заявки'!$D$9='Исходные данные'!$C$28,IF('Исходные данные'!AG28=\"да\",1,0),IF('параметры заявки'!$D$9='Исходные данные'!$C$29,IF('Исходные данные'!AG29=\"да\",1,0),IF('параметры заявки'!$D$9='Исходные данные'!$C$21,IF('Исходные данные'!AG21=\"да\",1,0),IF('параметры заявки'!$D$9='Исходные данные'!$C$22,IF('Исходные данные'!AG22=\"да\",1,0)))))))))))","v":0},{"$f":"IF('параметры заявки'!$D$9=\"РФ\",1,IF('параметры заявки'!$D$9='Исходные данные'!$C$23,IF('Исходные данные'!AH23=\"да\",1,0),IF('параметры заявки'!$D$9='Исходные данные'!$C$24,IF('Исходные данные'!AH24=\"да\",1,0),IF('параметры заявки'!$D$9='Исходные данные'!$C$25,IF('Исходные данные'!AH25=\"да\",1,0),IF('параметры заявки'!$D$9='Исходные данные'!$C$26,IF('Исходные данные'!AH26=\"да\",1,0),IF('параметры заявки'!$D$9='Исходные данные'!$C$27,IF('Исходные данные'!AH27=\"да\",1,0),IF('параметры заявки'!$D$9='Исходные данные'!$C$28,IF('Исходные данные'!AH28=\"да\",1,0),IF('параметры заявки'!$D$9='Исходные данные'!$C$29,IF('Исходные данные'!AH29=\"да\",1,0),IF('параметры заявки'!$D$9='Исходные данные'!$C$21,IF('Исходные данные'!AH21=\"да\",1,0),IF('параметры заявки'!$D$9='Исходные данные'!$C$22,IF('Исходные данные'!AH22=\"да\",1,0)))))))))))","v":0},{"$f":"IF('параметры заявки'!$D$9=\"РФ\",1,IF('параметры заявки'!$D$9='Исходные данные'!$C$23,IF('Исходные данные'!AI23=\"да\",1,0),IF('параметры заявки'!$D$9='Исходные данные'!$C$24,IF('Исходные данные'!AI24=\"да\",1,0),IF('параметры заявки'!$D$9='Исходные данные'!$C$25,IF('Исходные данные'!AI25=\"да\",1,0),IF('параметры заявки'!$D$9='Исходные данные'!$C$26,IF('Исходные данные'!AI26=\"да\",1,0),IF('параметры заявки'!$D$9='Исходные данные'!$C$27,IF('Исходные данные'!AI27=\"да\",1,0),IF('параметры заявки'!$D$9='Исходные данные'!$C$28,IF('Исходные данные'!AI28=\"да\",1,0),IF('параметры заявки'!$D$9='Исходные данные'!$C$29,IF('Исходные данные'!AI29=\"да\",1,0),IF('параметры заявки'!$D$9='Исходные данные'!$C$21,IF('Исходные данные'!AI21=\"да\",1,0),IF('параметры заявки'!$D$9='Исходные данные'!$C$22,IF('Исходные данные'!AI22=\"да\",1,0)))))))))))","v":0},{"$f":"IF('параметры заявки'!$D$9=\"РФ\",1,IF('параметры заявки'!$D$9='Исходные данные'!$C$23,IF('Исходные данные'!AJ23=\"да\",1,0),IF('параметры заявки'!$D$9='Исходные данные'!$C$24,IF('Исходные данные'!AJ24=\"да\",1,0),IF('параметры заявки'!$D$9='Исходные данные'!$C$25,IF('Исходные данные'!AJ25=\"да\",1,0),IF('параметры заявки'!$D$9='Исходные данные'!$C$26,IF('Исходные данные'!AJ26=\"да\",1,0),IF('параметры заявки'!$D$9='Исходные данные'!$C$27,IF('Исходные данные'!AJ27=\"да\",1,0),IF('параметры заявки'!$D$9='Исходные данные'!$C$28,IF('Исходные данные'!AJ28=\"да\",1,0),IF('параметры заявки'!$D$9='Исходные данные'!$C$29,IF('Исходные данные'!AJ29=\"да\",1,0),IF('параметры заявки'!$D$9='Исходные данные'!$C$21,IF('Исходные данные'!AJ21=\"да\",1,0),IF('параметры заявки'!$D$9='Исходные данные'!$C$22,IF('Исходные данные'!AJ22=\"да\",1,0)))))))))))","v":0},{"$f":"IF('параметры заявки'!$D$9=\"РФ\",1,IF('параметры заявки'!$D$9='Исходные данные'!$C$23,IF('Исходные данные'!AK23=\"да\",1,0),IF('параметры заявки'!$D$9='Исходные данные'!$C$24,IF('Исходные данные'!AK24=\"да\",1,0),IF('параметры заявки'!$D$9='Исходные данные'!$C$25,IF('Исходные данные'!AK25=\"да\",1,0),IF('параметры заявки'!$D$9='Исходные данные'!$C$26,IF('Исходные данные'!AK26=\"да\",1,0),IF('параметры заявки'!$D$9='Исходные данные'!$C$27,IF('Исходные данные'!AK27=\"да\",1,0),IF('параметры заявки'!$D$9='Исходные данные'!$C$28,IF('Исходные данные'!AK28=\"да\",1,0),IF('параметры заявки'!$D$9='Исходные данные'!$C$29,IF('Исходные данные'!AK29=\"да\",1,0),IF('параметры заявки'!$D$9='Исходные данные'!$C$21,IF('Исходные данные'!AK21=\"да\",1,0),IF('параметры заявки'!$D$9='Исходные данные'!$C$22,IF('Исходные данные'!AK22=\"да\",1,0)))))))))))","v":1},{"$f":"IF('параметры заявки'!$D$9=\"РФ\",1,IF('параметры заявки'!$D$9='Исходные данные'!$C$23,IF('Исходные данные'!AL23=\"да\",1,0),IF('параметры заявки'!$D$9='Исходные данные'!$C$24,IF('Исходные данные'!AL24=\"да\",1,0),IF('параметры заявки'!$D$9='Исходные данные'!$C$25,IF('Исходные данные'!AL25=\"да\",1,0),IF('параметры заявки'!$D$9='Исходные данные'!$C$26,IF('Исходные данные'!AL26=\"да\",1,0),IF('параметры заявки'!$D$9='Исходные данные'!$C$27,IF('Исходные данные'!AL27=\"да\",1,0),IF('параметры заявки'!$D$9='Исходные данные'!$C$28,IF('Исходные данные'!AL28=\"да\",1,0),IF('параметры заявки'!$D$9='Исходные данные'!$C$29,IF('Исходные данные'!AL29=\"да\",1,0),IF('параметры заявки'!$D$9='Исходные данные'!$C$21,IF('Исходные данные'!AL21=\"да\",1,0),IF('параметры заявки'!$D$9='Исходные данные'!$C$22,IF('Исходные данные'!AL22=\"да\",1,0)))))))))))","v":0},{"$f":"IF('параметры заявки'!$D$9=\"РФ\",1,IF('параметры заявки'!$D$9='Исходные данные'!$C$23,IF('Исходные данные'!AM23=\"да\",1,0),IF('параметры заявки'!$D$9='Исходные данные'!$C$24,IF('Исходные данные'!AM24=\"да\",1,0),IF('параметры заявки'!$D$9='Исходные данные'!$C$25,IF('Исходные данные'!AM25=\"да\",1,0),IF('параметры заявки'!$D$9='Исходные данные'!$C$26,IF('Исходные данные'!AM26=\"да\",1,0),IF('параметры заявки'!$D$9='Исходные данные'!$C$27,IF('Исходные данные'!AM27=\"да\",1,0),IF('параметры заявки'!$D$9='Исходные данные'!$C$28,IF('Исходные данные'!AM28=\"да\",1,0),IF('параметры заявки'!$D$9='Исходные данные'!$C$29,IF('Исходные данные'!AM29=\"да\",1,0),IF('параметры заявки'!$D$9='Исходные данные'!$C$21,IF('Исходные данные'!AM21=\"да\",1,0),IF('параметры заявки'!$D$9='Исходные данные'!$C$22,IF('Исходные данные'!AM22=\"да\",1,0)))))))))))","v":0},{"$f":"IF('параметры заявки'!$D$9=\"РФ\",1,IF('параметры заявки'!$D$9='Исходные данные'!$C$23,IF('Исходные данные'!AN23=\"да\",1,0),IF('параметры заявки'!$D$9='Исходные данные'!$C$24,IF('Исходные данные'!AN24=\"да\",1,0),IF('параметры заявки'!$D$9='Исходные данные'!$C$25,IF('Исходные данные'!AN25=\"да\",1,0),IF('параметры заявки'!$D$9='Исходные данные'!$C$26,IF('Исходные данные'!AN26=\"да\",1,0),IF('параметры заявки'!$D$9='Исходные данные'!$C$27,IF('Исходные данные'!AN27=\"да\",1,0),IF('параметры заявки'!$D$9='Исходные данные'!$C$28,IF('Исходные данные'!AN28=\"да\",1,0),IF('параметры заявки'!$D$9='Исходные данные'!$C$29,IF('Исходные данные'!AN29=\"да\",1,0),IF('параметры заявки'!$D$9='Исходные данные'!$C$21,IF('Исходные данные'!AN21=\"да\",1,0),IF('параметры заявки'!$D$9='Исходные данные'!$C$22,IF('Исходные данные'!AN22=\"да\",1,0)))))))))))","v":1},{"$f":"IF('параметры заявки'!$D$9=\"РФ\",1,IF('параметры заявки'!$D$9='Исходные данные'!$C$23,IF('Исходные данные'!AO23=\"да\",1,0),IF('параметры заявки'!$D$9='Исходные данные'!$C$24,IF('Исходные данные'!AO24=\"да\",1,0),IF('параметры заявки'!$D$9='Исходные данные'!$C$25,IF('Исходные данные'!AO25=\"да\",1,0),IF('параметры заявки'!$D$9='Исходные данные'!$C$26,IF('Исходные данные'!AO26=\"да\",1,0),IF('параметры заявки'!$D$9='Исходные данные'!$C$27,IF('Исходные данные'!AO27=\"да\",1,0),IF('параметры заявки'!$D$9='Исходные данные'!$C$28,IF('Исходные данные'!AO28=\"да\",1,0),IF('параметры заявки'!$D$9='Исходные данные'!$C$29,IF('Исходные данные'!AO29=\"да\",1,0),IF('параметры заявки'!$D$9='Исходные данные'!$C$21,IF('Исходные данные'!AO21=\"да\",1,0),IF('параметры заявки'!$D$9='Исходные данные'!$C$22,IF('Исходные данные'!AO22=\"да\",1,0)))))))))))","v":0},{"$f":"IF('параметры заявки'!$D$9=\"РФ\",1,IF('параметры заявки'!$D$9='Исходные данные'!$C$23,IF('Исходные данные'!AP23=\"да\",1,0),IF('параметры заявки'!$D$9='Исходные данные'!$C$24,IF('Исходные данные'!AP24=\"да\",1,0),IF('параметры заявки'!$D$9='Исходные данные'!$C$25,IF('Исходные данные'!AP25=\"да\",1,0),IF('параметры заявки'!$D$9='Исходные данные'!$C$26,IF('Исходные данные'!AP26=\"да\",1,0),IF('параметры заявки'!$D$9='Исходные данные'!$C$27,IF('Исходные данные'!AP27=\"да\",1,0),IF('параметры заявки'!$D$9='Исходные данные'!$C$28,IF('Исходные данные'!AP28=\"да\",1,0),IF('параметры заявки'!$D$9='Исходные данные'!$C$29,IF('Исходные данные'!AP29=\"да\",1,0),IF('параметры заявки'!$D$9='Исходные данные'!$C$21,IF('Исходные данные'!AP21=\"да\",1,0),IF('параметры заявки'!$D$9='Исходные данные'!$C$22,IF('Исходные данные'!AP22=\"да\",1,0)))))))))))","v":0},{"$f":"IF('параметры заявки'!$D$9=\"РФ\",1,IF('параметры заявки'!$D$9='Исходные данные'!$C$23,IF('Исходные данные'!AQ23=\"да\",1,0),IF('параметры заявки'!$D$9='Исходные данные'!$C$24,IF('Исходные данные'!AQ24=\"да\",1,0),IF('параметры заявки'!$D$9='Исходные данные'!$C$25,IF('Исходные данные'!AQ25=\"да\",1,0),IF('параметры заявки'!$D$9='Исходные данные'!$C$26,IF('Исходные данные'!AQ26=\"да\",1,0),IF('параметры заявки'!$D$9='Исходные данные'!$C$27,IF('Исходные данные'!AQ27=\"да\",1,0),IF('параметры заявки'!$D$9='Исходные данные'!$C$28,IF('Исходные данные'!AQ28=\"да\",1,0),IF('параметры заявки'!$D$9='Исходные данные'!$C$29,IF('Исходные данные'!AQ29=\"да\",1,0),IF('параметры заявки'!$D$9='Исходные данные'!$C$21,IF('Исходные данные'!AQ21=\"да\",1,0),IF('параметры заявки'!$D$9='Исходные данные'!$C$22,IF('Исходные данные'!AQ22=\"да\",1,0)))))))))))","v":0},{"$f":"IF('параметры заявки'!$D$9=\"РФ\",1,IF('параметры заявки'!$D$9='Исходные данные'!$C$23,IF('Исходные данные'!AR23=\"да\",1,0),IF('параметры заявки'!$D$9='Исходные данные'!$C$24,IF('Исходные данные'!AR24=\"да\",1,0),IF('параметры заявки'!$D$9='Исходные данные'!$C$25,IF('Исходные данные'!AR25=\"да\",1,0),IF('параметры заявки'!$D$9='Исходные данные'!$C$26,IF('Исходные данные'!AR26=\"да\",1,0),IF('параметры заявки'!$D$9='Исходные данные'!$C$27,IF('Исходные данные'!AR27=\"да\",1,0),IF('параметры заявки'!$D$9='Исходные данные'!$C$28,IF('Исходные данные'!AR28=\"да\",1,0),IF('параметры заявки'!$D$9='Исходные данные'!$C$29,IF('Исходные данные'!AR29=\"да\",1,0),IF('параметры заявки'!$D$9='Исходные данные'!$C$21,IF('Исходные данные'!AR21=\"да\",1,0),IF('параметры заявки'!$D$9='Исходные данные'!$C$22,IF('Исходные данные'!AR22=\"да\",1,0)))))))))))","v":0},{"$f":"IF('параметры заявки'!$D$9=\"РФ\",1,IF('параметры заявки'!$D$9='Исходные данные'!$C$23,IF('Исходные данные'!AS23=\"да\",1,0),IF('параметры заявки'!$D$9='Исходные данные'!$C$24,IF('Исходные данные'!AS24=\"да\",1,0),IF('параметры заявки'!$D$9='Исходные данные'!$C$25,IF('Исходные данные'!AS25=\"да\",1,0),IF('параметры заявки'!$D$9='Исходные данные'!$C$26,IF('Исходные данные'!AS26=\"да\",1,0),IF('параметры заявки'!$D$9='Исходные данные'!$C$27,IF('Исходные данные'!AS27=\"да\",1,0),IF('параметры заявки'!$D$9='Исходные данные'!$C$28,IF('Исходные данные'!AS28=\"да\",1,0),IF('параметры заявки'!$D$9='Исходные данные'!$C$29,IF('Исходные данные'!AS29=\"да\",1,0),IF('параметры заявки'!$D$9='Исходные данные'!$C$21,IF('Исходные данные'!AS21=\"да\",1,0),IF('параметры заявки'!$D$9='Исходные данные'!$C$22,IF('Исходные данные'!AS22=\"да\",1,0)))))))))))","v":0},{"$f":"IF('параметры заявки'!$D$9=\"РФ\",1,IF('параметры заявки'!$D$9='Исходные данные'!$C$23,IF('Исходные данные'!AT23=\"да\",1,0),IF('параметры заявки'!$D$9='Исходные данные'!$C$24,IF('Исходные данные'!AT24=\"да\",1,0),IF('параметры заявки'!$D$9='Исходные данные'!$C$25,IF('Исходные данные'!AT25=\"да\",1,0),IF('параметры заявки'!$D$9='Исходные данные'!$C$26,IF('Исходные данные'!AT26=\"да\",1,0),IF('параметры заявки'!$D$9='Исходные данные'!$C$27,IF('Исходные данные'!AT27=\"да\",1,0),IF('параметры заявки'!$D$9='Исходные данные'!$C$28,IF('Исходные данные'!AT28=\"да\",1,0),IF('параметры заявки'!$D$9='Исходные данные'!$C$29,IF('Исходные данные'!AT29=\"да\",1,0),IF('параметры заявки'!$D$9='Исходные данные'!$C$21,IF('Исходные данные'!AT21=\"да\",1,0),IF('параметры заявки'!$D$9='Исходные данные'!$C$22,IF('Исходные данные'!AT22=\"да\",1,0)))))))))))","v":0},{"$f":"IF('параметры заявки'!$D$9=\"РФ\",1,IF('параметры заявки'!$D$9='Исходные данные'!$C$23,IF('Исходные данные'!AU23=\"да\",1,0),IF('параметры заявки'!$D$9='Исходные данные'!$C$24,IF('Исходные данные'!AU24=\"да\",1,0),IF('параметры заявки'!$D$9='Исходные данные'!$C$25,IF('Исходные данные'!AU25=\"да\",1,0),IF('параметры заявки'!$D$9='Исходные данные'!$C$26,IF('Исходные данные'!AU26=\"да\",1,0),IF('параметры заявки'!$D$9='Исходные данные'!$C$27,IF('Исходные данные'!AU27=\"да\",1,0),IF('параметры заявки'!$D$9='Исходные данные'!$C$28,IF('Исходные данные'!AU28=\"да\",1,0),IF('параметры заявки'!$D$9='Исходные данные'!$C$29,IF('Исходные данные'!AU29=\"да\",1,0),IF('параметры заявки'!$D$9='Исходные данные'!$C$21,IF('Исходные данные'!AU21=\"да\",1,0),IF('параметры заявки'!$D$9='Исходные данные'!$C$22,IF('Исходные данные'!AU22=\"да\",1,0)))))))))))","v":1},{"$f":"IF('параметры заявки'!$D$9=\"РФ\",1,IF('параметры заявки'!$D$9='Исходные данные'!$C$23,IF('Исходные данные'!AV23=\"да\",1,0),IF('параметры заявки'!$D$9='Исходные данные'!$C$24,IF('Исходные данные'!AV24=\"да\",1,0),IF('параметры заявки'!$D$9='Исходные данные'!$C$25,IF('Исходные данные'!AV25=\"да\",1,0),IF('параметры заявки'!$D$9='Исходные данные'!$C$26,IF('Исходные данные'!AV26=\"да\",1,0),IF('параметры заявки'!$D$9='Исходные данные'!$C$27,IF('Исходные данные'!AV27=\"да\",1,0),IF('параметры заявки'!$D$9='Исходные данные'!$C$28,IF('Исходные данные'!AV28=\"да\",1,0),IF('параметры заявки'!$D$9='Исходные данные'!$C$29,IF('Исходные данные'!AV29=\"да\",1,0),IF('параметры заявки'!$D$9='Исходные данные'!$C$21,IF('Исходные данные'!AV21=\"да\",1,0),IF('параметры заявки'!$D$9='Исходные данные'!$C$22,IF('Исходные данные'!AV22=\"да\",1,0)))))))))))","v":0},{"$f":"IF('параметры заявки'!$D$9=\"РФ\",1,IF('параметры заявки'!$D$9='Исходные данные'!$C$23,IF('Исходные данные'!AW23=\"да\",1,0),IF('параметры заявки'!$D$9='Исходные данные'!$C$24,IF('Исходные данные'!AW24=\"да\",1,0),IF('параметры заявки'!$D$9='Исходные данные'!$C$25,IF('Исходные данные'!AW25=\"да\",1,0),IF('параметры заявки'!$D$9='Исходные данные'!$C$26,IF('Исходные данные'!AW26=\"да\",1,0),IF('параметры заявки'!$D$9='Исходные данные'!$C$27,IF('Исходные данные'!AW27=\"да\",1,0),IF('параметры заявки'!$D$9='Исходные данные'!$C$28,IF('Исходные данные'!AW28=\"да\",1,0),IF('параметры заявки'!$D$9='Исходные данные'!$C$29,IF('Исходные данные'!AW29=\"да\",1,0),IF('параметры заявки'!$D$9='Исходные данные'!$C$21,IF('Исходные данные'!AW21=\"да\",1,0),IF('параметры заявки'!$D$9='Исходные данные'!$C$22,IF('Исходные данные'!AW22=\"да\",1,0)))))))))))","v":0},{"$f":"IF('параметры заявки'!$D$9=\"РФ\",1,IF('параметры заявки'!$D$9='Исходные данные'!$C$23,IF('Исходные данные'!AX23=\"да\",1,0),IF('параметры заявки'!$D$9='Исходные данные'!$C$24,IF('Исходные данные'!AX24=\"да\",1,0),IF('параметры заявки'!$D$9='Исходные данные'!$C$25,IF('Исходные данные'!AX25=\"да\",1,0),IF('параметры заявки'!$D$9='Исходные данные'!$C$26,IF('Исходные данные'!AX26=\"да\",1,0),IF('параметры заявки'!$D$9='Исходные данные'!$C$27,IF('Исходные данные'!AX27=\"да\",1,0),IF('параметры заявки'!$D$9='Исходные данные'!$C$28,IF('Исходные данные'!AX28=\"да\",1,0),IF('параметры заявки'!$D$9='Исходные данные'!$C$29,IF('Исходные данные'!AX29=\"да\",1,0),IF('параметры заявки'!$D$9='Исходные данные'!$C$21,IF('Исходные данные'!AX21=\"да\",1,0),IF('параметры заявки'!$D$9='Исходные данные'!$C$22,IF('Исходные данные'!AX22=\"да\",1,0)))))))))))","v":0},{"$f":"IF('параметры заявки'!$D$9=\"РФ\",1,IF('параметры заявки'!$D$9='Исходные данные'!$C$23,IF('Исходные данные'!AY23=\"да\",1,0),IF('параметры заявки'!$D$9='Исходные данные'!$C$24,IF('Исходные данные'!AY24=\"да\",1,0),IF('параметры заявки'!$D$9='Исходные данные'!$C$25,IF('Исходные данные'!AY25=\"да\",1,0),IF('параметры заявки'!$D$9='Исходные данные'!$C$26,IF('Исходные данные'!AY26=\"да\",1,0),IF('параметры заявки'!$D$9='Исходные данные'!$C$27,IF('Исходные данные'!AY27=\"да\",1,0),IF('параметры заявки'!$D$9='Исходные данные'!$C$28,IF('Исходные данные'!AY28=\"да\",1,0),IF('параметры заявки'!$D$9='Исходные данные'!$C$29,IF('Исходные данные'!AY29=\"да\",1,0),IF('параметры заявки'!$D$9='Исходные данные'!$C$21,IF('Исходные данные'!AY21=\"да\",1,0),IF('параметры заявки'!$D$9='Исходные данные'!$C$22,IF('Исходные данные'!AY22=\"да\",1,0)))))))))))","v":0},{"$f":"IF('параметры заявки'!$D$9=\"РФ\",1,IF('параметры заявки'!$D$9='Исходные данные'!$C$23,IF('Исходные данные'!AZ23=\"да\",1,0),IF('параметры заявки'!$D$9='Исходные данные'!$C$24,IF('Исходные данные'!AZ24=\"да\",1,0),IF('параметры заявки'!$D$9='Исходные данные'!$C$25,IF('Исходные данные'!AZ25=\"да\",1,0),IF('параметры заявки'!$D$9='Исходные данные'!$C$26,IF('Исходные данные'!AZ26=\"да\",1,0),IF('параметры заявки'!$D$9='Исходные данные'!$C$27,IF('Исходные данные'!AZ27=\"да\",1,0),IF('параметры заявки'!$D$9='Исходные данные'!$C$28,IF('Исходные данные'!AZ28=\"да\",1,0),IF('параметры заявки'!$D$9='Исходные данные'!$C$29,IF('Исходные данные'!AZ29=\"да\",1,0),IF('параметры заявки'!$D$9='Исходные данные'!$C$21,IF('Исходные данные'!AZ21=\"да\",1,0),IF('параметры заявки'!$D$9='Исходные данные'!$C$22,IF('Исходные данные'!AZ22=\"да\",1,0)))))))))))","v":0},{"$f":"IF('параметры заявки'!$D$9=\"РФ\",1,IF('параметры заявки'!$D$9='Исходные данные'!$C$23,IF('Исходные данные'!BA23=\"да\",1,0),IF('параметры заявки'!$D$9='Исходные данные'!$C$24,IF('Исходные данные'!BA24=\"да\",1,0),IF('параметры заявки'!$D$9='Исходные данные'!$C$25,IF('Исходные данные'!BA25=\"да\",1,0),IF('параметры заявки'!$D$9='Исходные данные'!$C$26,IF('Исходные данные'!BA26=\"да\",1,0),IF('параметры заявки'!$D$9='Исходные данные'!$C$27,IF('Исходные данные'!BA27=\"да\",1,0),IF('параметры заявки'!$D$9='Исходные данные'!$C$28,IF('Исходные данные'!BA28=\"да\",1,0),IF('параметры заявки'!$D$9='Исходные данные'!$C$29,IF('Исходные данные'!BA29=\"да\",1,0),IF('параметры заявки'!$D$9='Исходные данные'!$C$21,IF('Исходные данные'!BA21=\"да\",1,0),IF('параметры заявки'!$D$9='Исходные данные'!$C$22,IF('Исходные данные'!BA22=\"да\",1,0)))))))))))","v":0},{"$f":"IF('параметры заявки'!$D$9=\"РФ\",1,IF('параметры заявки'!$D$9='Исходные данные'!$C$23,IF('Исходные данные'!BB23=\"да\",1,0),IF('параметры заявки'!$D$9='Исходные данные'!$C$24,IF('Исходные данные'!BB24=\"да\",1,0),IF('параметры заявки'!$D$9='Исходные данные'!$C$25,IF('Исходные данные'!BB25=\"да\",1,0),IF('параметры заявки'!$D$9='Исходные данные'!$C$26,IF('Исходные данные'!BB26=\"да\",1,0),IF('параметры заявки'!$D$9='Исходные данные'!$C$27,IF('Исходные данные'!BB27=\"да\",1,0),IF('параметры заявки'!$D$9='Исходные данные'!$C$28,IF('Исходные данные'!BB28=\"да\",1,0),IF('параметры заявки'!$D$9='Исходные данные'!$C$29,IF('Исходные данные'!BB29=\"да\",1,0),IF('параметры заявки'!$D$9='Исходные данные'!$C$21,IF('Исходные данные'!BB21=\"да\",1,0),IF('параметры заявки'!$D$9='Исходные данные'!$C$22,IF('Исходные данные'!BB22=\"да\",1,0)))))))))))","v":0},{"$f":"IF('параметры заявки'!$D$9=\"РФ\",1,IF('параметры заявки'!$D$9='Исходные данные'!$C$23,IF('Исходные данные'!BC23=\"да\",1,0),IF('параметры заявки'!$D$9='Исходные данные'!$C$24,IF('Исходные данные'!BC24=\"да\",1,0),IF('параметры заявки'!$D$9='Исходные данные'!$C$25,IF('Исходные данные'!BC25=\"да\",1,0),IF('параметры заявки'!$D$9='Исходные данные'!$C$26,IF('Исходные данные'!BC26=\"да\",1,0),IF('параметры заявки'!$D$9='Исходные данные'!$C$27,IF('Исходные данные'!BC27=\"да\",1,0),IF('параметры заявки'!$D$9='Исходные данные'!$C$28,IF('Исходные данные'!BC28=\"да\",1,0),IF('параметры заявки'!$D$9='Исходные данные'!$C$29,IF('Исходные данные'!BC29=\"да\",1,0),IF('параметры заявки'!$D$9='Исходные данные'!$C$21,IF('Исходные данные'!BC21=\"да\",1,0),IF('параметры заявки'!$D$9='Исходные данные'!$C$22,IF('Исходные данные'!BC22=\"да\",1,0)))))))))))","v":0},{"$f":"IF('параметры заявки'!$D$9=\"РФ\",1,IF('параметры заявки'!$D$9='Исходные данные'!$C$23,IF('Исходные данные'!BD23=\"да\",1,0),IF('параметры заявки'!$D$9='Исходные данные'!$C$24,IF('Исходные данные'!BD24=\"да\",1,0),IF('параметры заявки'!$D$9='Исходные данные'!$C$25,IF('Исходные данные'!BD25=\"да\",1,0),IF('параметры заявки'!$D$9='Исходные данные'!$C$26,IF('Исходные данные'!BD26=\"да\",1,0),IF('параметры заявки'!$D$9='Исходные данные'!$C$27,IF('Исходные данные'!BD27=\"да\",1,0),IF('параметры заявки'!$D$9='Исходные данные'!$C$28,IF('Исходные данные'!BD28=\"да\",1,0),IF('параметры заявки'!$D$9='Исходные данные'!$C$29,IF('Исходные данные'!BD29=\"да\",1,0),IF('параметры заявки'!$D$9='Исходные данные'!$C$21,IF('Исходные данные'!BD21=\"да\",1,0),IF('параметры заявки'!$D$9='Исходные данные'!$C$22,IF('Исходные данные'!BD22=\"да\",1,0)))))))))))","v":0},{"$f":"IF('параметры заявки'!$D$9=\"РФ\",1,IF('параметры заявки'!$D$9='Исходные данные'!$C$23,IF('Исходные данные'!BE23=\"да\",1,0),IF('параметры заявки'!$D$9='Исходные данные'!$C$24,IF('Исходные данные'!BE24=\"да\",1,0),IF('параметры заявки'!$D$9='Исходные данные'!$C$25,IF('Исходные данные'!BE25=\"да\",1,0),IF('параметры заявки'!$D$9='Исходные данные'!$C$26,IF('Исходные данные'!BE26=\"да\",1,0),IF('параметры заявки'!$D$9='Исходные данные'!$C$27,IF('Исходные данные'!BE27=\"да\",1,0),IF('параметры заявки'!$D$9='Исходные данные'!$C$28,IF('Исходные данные'!BE28=\"да\",1,0),IF('параметры заявки'!$D$9='Исходные данные'!$C$29,IF('Исходные данные'!BE29=\"да\",1,0),IF('параметры заявки'!$D$9='Исходные данные'!$C$21,IF('Исходные данные'!BE21=\"да\",1,0),IF('параметры заявки'!$D$9='Исходные данные'!$C$22,IF('Исходные данные'!BE22=\"да\",1,0)))))))))))","v":0},{"$f":"IF('параметры заявки'!$D$9=\"РФ\",1,IF('параметры заявки'!$D$9='Исходные данные'!$C$23,IF('Исходные данные'!BF23=\"да\",1,0),IF('параметры заявки'!$D$9='Исходные данные'!$C$24,IF('Исходные данные'!BF24=\"да\",1,0),IF('параметры заявки'!$D$9='Исходные данные'!$C$25,IF('Исходные данные'!BF25=\"да\",1,0),IF('параметры заявки'!$D$9='Исходные данные'!$C$26,IF('Исходные данные'!BF26=\"да\",1,0),IF('параметры заявки'!$D$9='Исходные данные'!$C$27,IF('Исходные данные'!BF27=\"да\",1,0),IF('параметры заявки'!$D$9='Исходные данные'!$C$28,IF('Исходные данные'!BF28=\"да\",1,0),IF('параметры заявки'!$D$9='Исходные данные'!$C$29,IF('Исходные данные'!BF29=\"да\",1,0),IF('параметры заявки'!$D$9='Исходные данные'!$C$21,IF('Исходные данные'!BF21=\"да\",1,0),IF('параметры заявки'!$D$9='Исходные данные'!$C$22,IF('Исходные данные'!BF22=\"да\",1,0)))))))))))","v":1},{"$f":"IF('параметры заявки'!$D$9=\"РФ\",1,IF('параметры заявки'!$D$9='Исходные данные'!$C$23,IF('Исходные данные'!BG23=\"да\",1,0),IF('параметры заявки'!$D$9='Исходные данные'!$C$24,IF('Исходные данные'!BG24=\"да\",1,0),IF('параметры заявки'!$D$9='Исходные данные'!$C$25,IF('Исходные данные'!BG25=\"да\",1,0),IF('параметры заявки'!$D$9='Исходные данные'!$C$26,IF('Исходные данные'!BG26=\"да\",1,0),IF('параметры заявки'!$D$9='Исходные данные'!$C$27,IF('Исходные данные'!BG27=\"да\",1,0),IF('параметры заявки'!$D$9='Исходные данные'!$C$28,IF('Исходные данные'!BG28=\"да\",1,0),IF('параметры заявки'!$D$9='Исходные данные'!$C$29,IF('Исходные данные'!BG29=\"да\",1,0),IF('параметры заявки'!$D$9='Исходные данные'!$C$21,IF('Исходные данные'!BG21=\"да\",1,0),IF('параметры заявки'!$D$9='Исходные данные'!$C$22,IF('Исходные данные'!BG22=\"да\",1,0)))))))))))","v":0},{"$f":"IF('параметры заявки'!$D$9=\"РФ\",1,IF('параметры заявки'!$D$9='Исходные данные'!$C$23,IF('Исходные данные'!BH23=\"да\",1,0),IF('параметры заявки'!$D$9='Исходные данные'!$C$24,IF('Исходные данные'!BH24=\"да\",1,0),IF('параметры заявки'!$D$9='Исходные данные'!$C$25,IF('Исходные данные'!BH25=\"да\",1,0),IF('параметры заявки'!$D$9='Исходные данные'!$C$26,IF('Исходные данные'!BH26=\"да\",1,0),IF('параметры заявки'!$D$9='Исходные данные'!$C$27,IF('Исходные данные'!BH27=\"да\",1,0),IF('параметры заявки'!$D$9='Исходные данные'!$C$28,IF('Исходные данные'!BH28=\"да\",1,0),IF('параметры заявки'!$D$9='Исходные данные'!$C$29,IF('Исходные данные'!BH29=\"да\",1,0),IF('параметры заявки'!$D$9='Исходные данные'!$C$21,IF('Исходные данные'!BH21=\"да\",1,0),IF('параметры заявки'!$D$9='Исходные данные'!$C$22,IF('Исходные данные'!BH22=\"да\",1,0)))))))))))","v":0},{"$f":"IF('параметры заявки'!$D$9=\"РФ\",1,IF('параметры заявки'!$D$9='Исходные данные'!$C$23,IF('Исходные данные'!BI23=\"да\",1,0),IF('параметры заявки'!$D$9='Исходные данные'!$C$24,IF('Исходные данные'!BI24=\"да\",1,0),IF('параметры заявки'!$D$9='Исходные данные'!$C$25,IF('Исходные данные'!BI25=\"да\",1,0),IF('параметры заявки'!$D$9='Исходные данные'!$C$26,IF('Исходные данные'!BI26=\"да\",1,0),IF('параметры заявки'!$D$9='Исходные данные'!$C$27,IF('Исходные данные'!BI27=\"да\",1,0),IF('параметры заявки'!$D$9='Исходные данные'!$C$28,IF('Исходные данные'!BI28=\"да\",1,0),IF('параметры заявки'!$D$9='Исходные данные'!$C$29,IF('Исходные данные'!BI29=\"да\",1,0),IF('параметры заявки'!$D$9='Исходные данные'!$C$21,IF('Исходные данные'!BI21=\"да\",1,0),IF('параметры заявки'!$D$9='Исходные данные'!$C$22,IF('Исходные данные'!BI22=\"да\",1,0)))))))))))","v":0},{"$f":"IF('параметры заявки'!$D$9=\"РФ\",1,IF('параметры заявки'!$D$9='Исходные данные'!$C$23,IF('Исходные данные'!BJ23=\"да\",1,0),IF('параметры заявки'!$D$9='Исходные данные'!$C$24,IF('Исходные данные'!BJ24=\"да\",1,0),IF('параметры заявки'!$D$9='Исходные данные'!$C$25,IF('Исходные данные'!BJ25=\"да\",1,0),IF('параметры заявки'!$D$9='Исходные данные'!$C$26,IF('Исходные данные'!BJ26=\"да\",1,0),IF('параметры заявки'!$D$9='Исходные данные'!$C$27,IF('Исходные данные'!BJ27=\"да\",1,0),IF('параметры заявки'!$D$9='Исходные данные'!$C$28,IF('Исходные данные'!BJ28=\"да\",1,0),IF('параметры заявки'!$D$9='Исходные данные'!$C$29,IF('Исходные данные'!BJ29=\"да\",1,0),IF('параметры заявки'!$D$9='Исходные данные'!$C$21,IF('Исходные данные'!BJ21=\"да\",1,0),IF('параметры заявки'!$D$9='Исходные данные'!$C$22,IF('Исходные данные'!BJ22=\"да\",1,0)))))))))))","v":0},{"$f":"IF('параметры заявки'!$D$9=\"РФ\",1,IF('параметры заявки'!$D$9='Исходные данные'!$C$23,IF('Исходные данные'!BK23=\"да\",1,0),IF('параметры заявки'!$D$9='Исходные данные'!$C$24,IF('Исходные данные'!BK24=\"да\",1,0),IF('параметры заявки'!$D$9='Исходные данные'!$C$25,IF('Исходные данные'!BK25=\"да\",1,0),IF('параметры заявки'!$D$9='Исходные данные'!$C$26,IF('Исходные данные'!BK26=\"да\",1,0),IF('параметры заявки'!$D$9='Исходные данные'!$C$27,IF('Исходные данные'!BK27=\"да\",1,0),IF('параметры заявки'!$D$9='Исходные данные'!$C$28,IF('Исходные данные'!BK28=\"да\",1,0),IF('параметры заявки'!$D$9='Исходные данные'!$C$29,IF('Исходные данные'!BK29=\"да\",1,0),IF('параметры заявки'!$D$9='Исходные данные'!$C$21,IF('Исходные данные'!BK21=\"да\",1,0),IF('параметры заявки'!$D$9='Исходные данные'!$C$22,IF('Исходные данные'!BK22=\"да\",1,0)))))))))))","v":0},{"$f":"IF('параметры заявки'!$D$9=\"РФ\",1,IF('параметры заявки'!$D$9='Исходные данные'!$C$23,IF('Исходные данные'!BL23=\"да\",1,0),IF('параметры заявки'!$D$9='Исходные данные'!$C$24,IF('Исходные данные'!BL24=\"да\",1,0),IF('параметры заявки'!$D$9='Исходные данные'!$C$25,IF('Исходные данные'!BL25=\"да\",1,0),IF('параметры заявки'!$D$9='Исходные данные'!$C$26,IF('Исходные данные'!BL26=\"да\",1,0),IF('параметры заявки'!$D$9='Исходные данные'!$C$27,IF('Исходные данные'!BL27=\"да\",1,0),IF('параметры заявки'!$D$9='Исходные данные'!$C$28,IF('Исходные данные'!BL28=\"да\",1,0),IF('параметры заявки'!$D$9='Исходные данные'!$C$29,IF('Исходные данные'!BL29=\"да\",1,0),IF('параметры заявки'!$D$9='Исходные данные'!$C$21,IF('Исходные данные'!BL21=\"да\",1,0),IF('параметры заявки'!$D$9='Исходные данные'!$C$22,IF('Исходные данные'!BL22=\"да\",1,0)))))))))))","v":0},{"$f":"IF('параметры заявки'!$D$9=\"РФ\",1,IF('параметры заявки'!$D$9='Исходные данные'!$C$23,IF('Исходные данные'!BM23=\"да\",1,0),IF('параметры заявки'!$D$9='Исходные данные'!$C$24,IF('Исходные данные'!BM24=\"да\",1,0),IF('параметры заявки'!$D$9='Исходные данные'!$C$25,IF('Исходные данные'!BM25=\"да\",1,0),IF('параметры заявки'!$D$9='Исходные данные'!$C$26,IF('Исходные данные'!BM26=\"да\",1,0),IF('параметры заявки'!$D$9='Исходные данные'!$C$27,IF('Исходные данные'!BM27=\"да\",1,0),IF('параметры заявки'!$D$9='Исходные данные'!$C$28,IF('Исходные данные'!BM28=\"да\",1,0),IF('параметры заявки'!$D$9='Исходные данные'!$C$29,IF('Исходные данные'!BM29=\"да\",1,0),IF('параметры заявки'!$D$9='Исходные данные'!$C$21,IF('Исходные данные'!BM21=\"да\",1,0),IF('параметры заявки'!$D$9='Исходные данные'!$C$22,IF('Исходные данные'!BM22=\"да\",1,0)))))))))))","v":1},{"$f":"IF('параметры заявки'!$D$9=\"РФ\",1,IF('параметры заявки'!$D$9='Исходные данные'!$C$23,IF('Исходные данные'!BN23=\"да\",1,0),IF('параметры заявки'!$D$9='Исходные данные'!$C$24,IF('Исходные данные'!BN24=\"да\",1,0),IF('параметры заявки'!$D$9='Исходные данные'!$C$25,IF('Исходные данные'!BN25=\"да\",1,0),IF('параметры заявки'!$D$9='Исходные данные'!$C$26,IF('Исходные данные'!BN26=\"да\",1,0),IF('параметры заявки'!$D$9='Исходные данные'!$C$27,IF('Исходные данные'!BN27=\"да\",1,0),IF('параметры заявки'!$D$9='Исходные данные'!$C$28,IF('Исходные данные'!BN28=\"да\",1,0),IF('параметры заявки'!$D$9='Исходные данные'!$C$29,IF('Исходные данные'!BN29=\"да\",1,0),IF('параметры заявки'!$D$9='Исходные данные'!$C$21,IF('Исходные данные'!BN21=\"да\",1,0),IF('параметры заявки'!$D$9='Исходные данные'!$C$22,IF('Исходные данные'!BN22=\"да\",1,0)))))))))))","v":1},{"$f":"IF('параметры заявки'!$D$9=\"РФ\",1,IF('параметры заявки'!$D$9='Исходные данные'!$C$23,IF('Исходные данные'!BO23=\"да\",1,0),IF('параметры заявки'!$D$9='Исходные данные'!$C$24,IF('Исходные данные'!BO24=\"да\",1,0),IF('параметры заявки'!$D$9='Исходные данные'!$C$25,IF('Исходные данные'!BO25=\"да\",1,0),IF('параметры заявки'!$D$9='Исходные данные'!$C$26,IF('Исходные данные'!BO26=\"да\",1,0),IF('параметры заявки'!$D$9='Исходные данные'!$C$27,IF('Исходные данные'!BO27=\"да\",1,0),IF('параметры заявки'!$D$9='Исходные данные'!$C$28,IF('Исходные данные'!BO28=\"да\",1,0),IF('параметры заявки'!$D$9='Исходные данные'!$C$29,IF('Исходные данные'!BO29=\"да\",1,0),IF('параметры заявки'!$D$9='Исходные данные'!$C$21,IF('Исходные данные'!BO21=\"да\",1,0),IF('параметры заявки'!$D$9='Исходные данные'!$C$22,IF('Исходные данные'!BO22=\"да\",1,0)))))))))))","v":0},{"$f":"IF('параметры заявки'!$D$9=\"РФ\",1,IF('параметры заявки'!$D$9='Исходные данные'!$C$23,IF('Исходные данные'!BP23=\"да\",1,0),IF('параметры заявки'!$D$9='Исходные данные'!$C$24,IF('Исходные данные'!BP24=\"да\",1,0),IF('параметры заявки'!$D$9='Исходные данные'!$C$25,IF('Исходные данные'!BP25=\"да\",1,0),IF('параметры заявки'!$D$9='Исходные данные'!$C$26,IF('Исходные данные'!BP26=\"да\",1,0),IF('параметры заявки'!$D$9='Исходные данные'!$C$27,IF('Исходные данные'!BP27=\"да\",1,0),IF('параметры заявки'!$D$9='Исходные данные'!$C$28,IF('Исходные данные'!BP28=\"да\",1,0),IF('параметры заявки'!$D$9='Исходные данные'!$C$29,IF('Исходные данные'!BP29=\"да\",1,0),IF('параметры заявки'!$D$9='Исходные данные'!$C$21,IF('Исходные данные'!BP21=\"да\",1,0),IF('параметры заявки'!$D$9='Исходные данные'!$C$22,IF('Исходные данные'!BP22=\"да\",1,0)))))))))))","v":1},{"$f":"IF('параметры заявки'!$D$9=\"РФ\",1,IF('параметры заявки'!$D$9='Исходные данные'!$C$23,IF('Исходные данные'!BQ23=\"да\",1,0),IF('параметры заявки'!$D$9='Исходные данные'!$C$24,IF('Исходные данные'!BQ24=\"да\",1,0),IF('параметры заявки'!$D$9='Исходные данные'!$C$25,IF('Исходные данные'!BQ25=\"да\",1,0),IF('параметры заявки'!$D$9='Исходные данные'!$C$26,IF('Исходные данные'!BQ26=\"да\",1,0),IF('параметры заявки'!$D$9='Исходные данные'!$C$27,IF('Исходные данные'!BQ27=\"да\",1,0),IF('параметры заявки'!$D$9='Исходные данные'!$C$28,IF('Исходные данные'!BQ28=\"да\",1,0),IF('параметры заявки'!$D$9='Исходные данные'!$C$29,IF('Исходные данные'!BQ29=\"да\",1,0),IF('параметры заявки'!$D$9='Исходные данные'!$C$21,IF('Исходные данные'!BQ21=\"да\",1,0),IF('параметры заявки'!$D$9='Исходные данные'!$C$22,IF('Исходные данные'!BQ22=\"да\",1,0)))))))))))","v":0},{"$f":"IF('параметры заявки'!$D$9=\"РФ\",1,IF('параметры заявки'!$D$9='Исходные данные'!$C$23,IF('Исходные данные'!BR23=\"да\",1,0),IF('параметры заявки'!$D$9='Исходные данные'!$C$24,IF('Исходные данные'!BR24=\"да\",1,0),IF('параметры заявки'!$D$9='Исходные данные'!$C$25,IF('Исходные данные'!BR25=\"да\",1,0),IF('параметры заявки'!$D$9='Исходные данные'!$C$26,IF('Исходные данные'!BR26=\"да\",1,0),IF('параметры заявки'!$D$9='Исходные данные'!$C$27,IF('Исходные данные'!BR27=\"да\",1,0),IF('параметры заявки'!$D$9='Исходные данные'!$C$28,IF('Исходные данные'!BR28=\"да\",1,0),IF('параметры заявки'!$D$9='Исходные данные'!$C$29,IF('Исходные данные'!BR29=\"да\",1,0),IF('параметры заявки'!$D$9='Исходные данные'!$C$21,IF('Исходные данные'!BR21=\"да\",1,0),IF('параметры заявки'!$D$9='Исходные данные'!$C$22,IF('Исходные данные'!BR22=\"да\",1,0)))))))))))","v":0},{"$f":"IF('параметры заявки'!$D$9=\"РФ\",1,IF('параметры заявки'!$D$9='Исходные данные'!$C$23,IF('Исходные данные'!BS23=\"да\",1,0),IF('параметры заявки'!$D$9='Исходные данные'!$C$24,IF('Исходные данные'!BS24=\"да\",1,0),IF('параметры заявки'!$D$9='Исходные данные'!$C$25,IF('Исходные данные'!BS25=\"да\",1,0),IF('параметры заявки'!$D$9='Исходные данные'!$C$26,IF('Исходные данные'!BS26=\"да\",1,0),IF('параметры заявки'!$D$9='Исходные данные'!$C$27,IF('Исходные данные'!BS27=\"да\",1,0),IF('параметры заявки'!$D$9='Исходные данные'!$C$28,IF('Исходные данные'!BS28=\"да\",1,0),IF('параметры заявки'!$D$9='Исходные данные'!$C$29,IF('Исходные данные'!BS29=\"да\",1,0),IF('параметры заявки'!$D$9='Исходные данные'!$C$21,IF('Исходные данные'!BS21=\"да\",1,0),IF('параметры заявки'!$D$9='Исходные данные'!$C$22,IF('Исходные данные'!BS22=\"да\",1,0)))))))))))","v":1},{"$f":"IF('параметры заявки'!$D$9=\"РФ\",1,IF('параметры заявки'!$D$9='Исходные данные'!$C$23,IF('Исходные данные'!BT23=\"да\",1,0),IF('параметры заявки'!$D$9='Исходные данные'!$C$24,IF('Исходные данные'!BT24=\"да\",1,0),IF('параметры заявки'!$D$9='Исходные данные'!$C$25,IF('Исходные данные'!BT25=\"да\",1,0),IF('параметры заявки'!$D$9='Исходные данные'!$C$26,IF('Исходные данные'!BT26=\"да\",1,0),IF('параметры заявки'!$D$9='Исходные данные'!$C$27,IF('Исходные данные'!BT27=\"да\",1,0),IF('параметры заявки'!$D$9='Исходные данные'!$C$28,IF('Исходные данные'!BT28=\"да\",1,0),IF('параметры заявки'!$D$9='Исходные данные'!$C$29,IF('Исходные данные'!BT29=\"да\",1,0),IF('параметры заявки'!$D$9='Исходные данные'!$C$21,IF('Исходные данные'!BT21=\"да\",1,0),IF('параметры заявки'!$D$9='Исходные данные'!$C$22,IF('Исходные данные'!BT22=\"да\",1,0)))))))))))","v":0},{"$f":"IF('параметры заявки'!$D$9=\"РФ\",1,IF('параметры заявки'!$D$9='Исходные данные'!$C$23,IF('Исходные данные'!BU23=\"да\",1,0),IF('параметры заявки'!$D$9='Исходные данные'!$C$24,IF('Исходные данные'!BU24=\"да\",1,0),IF('параметры заявки'!$D$9='Исходные данные'!$C$25,IF('Исходные данные'!BU25=\"да\",1,0),IF('параметры заявки'!$D$9='Исходные данные'!$C$26,IF('Исходные данные'!BU26=\"да\",1,0),IF('параметры заявки'!$D$9='Исходные данные'!$C$27,IF('Исходные данные'!BU27=\"да\",1,0),IF('параметры заявки'!$D$9='Исходные данные'!$C$28,IF('Исходные данные'!BU28=\"да\",1,0),IF('параметры заявки'!$D$9='Исходные данные'!$C$29,IF('Исходные данные'!BU29=\"да\",1,0),IF('параметры заявки'!$D$9='Исходные данные'!$C$21,IF('Исходные данные'!BU21=\"да\",1,0),IF('параметры заявки'!$D$9='Исходные данные'!$C$22,IF('Исходные данные'!BU22=\"да\",1,0)))))))))))","v":1},{"$f":"IF('параметры заявки'!$D$9=\"РФ\",1,IF('параметры заявки'!$D$9='Исходные данные'!$C$23,IF('Исходные данные'!BV23=\"да\",1,0),IF('параметры заявки'!$D$9='Исходные данные'!$C$24,IF('Исходные данные'!BV24=\"да\",1,0),IF('параметры заявки'!$D$9='Исходные данные'!$C$25,IF('Исходные данные'!BV25=\"да\",1,0),IF('параметры заявки'!$D$9='Исходные данные'!$C$26,IF('Исходные данные'!BV26=\"да\",1,0),IF('параметры заявки'!$D$9='Исходные данные'!$C$27,IF('Исходные данные'!BV27=\"да\",1,0),IF('параметры заявки'!$D$9='Исходные данные'!$C$28,IF('Исходные данные'!BV28=\"да\",1,0),IF('параметры заявки'!$D$9='Исходные данные'!$C$29,IF('Исходные данные'!BV29=\"да\",1,0),IF('параметры заявки'!$D$9='Исходные данные'!$C$21,IF('Исходные данные'!BV21=\"да\",1,0),IF('параметры заявки'!$D$9='Исходные данные'!$C$22,IF('Исходные данные'!BV22=\"да\",1,0)))))))))))","v":0},{"$f":"IF('параметры заявки'!$D$9=\"РФ\",1,IF('параметры заявки'!$D$9='Исходные данные'!$C$23,IF('Исходные данные'!BW23=\"да\",1,0),IF('параметры заявки'!$D$9='Исходные данные'!$C$24,IF('Исходные данные'!BW24=\"да\",1,0),IF('параметры заявки'!$D$9='Исходные данные'!$C$25,IF('Исходные данные'!BW25=\"да\",1,0),IF('параметры заявки'!$D$9='Исходные данные'!$C$26,IF('Исходные данные'!BW26=\"да\",1,0),IF('параметры заявки'!$D$9='Исходные данные'!$C$27,IF('Исходные данные'!BW27=\"да\",1,0),IF('параметры заявки'!$D$9='Исходные данные'!$C$28,IF('Исходные данные'!BW28=\"да\",1,0),IF('параметры заявки'!$D$9='Исходные данные'!$C$29,IF('Исходные данные'!BW29=\"да\",1,0),IF('параметры заявки'!$D$9='Исходные данные'!$C$21,IF('Исходные данные'!BW21=\"да\",1,0),IF('параметры заявки'!$D$9='Исходные данные'!$C$22,IF('Исходные данные'!BW22=\"да\",1,0)))))))))))","v":0},{"$f":"IF('параметры заявки'!$D$9=\"РФ\",1,IF('параметры заявки'!$D$9='Исходные данные'!$C$23,IF('Исходные данные'!BX23=\"да\",1,0),IF('параметры заявки'!$D$9='Исходные данные'!$C$24,IF('Исходные данные'!BX24=\"да\",1,0),IF('параметры заявки'!$D$9='Исходные данные'!$C$25,IF('Исходные данные'!BX25=\"да\",1,0),IF('параметры заявки'!$D$9='Исходные данные'!$C$26,IF('Исходные данные'!BX26=\"да\",1,0),IF('параметры заявки'!$D$9='Исходные данные'!$C$27,IF('Исходные данные'!BX27=\"да\",1,0),IF('параметры заявки'!$D$9='Исходные данные'!$C$28,IF('Исходные данные'!BX28=\"да\",1,0),IF('параметры заявки'!$D$9='Исходные данные'!$C$29,IF('Исходные данные'!BX29=\"да\",1,0),IF('параметры заявки'!$D$9='Исходные данные'!$C$21,IF('Исходные данные'!BX21=\"да\",1,0),IF('параметры заявки'!$D$9='Исходные данные'!$C$22,IF('Исходные данные'!BX22=\"да\",1,0)))))))))))","v":0},{"$f":"IF('параметры заявки'!$D$9=\"РФ\",1,IF('параметры заявки'!$D$9='Исходные данные'!$C$23,IF('Исходные данные'!BY23=\"да\",1,0),IF('параметры заявки'!$D$9='Исходные данные'!$C$24,IF('Исходные данные'!BY24=\"да\",1,0),IF('параметры заявки'!$D$9='Исходные данные'!$C$25,IF('Исходные данные'!BY25=\"да\",1,0),IF('параметры заявки'!$D$9='Исходные данные'!$C$26,IF('Исходные данные'!BY26=\"да\",1,0),IF('параметры заявки'!$D$9='Исходные данные'!$C$27,IF('Исходные данные'!BY27=\"да\",1,0),IF('параметры заявки'!$D$9='Исходные данные'!$C$28,IF('Исходные данные'!BY28=\"да\",1,0),IF('параметры заявки'!$D$9='Исходные данные'!$C$29,IF('Исходные данные'!BY29=\"да\",1,0),IF('параметры заявки'!$D$9='Исходные данные'!$C$21,IF('Исходные данные'!BY21=\"да\",1,0),IF('параметры заявки'!$D$9='Исходные данные'!$C$22,IF('Исходные данные'!BY22=\"да\",1,0)))))))))))","v":0}]
[null,null,"закон ФЗ",{"$f":"IF('параметры заявки'!$D$8='Исходные данные'!$C$16,IF('Исходные данные'!D16=\"да\",1,0),IF('параметры заявки'!$D$8='Исходные данные'!$C$17,IF('Исходные данные'!D17=\"да\",1,0),IF('параметры заявки'!$D$8='Исходные данные'!$C$18,IF('Исходные данные'!D18=\"да\",1,0),IF('параметры заявки'!$D$8='Исходные данные'!$C$19,IF('Исходные данные'!D19=\"да\",1,0),IF('параметры заявки'!$D$8='Исходные данные'!$C$20,IF('Исходные данные'!D20=\"да\",1,0))))))","v":1},{"$f":"IF('параметры заявки'!$D$8='Исходные данные'!$C$16,IF('Исходные данные'!E16=\"да\",1,0),IF('параметры заявки'!$D$8='Исходные данные'!$C$17,IF('Исходные данные'!E17=\"да\",1,0),IF('параметры заявки'!$D$8='Исходные данные'!$C$18,IF('Исходные данные'!E18=\"да\",1,0),IF('параметры заявки'!$D$8='Исходные данные'!$C$19,IF('Исходные данные'!E19=\"да\",1,0),IF('параметры заявки'!$D$8='Исходные данные'!$C$20,IF('Исходные данные'!E20=\"да\",1,0))))))","v":1},{"$f":"IF('параметры заявки'!$D$8='Исходные данные'!$C$16,IF('Исходные данные'!F16=\"да\",1,0),IF('параметры заявки'!$D$8='Исходные данные'!$C$17,IF('Исходные данные'!F17=\"да\",1,0),IF('параметры заявки'!$D$8='Исходные данные'!$C$18,IF('Исходные данные'!F18=\"да\",1,0),IF('параметры заявки'!$D$8='Исходные данные'!$C$19,IF('Исходные данные'!F19=\"да\",1,0),IF('параметры заявки'!$D$8='Исходные данные'!$C$20,IF('Исходные данные'!F20=\"да\",1,0))))))","v":1},{"$f":"IF('параметры заявки'!$D$8='Исходные данные'!$C$16,IF('Исходные данные'!G16=\"да\",1,0),IF('параметры заявки'!$D$8='Исходные данные'!$C$17,IF('Исходные данные'!G17=\"да\",1,0),IF('параметры заявки'!$D$8='Исходные данные'!$C$18,IF('Исходные данные'!G18=\"да\",1,0),IF('параметры заявки'!$D$8='Исходные данные'!$C$19,IF('Исходные данные'!G19=\"да\",1,0),IF('параметры заявки'!$D$8='Исходные данные'!$C$20,IF('Исходные данные'!G20=\"да\",1,0))))))","v":1},{"$f":"IF('параметры заявки'!$D$8='Исходные данные'!$C$16,IF('Исходные данные'!H16=\"да\",1,0),IF('параметры заявки'!$D$8='Исходные данные'!$C$17,IF('Исходные данные'!H17=\"да\",1,0),IF('параметры заявки'!$D$8='Исходные данные'!$C$18,IF('Исходные данные'!H18=\"да\",1,0),IF('параметры заявки'!$D$8='Исходные данные'!$C$19,IF('Исходные данные'!H19=\"да\",1,0),IF('параметры заявки'!$D$8='Исходные данные'!$C$20,IF('Исходные данные'!H20=\"да\",1,0))))))","v":1},{"$f":"IF('параметры заявки'!$D$8='Исходные данные'!$C$16,IF('Исходные данные'!I16=\"да\",1,0),IF('параметры заявки'!$D$8='Исходные данные'!$C$17,IF('Исходные данные'!I17=\"да\",1,0),IF('параметры заявки'!$D$8='Исходные данные'!$C$18,IF('Исходные данные'!I18=\"да\",1,0),IF('параметры заявки'!$D$8='Исходные данные'!$C$19,IF('Исходные данные'!I19=\"да\",1,0),IF('параметры заявки'!$D$8='Исходные данные'!$C$20,IF('Исходные данные'!I20=\"да\",1,0))))))","v":1},{"$f":"IF('параметры заявки'!$D$8='Исходные данные'!$C$16,IF('Исходные данные'!J16=\"да\",1,0),IF('параметры заявки'!$D$8='Исходные данные'!$C$17,IF('Исходные данные'!J17=\"да\",1,0),IF('параметры заявки'!$D$8='Исходные данные'!$C$18,IF('Исходные данные'!J18=\"да\",1,0),IF('параметры заявки'!$D$8='Исходные данные'!$C$19,IF('Исходные данные'!J19=\"да\",1,0),IF('параметры заявки'!$D$8='Исходные данные'!$C$20,IF('Исходные данные'!J20=\"да\",1,0))))))","v":1},{"$f":"IF('параметры заявки'!$D$8='Исходные данные'!$C$16,IF('Исходные данные'!K16=\"да\",1,0),IF('параметры заявки'!$D$8='Исходные данные'!$C$17,IF('Исходные данные'!K17=\"да\",1,0),IF('параметры заявки'!$D$8='Исходные данные'!$C$18,IF('Исходные данные'!K18=\"да\",1,0),IF('параметры заявки'!$D$8='Исходные данные'!$C$19,IF('Исходные данные'!K19=\"да\",1,0),IF('параметры заявки'!$D$8='Исходные данные'!$C$20,IF('Исходные данные'!K20=\"да\",1,0))))))","v":1},{"$f":"IF('параметры заявки'!$D$8='Исходные данные'!$C$16,IF('Исходные данные'!L16=\"да\",1,0),IF('параметры заявки'!$D$8='Исходные данные'!$C$17,IF('Исходные данные'!L17=\"да\",1,0),IF('параметры заявки'!$D$8='Исходные данные'!$C$18,IF('Исходные данные'!L18=\"да\",1,0),IF('параметры заявки'!$D$8='Исходные данные'!$C$19,IF('Исходные данные'!L19=\"да\",1,0),IF('параметры заявки'!$D$8='Исходные данные'!$C$20,IF('Исходные данные'!L20=\"да\",1,0))))))","v":1},{"$f":"IF('параметры заявки'!$D$8='Исходные данные'!$C$16,IF('Исходные данные'!M16=\"да\",1,0),IF('параметры заявки'!$D$8='Исходные данные'!$C$17,IF('Исходные данные'!M17=\"да\",1,0),IF('параметры заявки'!$D$8='Исходные данные'!$C$18,IF('Исходные данные'!M18=\"да\",1,0),IF('параметры заявки'!$D$8='Исходные данные'!$C$19,IF('Исходные данные'!M19=\"да\",1,0),IF('параметры заявки'!$D$8='Исходные данные'!$C$20,IF('Исходные данные'!M20=\"да\",1,0))))))","v":1},{"$f":"IF('параметры заявки'!$D$8='Исходные данные'!$C$16,IF('Исходные данные'!N16=\"да\",1,0),IF('параметры заявки'!$D$8='Исходные данные'!$C$17,IF('Исходные данные'!N17=\"да\",1,0),IF('параметры заявки'!$D$8='Исходные данные'!$C$18,IF('Исходные данные'!N18=\"да\",1,0),IF('параметры заявки'!$D$8='Исходные данные'!$C$19,IF('Исходные данные'!N19=\"да\",1,0),IF('параметры заявки'!$D$8='Исходные данные'!$C$20,IF('Исходные данные'!N20=\"да\",1,0))))))","v":1},{"$f":"IF('параметры заявки'!$D$8='Исходные данные'!$C$16,IF('Исходные данные'!O16=\"да\",1,0),IF('параметры заявки'!$D$8='Исходные данные'!$C$17,IF('Исходные данные'!O17=\"да\",1,0),IF('параметры заявки'!$D$8='Исходные данные'!$C$18,IF('Исходные данные'!O18=\"да\",1,0),IF('параметры заявки'!$D$8='Исходные данные'!$C$19,IF('Исходные данные'!O19=\"да\",1,0),IF('параметры заявки'!$D$8='Исходные данные'!$C$20,IF('Исходные данные'!O20=\"да\",1,0))))))","v":1},{"$f":"IF('параметры заявки'!$D$8='Исходные данные'!$C$16,IF('Исходные данные'!P16=\"да\",1,0),IF('параметры заявки'!$D$8='Исходные данные'!$C$17,IF('Исходные данные'!P17=\"да\",1,0),IF('параметры заявки'!$D$8='Исходные данные'!$C$18,IF('Исходные данные'!P18=\"да\",1,0),IF('параметры заявки'!$D$8='Исходные данные'!$C$19,IF('Исходные данные'!P19=\"да\",1,0),IF('параметры заявки'!$D$8='Исходные данные'!$C$20,IF('Исходные данные'!P20=\"да\",1,0))))))","v":1},{"$f":"IF('параметры заявки'!$D$8='Исходные данные'!$C$16,IF('Исходные данные'!Q16=\"да\",1,0),IF('параметры заявки'!$D$8='Исходные данные'!$C$17,IF('Исходные данные'!Q17=\"да\",1,0),IF('параметры заявки'!$D$8='Исходные данные'!$C$18,IF('Исходные данные'!Q18=\"да\",1,0),IF('параметры заявки'!$D$8='Исходные данные'!$C$19,IF('Исходные данные'!Q19=\"да\",1,0),IF('параметры заявки'!$D$8='Исходные данные'!$C$20,IF('Исходные данные'!Q20=\"да\",1,0))))))","v":1},{"$f":"IF('параметры заявки'!$D$8='Исходные данные'!$C$16,IF('Исходные данные'!R16=\"да\",1,0),IF('параметры заявки'!$D$8='Исходные данные'!$C$17,IF('Исходные данные'!R17=\"да\",1,0),IF('параметры заявки'!$D$8='Исходные данные'!$C$18,IF('Исходные данные'!R18=\"да\",1,0),IF('параметры заявки'!$D$8='Исходные данные'!$C$19,IF('Исходные данные'!R19=\"да\",1,0),IF('параметры заявки'!$D$8='Исходные данные'!$C$20,IF('Исходные данные'!R20=\"да\",1,0))))))","v":1},{"$f":"IF('параметры заявки'!$D$8='Исходные данные'!$C$16,IF('Исходные данные'!S16=\"да\",1,0),IF('параметры заявки'!$D$8='Исходные данные'!$C$17,IF('Исходные данные'!S17=\"да\",1,0),IF('параметры заявки'!$D$8='Исходные данные'!$C$18,IF('Исходные данные'!S18=\"да\",1,0),IF('параметры заявки'!$D$8='Исходные данные'!$C$19,IF('Исходные данные'!S19=\"да\",1,0),IF('параметры заявки'!$D$8='Исходные данные'!$C$20,IF('Исходные данные'!S20=\"да\",1,0))))))","v":1},{"$f":"IF('параметры заявки'!$D$8='Исходные данные'!$C$16,IF('Исходные данные'!T16=\"да\",1,0),IF('параметры заявки'!$D$8='Исходные данные'!$C$17,IF('Исходные данные'!T17=\"да\",1,0),IF('параметры заявки'!$D$8='Исходные данные'!$C$18,IF('Исходные данные'!T18=\"да\",1,0),IF('параметры заявки'!$D$8='Исходные данные'!$C$19,IF('Исходные данные'!T19=\"да\",1,0),IF('параметры заявки'!$D$8='Исходные данные'!$C$20,IF('Исходные данные'!T20=\"да\",1,0))))))","v":1},{"$f":"IF('параметры заявки'!$D$8='Исходные данные'!$C$16,IF('Исходные данные'!U16=\"да\",1,0),IF('параметры заявки'!$D$8='Исходные данные'!$C$17,IF('Исходные данные'!U17=\"да\",1,0),IF('параметры заявки'!$D$8='Исходные данные'!$C$18,IF('Исходные данные'!U18=\"да\",1,0),IF('параметры заявки'!$D$8='Исходные данные'!$C$19,IF('Исходные данные'!U19=\"да\",1,0),IF('параметры заявки'!$D$8='Исходные данные'!$C$20,IF('Исходные данные'!U20=\"да\",1,0))))))","v":1},{"$f":"IF('параметры заявки'!$D$8='Исходные данные'!$C$16,IF('Исходные данные'!V16=\"да\",1,0),IF('параметры заявки'!$D$8='Исходные данные'!$C$17,IF('Исходные данные'!V17=\"да\",1,0),IF('параметры заявки'!$D$8='Исходные данные'!$C$18,IF('Исходные данные'!V18=\"да\",1,0),IF('параметры заявки'!$D$8='Исходные данные'!$C$19,IF('Исходные данные'!V19=\"да\",1,0),IF('параметры заявки'!$D$8='Исходные данные'!$C$20,IF('Исходные данные'!V20=\"да\",1,0))))))","v":1},{"$f":"IF('параметры заявки'!$D$8='Исходные данные'!$C$16,IF('Исходные данные'!W16=\"да\",1,0),IF('параметры заявки'!$D$8='Исходные данные'!$C$17,IF('Исходные данные'!W17=\"да\",1,0),IF('параметры заявки'!$D$8='Исходные данные'!$C$18,IF('Исходные данные'!W18=\"да\",1,0),IF('параметры заявки'!$D$8='Исходные данные'!$C$19,IF('Исходные данные'!W19=\"да\",1,0),IF('параметры заявки'!$D$8='Исходные данные'!$C$20,IF('Исходные данные'!W20=\"да\",1,0))))))","v":1},{"$f":"IF('параметры заявки'!$D$8='Исходные данные'!$C$16,IF('Исходные данные'!X16=\"да\",1,0),IF('параметры заявки'!$D$8='Исходные данные'!$C$17,IF('Исходные данные'!X17=\"да\",1,0),IF('параметры заявки'!$D$8='Исходные данные'!$C$18,IF('Исходные данные'!X18=\"да\",1,0),IF('параметры заявки'!$D$8='Исходные данные'!$C$19,IF('Исходные данные'!X19=\"да\",1,0),IF('параметры заявки'!$D$8='Исходные данные'!$C$20,IF('Исходные данные'!X20=\"да\",1,0))))))","v":1},{"$f":"IF('параметры заявки'!$D$8='Исходные данные'!$C$16,IF('Исходные данные'!Y16=\"да\",1,0),IF('параметры заявки'!$D$8='Исходные данные'!$C$17,IF('Исходные данные'!Y17=\"да\",1,0),IF('параметры заявки'!$D$8='Исходные данные'!$C$18,IF('Исходные данные'!Y18=\"да\",1,0),IF('параметры заявки'!$D$8='Исходные данные'!$C$19,IF('Исходные данные'!Y19=\"да\",1,0),IF('параметры заявки'!$D$8='Исходные данные'!$C$20,IF('Исходные данные'!Y20=\"да\",1,0))))))","v":1},{"$f":"IF('параметры заявки'!$D$8='Исходные данные'!$C$16,IF('Исходные данные'!Z16=\"да\",1,0),IF('параметры заявки'!$D$8='Исходные данные'!$C$17,IF('Исходные данные'!Z17=\"да\",1,0),IF('параметры заявки'!$D$8='Исходные данные'!$C$18,IF('Исходные данные'!Z18=\"да\",1,0),IF('параметры заявки'!$D$8='Исходные данные'!$C$19,IF('Исходные данные'!Z19=\"да\",1,0),IF('параметры заявки'!$D$8='Исходные данные'!$C$20,IF('Исходные данные'!Z20=\"да\",1,0))))))","v":1},{"$f":"IF('параметры заявки'!$D$8='Исходные данные'!$C$16,IF('Исходные данные'!AA16=\"да\",1,0),IF('параметры заявки'!$D$8='Исходные данные'!$C$17,IF('Исходные данные'!AA17=\"да\",1,0),IF('параметры заявки'!$D$8='Исходные данные'!$C$18,IF('Исходные данные'!AA18=\"да\",1,0),IF('параметры заявки'!$D$8='Исходные данные'!$C$19,IF('Исходные данные'!AA19=\"да\",1,0),IF('параметры заявки'!$D$8='Исходные данные'!$C$20,IF('Исходные данные'!AA20=\"да\",1,0))))))","v":1},{"$f":"IF('параметры заявки'!$D$8='Исходные данные'!$C$16,IF('Исходные данные'!AB16=\"да\",1,0),IF('параметры заявки'!$D$8='Исходные данные'!$C$17,IF('Исходные данные'!AB17=\"да\",1,0),IF('параметры заявки'!$D$8='Исходные данные'!$C$18,IF('Исходные данные'!AB18=\"да\",1,0),IF('параметры заявки'!$D$8='Исходные данные'!$C$19,IF('Исходные данные'!AB19=\"да\",1,0),IF('параметры заявки'!$D$8='Исходные данные'!$C$20,IF('Исходные данные'!AB20=\"да\",1,0))))))","v":1},{"$f":"IF('параметры заявки'!$D$8='Исходные данные'!$C$16,IF('Исходные данные'!AC16=\"да\",1,0),IF('параметры заявки'!$D$8='Исходные данные'!$C$17,IF('Исходные данные'!AC17=\"да\",1,0),IF('параметры заявки'!$D$8='Исходные данные'!$C$18,IF('Исходные данные'!AC18=\"да\",1,0),IF('параметры заявки'!$D$8='Исходные данные'!$C$19,IF('Исходные данные'!AC19=\"да\",1,0),IF('параметры заявки'!$D$8='Исходные данные'!$C$20,IF('Исходные данные'!AC20=\"да\",1,0))))))","v":1},{"$f":"IF('параметры заявки'!$D$8='Исходные данные'!$C$16,IF('Исходные данные'!AD16=\"да\",1,0),IF('параметры заявки'!$D$8='Исходные данные'!$C$17,IF('Исходные данные'!AD17=\"да\",1,0),IF('параметры заявки'!$D$8='Исходные данные'!$C$18,IF('Исходные данные'!AD18=\"да\",1,0),IF('параметры заявки'!$D$8='Исходные данные'!$C$19,IF('Исходные данные'!AD19=\"да\",1,0),IF('параметры заявки'!$D$8='Исходные данные'!$C$20,IF('Исходные данные'!AD20=\"да\",1,0))))))","v":1},{"$f":"IF('параметры заявки'!$D$8='Исходные данные'!$C$16,IF('Исходные данные'!AE16=\"да\",1,0),IF('параметры заявки'!$D$8='Исходные данные'!$C$17,IF('Исходные данные'!AE17=\"да\",1,0),IF('параметры заявки'!$D$8='Исходные данные'!$C$18,IF('Исходные данные'!AE18=\"да\",1,0),IF('параметры заявки'!$D$8='Исходные данные'!$C$19,IF('Исходные данные'!AE19=\"да\",1,0),IF('параметры заявки'!$D$8='Исходные данные'!$C$20,IF('Исходные данные'!AE20=\"да\",1,0))))))","v":1},{"$f":"IF('параметры заявки'!$D$8='Исходные данные'!$C$16,IF('Исходные данные'!AF16=\"да\",1,0),IF('параметры заявки'!$D$8='Исходные данные'!$C$17,IF('Исходные данные'!AF17=\"да\",1,0),IF('параметры заявки'!$D$8='Исходные данные'!$C$18,IF('Исходные данные'!AF18=\"да\",1,0),IF('параметры заявки'!$D$8='Исходные данные'!$C$19,IF('Исходные данные'!AF19=\"да\",1,0),IF('параметры заявки'!$D$8='Исходные данные'!$C$20,IF('Исходные данные'!AF20=\"да\",1,0))))))","v":1},{"$f":"IF('параметры заявки'!$D$8='Исходные данные'!$C$16,IF('Исходные данные'!AG16=\"да\",1,0),IF('параметры заявки'!$D$8='Исходные данные'!$C$17,IF('Исходные данные'!AG17=\"да\",1,0),IF('параметры заявки'!$D$8='Исходные данные'!$C$18,IF('Исходные данные'!AG18=\"да\",1,0),IF('параметры заявки'!$D$8='Исходные данные'!$C$19,IF('Исходные данные'!AG19=\"да\",1,0),IF('параметры заявки'!$D$8='Исходные данные'!$C$20,IF('Исходные данные'!AG20=\"да\",1,0))))))","v":1},{"$f":"IF('параметры заявки'!$D$8='Исходные данные'!$C$16,IF('Исходные данные'!AH16=\"да\",1,0),IF('параметры заявки'!$D$8='Исходные данные'!$C$17,IF('Исходные данные'!AH17=\"да\",1,0),IF('параметры заявки'!$D$8='Исходные данные'!$C$18,IF('Исходные данные'!AH18=\"да\",1,0),IF('параметры заявки'!$D$8='Исходные данные'!$C$19,IF('Исходные данные'!AH19=\"да\",1,0),IF('параметры заявки'!$D$8='Исходные данные'!$C$20,IF('Исходные данные'!AH20=\"да\",1,0))))))","v":1},{"$f":"IF('параметры заявки'!$D$8='Исходные данные'!$C$16,IF('Исходные данные'!AI16=\"да\",1,0),IF('параметры заявки'!$D$8='Исходные данные'!$C$17,IF('Исходные данные'!AI17=\"да\",1,0),IF('параметры заявки'!$D$8='Исходные данные'!$C$18,IF('Исходные данные'!AI18=\"да\",1,0),IF('параметры заявки'!$D$8='Исходные данные'!$C$19,IF('Исходные данные'!AI19=\"да\",1,0),IF('параметры заявки'!$D$8='Исходные данные'!$C$20,IF('Исходные данные'!AI20=\"да\",1,0))))))","v":1},{"$f":"IF('параметры заявки'!$D$8='Исходные данные'!$C$16,IF('Исходные данные'!AJ16=\"да\",1,0),IF('параметры заявки'!$D$8='Исходные данные'!$C$17,IF('Исходные данные'!AJ17=\"да\",1,0),IF('параметры заявки'!$D$8='Исходные данные'!$C$18,IF('Исходные данные'!AJ18=\"да\",1,0),IF('параметры заявки'!$D$8='Исходные данные'!$C$19,IF('Исходные данные'!AJ19=\"да\",1,0),IF('параметры заявки'!$D$8='Исходные данные'!$C$20,IF('Исходные данные'!AJ20=\"да\",1,0))))))","v":1},{"$f":"IF('параметры заявки'!$D$8='Исходные данные'!$C$16,IF('Исходные данные'!AK16=\"да\",1,0),IF('параметры заявки'!$D$8='Исходные данные'!$C$17,IF('Исходные данные'!AK17=\"да\",1,0),IF('параметры заявки'!$D$8='Исходные данные'!$C$18,IF('Исходные данные'!AK18=\"да\",1,0),IF('параметры заявки'!$D$8='Исходные данные'!$C$19,IF('Исходные данные'!AK19=\"да\",1,0),IF('параметры заявки'!$D$8='Исходные данные'!$C$20,IF('Исходные данные'!AK20=\"да\",1,0))))))","v":1},{"$f":"IF('параметры заявки'!$D$8='Исходные данные'!$C$16,IF('Исходные данные'!AL16=\"да\",1,0),IF('параметры заявки'!$D$8='Исходные данные'!$C$17,IF('Исходные данные'!AL17=\"да\",1,0),IF('параметры заявки'!$D$8='Исходные данные'!$C$18,IF('Исходные данные'!AL18=\"да\",1,0),IF('параметры заявки'!$D$8='Исходные данные'!$C$19,IF('Исходные данные'!AL19=\"да\",1,0),IF('параметры заявки'!$D$8='Исходные данные'!$C$20,IF('Исходные данные'!AL20=\"да\",1,0))))))","v":1},{"$f":"IF('параметры заявки'!$D$8='Исходные данные'!$C$16,IF('Исходные данные'!AM16=\"да\",1,0),IF('параметры заявки'!$D$8='Исходные данные'!$C$17,IF('Исходные данные'!AM17=\"да\",1,0),IF('параметры заявки'!$D$8='Исходные данные'!$C$18,IF('Исходные данные'!AM18=\"да\",1,0),IF('параметры заявки'!$D$8='Исходные данные'!$C$19,IF('Исходные данные'!AM19=\"да\",1,0),IF('параметры заявки'!$D$8='Исходные данные'!$C$20,IF('Исходные данные'!AM20=\"да\",1,0))))))","v":1},{"$f":"IF('параметры заявки'!$D$8='Исходные данные'!$C$16,IF('Исходные данные'!AN16=\"да\",1,0),IF('параметры заявки'!$D$8='Исходные данные'!$C$17,IF('Исходные данные'!AN17=\"да\",1,0),IF('параметры заявки'!$D$8='Исходные данные'!$C$18,IF('Исходные данные'!AN18=\"да\",1,0),IF('параметры заявки'!$D$8='Исходные данные'!$C$19,IF('Исходные данные'!AN19=\"да\",1,0),IF('параметры заявки'!$D$8='Исходные данные'!$C$20,IF('Исходные данные'!AN20=\"да\",1,0))))))","v":1},{"$f":"IF('параметры заявки'!$D$8='Исходные данные'!$C$16,IF('Исходные данные'!AO16=\"да\",1,0),IF('параметры заявки'!$D$8='Исходные данные'!$C$17,IF('Исходные данные'!AO17=\"да\",1,0),IF('параметры заявки'!$D$8='Исходные данные'!$C$18,IF('Исходные данные'!AO18=\"да\",1,0),IF('параметры заявки'!$D$8='Исходные данные'!$C$19,IF('Исходные данные'!AO19=\"да\",1,0),IF('параметры заявки'!$D$8='Исходные данные'!$C$20,IF('Исходные данные'!AO20=\"да\",1,0))))))","v":1},{"$f":"IF('параметры заявки'!$D$8='Исходные данные'!$C$16,IF('Исходные данные'!AP16=\"да\",1,0),IF('параметры заявки'!$D$8='Исходные данные'!$C$17,IF('Исходные данные'!AP17=\"да\",1,0),IF('параметры заявки'!$D$8='Исходные данные'!$C$18,IF('Исходные данные'!AP18=\"да\",1,0),IF('параметры заявки'!$D$8='Исходные данные'!$C$19,IF('Исходные данные'!AP19=\"да\",1,0),IF('параметры заявки'!$D$8='Исходные данные'!$C$20,IF('Исходные данные'!AP20=\"да\",1,0))))))","v":1},{"$f":"IF('параметры заявки'!$D$8='Исходные данные'!$C$16,IF('Исходные данные'!AQ16=\"да\",1,0),IF('параметры заявки'!$D$8='Исходные данные'!$C$17,IF('Исходные данные'!AQ17=\"да\",1,0),IF('параметры заявки'!$D$8='Исходные данные'!$C$18,IF('Исходные данные'!AQ18=\"да\",1,0),IF('параметры заявки'!$D$8='Исходные данные'!$C$19,IF('Исходные данные'!AQ19=\"да\",1,0),IF('параметры заявки'!$D$8='Исходные данные'!$C$20,IF('Исходные данные'!AQ20=\"да\",1,0))))))","v":1},{"$f":"IF('параметры заявки'!$D$8='Исходные данные'!$C$16,IF('Исходные данные'!AR16=\"да\",1,0),IF('параметры заявки'!$D$8='Исходные данные'!$C$17,IF('Исходные данные'!AR17=\"да\",1,0),IF('параметры заявки'!$D$8='Исходные данные'!$C$18,IF('Исходные данные'!AR18=\"да\",1,0),IF('параметры заявки'!$D$8='Исходные данные'!$C$19,IF('Исходные данные'!AR19=\"да\",1,0),IF('параметры заявки'!$D$8='Исходные данные'!$C$20,IF('Исходные данные'!AR20=\"да\",1,0))))))","v":1},{"$f":"IF('параметры заявки'!$D$8='Исходные данные'!$C$16,IF('Исходные данные'!AS16=\"да\",1,0),IF('параметры заявки'!$D$8='Исходные данные'!$C$17,IF('Исходные данные'!AS17=\"да\",1,0),IF('параметры заявки'!$D$8='Исходные данные'!$C$18,IF('Исходные данные'!AS18=\"да\",1,0),IF('параметры заявки'!$D$8='Исходные данные'!$C$19,IF('Исходные данные'!AS19=\"да\",1,0),IF('параметры заявки'!$D$8='Исходные данные'!$C$20,IF('Исходные данные'!AS20=\"да\",1,0))))))","v":1},{"$f":"IF('параметры заявки'!$D$8='Исходные данные'!$C$16,IF('Исходные данные'!AT16=\"да\",1,0),IF('параметры заявки'!$D$8='Исходные данные'!$C$17,IF('Исходные данные'!AT17=\"да\",1,0),IF('параметры заявки'!$D$8='Исходные данные'!$C$18,IF('Исходные данные'!AT18=\"да\",1,0),IF('параметры заявки'!$D$8='Исходные данные'!$C$19,IF('Исходные данные'!AT19=\"да\",1,0),IF('параметры заявки'!$D$8='Исходные данные'!$C$20,IF('Исходные данные'!AT20=\"да\",1,0))))))","v":1},{"$f":"IF('параметры заявки'!$D$8='Исходные данные'!$C$16,IF('Исходные данные'!AU16=\"да\",1,0),IF('параметры заявки'!$D$8='Исходные данные'!$C$17,IF('Исходные данные'!AU17=\"да\",1,0),IF('параметры заявки'!$D$8='Исходные данные'!$C$18,IF('Исходные данные'!AU18=\"да\",1,0),IF('параметры заявки'!$D$8='Исходные данные'!$C$19,IF('Исходные данные'!AU19=\"да\",1,0),IF('параметры заявки'!$D$8='Исходные данные'!$C$20,IF('Исходные данные'!AU20=\"да\",1,0))))))","v":1},{"$f":"IF('параметры заявки'!$D$8='Исходные данные'!$C$16,IF('Исходные данные'!AV16=\"да\",1,0),IF('параметры заявки'!$D$8='Исходные данные'!$C$17,IF('Исходные данные'!AV17=\"да\",1,0),IF('параметры заявки'!$D$8='Исходные данные'!$C$18,IF('Исходные данные'!AV18=\"да\",1,0),IF('параметры заявки'!$D$8='Исходные данные'!$C$19,IF('Исходные данные'!AV19=\"да\",1,0),IF('параметры заявки'!$D$8='Исходные данные'!$C$20,IF('Исходные данные'!AV20=\"да\",1,0))))))","v":1},{"$f":"IF('параметры заявки'!$D$8='Исходные данные'!$C$16,IF('Исходные данные'!AW16=\"да\",1,0),IF('параметры заявки'!$D$8='Исходные данные'!$C$17,IF('Исходные данные'!AW17=\"да\",1,0),IF('параметры заявки'!$D$8='Исходные данные'!$C$18,IF('Исходные данные'!AW18=\"да\",1,0),IF('параметры заявки'!$D$8='Исходные данные'!$C$19,IF('Исходные данные'!AW19=\"да\",1,0),IF('параметры заявки'!$D$8='Исходные данные'!$C$20,IF('Исходные данные'!AW20=\"да\",1,0))))))","v":1},{"$f":"IF('параметры заявки'!$D$8='Исходные данные'!$C$16,IF('Исходные данные'!AX16=\"да\",1,0),IF('параметры заявки'!$D$8='Исходные данные'!$C$17,IF('Исходные данные'!AX17=\"да\",1,0),IF('параметры заявки'!$D$8='Исходные данные'!$C$18,IF('Исходные данные'!AX18=\"да\",1,0),IF('параметры заявки'!$D$8='Исходные данные'!$C$19,IF('Исходные данные'!AX19=\"да\",1,0),IF('параметры заявки'!$D$8='Исходные данные'!$C$20,IF('Исходные данные'!AX20=\"да\",1,0))))))","v":1},{"$f":"IF('параметры заявки'!$D$8='Исходные данные'!$C$16,IF('Исходные данные'!AY16=\"да\",1,0),IF('параметры заявки'!$D$8='Исходные данные'!$C$17,IF('Исходные данные'!AY17=\"да\",1,0),IF('параметры заявки'!$D$8='Исходные данные'!$C$18,IF('Исходные данные'!AY18=\"да\",1,0),IF('параметры заявки'!$D$8='Исходные данные'!$C$19,IF('Исходные данные'!AY19=\"да\",1,0),IF('параметры заявки'!$D$8='Исходные данные'!$C$20,IF('Исходные данные'!AY20=\"да\",1,0))))))","v":1},{"$f":"IF('параметры заявки'!$D$8='Исходные данные'!$C$16,IF('Исходные данные'!AZ16=\"да\",1,0),IF('параметры заявки'!$D$8='Исходные данные'!$C$17,IF('Исходные данные'!AZ17=\"да\",1,0),IF('параметры заявки'!$D$8='Исходные данные'!$C$18,IF('Исходные данные'!AZ18=\"да\",1,0),IF('параметры заявки'!$D$8='Исходные данные'!$C$19,IF('Исходные данные'!AZ19=\"да\",1,0),IF('параметры заявки'!$D$8='Исходные данные'!$C$20,IF('Исходные данные'!AZ20=\"да\",1,0))))))","v":1},{"$f":"IF('параметры заявки'!$D$8='Исходные данные'!$C$16,IF('Исходные данные'!BA16=\"да\",1,0),IF('параметры заявки'!$D$8='Исходные данные'!$C$17,IF('Исходные данные'!BA17=\"да\",1,0),IF('параметры заявки'!$D$8='Исходные данные'!$C$18,IF('Исходные данные'!BA18=\"да\",1,0),IF('параметры заявки'!$D$8='Исходные данные'!$C$19,IF('Исходные данные'!BA19=\"да\",1,0),IF('параметры заявки'!$D$8='Исходные данные'!$C$20,IF('Исходные данные'!BA20=\"да\",1,0))))))","v":1},{"$f":"IF('параметры заявки'!$D$8='Исходные данные'!$C$16,IF('Исходные данные'!BB16=\"да\",1,0),IF('параметры заявки'!$D$8='Исходные данные'!$C$17,IF('Исходные данные'!BB17=\"да\",1,0),IF('параметры заявки'!$D$8='Исходные данные'!$C$18,IF('Исходные данные'!BB18=\"да\",1,0),IF('параметры заявки'!$D$8='Исходные данные'!$C$19,IF('Исходные данные'!BB19=\"да\",1,0),IF('параметры заявки'!$D$8='Исходные данные'!$C$20,IF('Исходные данные'!BB20=\"да\",1,0))))))","v":1},{"$f":"IF('параметры заявки'!$D$8='Исходные данные'!$C$16,IF('Исходные данные'!BC16=\"да\",1,0),IF('параметры заявки'!$D$8='Исходные данные'!$C$17,IF('Исходные данные'!BC17=\"да\",1,0),IF('параметры заявки'!$D$8='Исходные данные'!$C$18,IF('Исходные данные'!BC18=\"да\",1,0),IF('параметры заявки'!$D$8='Исходные данные'!$C$19,IF('Исходные данные'!BC19=\"да\",1,0),IF('параметры заявки'!$D$8='Исходные данные'!$C$20,IF('Исходные данные'!BC20=\"да\",1,0))))))","v":1},{"$f":"IF('параметры заявки'!$D$8='Исходные данные'!$C$16,IF('Исходные данные'!BD16=\"да\",1,0),IF('параметры заявки'!$D$8='Исходные данные'!$C$17,IF('Исходные данные'!BD17=\"да\",1,0),IF('параметры заявки'!$D$8='Исходные данные'!$C$18,IF('Исходные данные'!BD18=\"да\",1,0),IF('параметры заявки'!$D$8='Исходные данные'!$C$19,IF('Исходные данные'!BD19=\"да\",1,0),IF('параметры заявки'!$D$8='Исходные данные'!$C$20,IF('Исходные данные'!BD20=\"да\",1,0))))))","v":1},{"$f":"IF('параметры заявки'!$D$8='Исходные данные'!$C$16,IF('Исходные данные'!BE16=\"да\",1,0),IF('параметры заявки'!$D$8='Исходные данные'!$C$17,IF('Исходные данные'!BE17=\"да\",1,0),IF('параметры заявки'!$D$8='Исходные данные'!$C$18,IF('Исходные данные'!BE18=\"да\",1,0),IF('параметры заявки'!$D$8='Исходные данные'!$C$19,IF('Исходные данные'!BE19=\"да\",1,0),IF('параметры заявки'!$D$8='Исходные данные'!$C$20,IF('Исходные данные'!BE20=\"да\",1,0))))))","v":1},{"$f":"IF('параметры заявки'!$D$8='Исходные данные'!$C$16,IF('Исходные данные'!BF16=\"да\",1,0),IF('параметры заявки'!$D$8='Исходные данные'!$C$17,IF('Исходные данные'!BF17=\"да\",1,0),IF('параметры заявки'!$D$8='Исходные данные'!$C$18,IF('Исходные данные'!BF18=\"да\",1,0),IF('параметры заявки'!$D$8='Исходные данные'!$C$19,IF('Исходные данные'!BF19=\"да\",1,0),IF('параметры заявки'!$D$8='Исходные данные'!$C$20,IF('Исходные данные'!BF20=\"да\",1,0))))))","v":1},{"$f":"IF('параметры заявки'!$D$8='Исходные данные'!$C$16,IF('Исходные данные'!BG16=\"да\",1,0),IF('параметры заявки'!$D$8='Исходные данные'!$C$17,IF('Исходные данные'!BG17=\"да\",1,0),IF('параметры заявки'!$D$8='Исходные данные'!$C$18,IF('Исходные данные'!BG18=\"да\",1,0),IF('параметры заявки'!$D$8='Исходные данные'!$C$19,IF('Исходные данные'!BG19=\"да\",1,0),IF('параметры заявки'!$D$8='Исходные данные'!$C$20,IF('Исходные данные'!BG20=\"да\",1,0))))))","v":1},{"$f":"IF('параметры заявки'!$D$8='Исходные данные'!$C$16,IF('Исходные данные'!BH16=\"да\",1,0),IF('параметры заявки'!$D$8='Исходные данные'!$C$17,IF('Исходные данные'!BH17=\"да\",1,0),IF('параметры заявки'!$D$8='Исходные данные'!$C$18,IF('Исходные данные'!BH18=\"да\",1,0),IF('параметры заявки'!$D$8='Исходные данные'!$C$19,IF('Исходные данные'!BH19=\"да\",1,0),IF('параметры заявки'!$D$8='Исходные данные'!$C$20,IF('Исходные данные'!BH20=\"да\",1,0))))))","v":1},{"$f":"IF('параметры заявки'!$D$8='Исходные данные'!$C$16,IF('Исходные данные'!BI16=\"да\",1,0),IF('параметры заявки'!$D$8='Исходные данные'!$C$17,IF('Исходные данные'!BI17=\"да\",1,0),IF('параметры заявки'!$D$8='Исходные данные'!$C$18,IF('Исходные данные'!BI18=\"да\",1,0),IF('параметры заявки'!$D$8='Исходные данные'!$C$19,IF('Исходные данные'!BI19=\"да\",1,0),IF('параметры заявки'!$D$8='Исходные данные'!$C$20,IF('Исходные данные'!BI20=\"да\",1,0))))))","v":1},{"$f":"IF('параметры заявки'!$D$8='Исходные данные'!$C$16,IF('Исходные данные'!BJ16=\"да\",1,0),IF('параметры заявки'!$D$8='Исходные данные'!$C$17,IF('Исходные данные'!BJ17=\"да\",1,0),IF('параметры заявки'!$D$8='Исходные данные'!$C$18,IF('Исходные данные'!BJ18=\"да\",1,0),IF('параметры заявки'!$D$8='Исходные данные'!$C$19,IF('Исходные данные'!BJ19=\"да\",1,0),IF('параметры заявки'!$D$8='Исходные данные'!$C$20,IF('Исходные данные'!BJ20=\"да\",1,0))))))","v":1},{"$f":"IF('параметры заявки'!$D$8='Исходные данные'!$C$16,IF('Исходные данные'!BK16=\"да\",1,0),IF('параметры заявки'!$D$8='Исходные данные'!$C$17,IF('Исходные данные'!BK17=\"да\",1,0),IF('параметры заявки'!$D$8='Исходные данные'!$C$18,IF('Исходные данные'!BK18=\"да\",1,0),IF('параметры заявки'!$D$8='Исходные данные'!$C$19,IF('Исходные данные'!BK19=\"да\",1,0),IF('параметры заявки'!$D$8='Исходные данные'!$C$20,IF('Исходные данные'!BK20=\"да\",1,0))))))","v":1},{"$f":"IF('параметры заявки'!$D$8='Исходные данные'!$C$16,IF('Исходные данные'!BL16=\"да\",1,0),IF('параметры заявки'!$D$8='Исходные данные'!$C$17,IF('Исходные данные'!BL17=\"да\",1,0),IF('параметры заявки'!$D$8='Исходные данные'!$C$18,IF('Исходные данные'!BL18=\"да\",1,0),IF('параметры заявки'!$D$8='Исходные данные'!$C$19,IF('Исходные данные'!BL19=\"да\",1,0),IF('параметры заявки'!$D$8='Исходные данные'!$C$20,IF('Исходные данные'!BL20=\"да\",1,0))))))","v":1},{"$f":"IF('параметры заявки'!$D$8='Исходные данные'!$C$16,IF('Исходные данные'!BM16=\"да\",1,0),IF('параметры заявки'!$D$8='Исходные данные'!$C$17,IF('Исходные данные'!BM17=\"да\",1,0),IF('параметры заявки'!$D$8='Исходные данные'!$C$18,IF('Исходные данные'!BM18=\"да\",1,0),IF('параметры заявки'!$D$8='Исходные данные'!$C$19,IF('Исходные данные'!BM19=\"да\",1,0),IF('параметры заявки'!$D$8='Исходные данные'!$C$20,IF('Исходные данные'!BM20=\"да\",1,0))))))","v":1},{"$f":"IF('параметры заявки'!$D$8='Исходные данные'!$C$16,IF('Исходные данные'!BN16=\"да\",1,0),IF('параметры заявки'!$D$8='Исходные данные'!$C$17,IF('Исходные данные'!BN17=\"да\",1,0),IF('параметры заявки'!$D$8='Исходные данные'!$C$18,IF('Исходные данные'!BN18=\"да\",1,0),IF('параметры заявки'!$D$8='Исходные данные'!$C$19,IF('Исходные данные'!BN19=\"да\",1,0),IF('параметры заявки'!$D$8='Исходные данные'!$C$20,IF('Исходные данные'!BN20=\"да\",1,0))))))","v":1},{"$f":"IF('параметры заявки'!$D$8='Исходные данные'!$C$16,IF('Исходные данные'!BO16=\"да\",1,0),IF('параметры заявки'!$D$8='Исходные данные'!$C$17,IF('Исходные данные'!BO17=\"да\",1,0),IF('параметры заявки'!$D$8='Исходные данные'!$C$18,IF('Исходные данные'!BO18=\"да\",1,0),IF('параметры заявки'!$D$8='Исходные данные'!$C$19,IF('Исходные данные'!BO19=\"да\",1,0),IF('параметры заявки'!$D$8='Исходные данные'!$C$20,IF('Исходные данные'!BO20=\"да\",1,0))))))","v":1},{"$f":"IF('параметры заявки'!$D$8='Исходные данные'!$C$16,IF('Исходные данные'!BP16=\"да\",1,0),IF('параметры заявки'!$D$8='Исходные данные'!$C$17,IF('Исходные данные'!BP17=\"да\",1,0),IF('параметры заявки'!$D$8='Исходные данные'!$C$18,IF('Исходные данные'!BP18=\"да\",1,0),IF('параметры заявки'!$D$8='Исходные данные'!$C$19,IF('Исходные данные'!BP19=\"да\",1,0),IF('параметры заявки'!$D$8='Исходные данные'!$C$20,IF('Исходные данные'!BP20=\"да\",1,0))))))","v":1},{"$f":"IF('параметры заявки'!$D$8='Исходные данные'!$C$16,IF('Исходные данные'!BQ16=\"да\",1,0),IF('параметры заявки'!$D$8='Исходные данные'!$C$17,IF('Исходные данные'!BQ17=\"да\",1,0),IF('параметры заявки'!$D$8='Исходные данные'!$C$18,IF('Исходные данные'!BQ18=\"да\",1,0),IF('параметры заявки'!$D$8='Исходные данные'!$C$19,IF('Исходные данные'!BQ19=\"да\",1,0),IF('параметры заявки'!$D$8='Исходные данные'!$C$20,IF('Исходные данные'!BQ20=\"да\",1,0))))))","v":1},{"$f":"IF('параметры заявки'!$D$8='Исходные данные'!$C$16,IF('Исходные данные'!BR16=\"да\",1,0),IF('параметры заявки'!$D$8='Исходные данные'!$C$17,IF('Исходные данные'!BR17=\"да\",1,0),IF('параметры заявки'!$D$8='Исходные данные'!$C$18,IF('Исходные данные'!BR18=\"да\",1,0),IF('параметры заявки'!$D$8='Исходные данные'!$C$19,IF('Исходные данные'!BR19=\"да\",1,0),IF('параметры заявки'!$D$8='Исходные данные'!$C$20,IF('Исходные данные'!BR20=\"да\",1,0))))))","v":1},{"$f":"IF('параметры заявки'!$D$8='Исходные данные'!$C$16,IF('Исходные данные'!BS16=\"да\",1,0),IF('параметры заявки'!$D$8='Исходные данные'!$C$17,IF('Исходные данные'!BS17=\"да\",1,0),IF('параметры заявки'!$D$8='Исходные данные'!$C$18,IF('Исходные данные'!BS18=\"да\",1,0),IF('параметры заявки'!$D$8='Исходные данные'!$C$19,IF('Исходные данные'!BS19=\"да\",1,0),IF('параметры заявки'!$D$8='Исходные данные'!$C$20,IF('Исходные данные'!BS20=\"да\",1,0))))))","v":1},{"$f":"IF('параметры заявки'!$D$8='Исходные данные'!$C$16,IF('Исходные данные'!BT16=\"да\",1,0),IF('параметры заявки'!$D$8='Исходные данные'!$C$17,IF('Исходные данные'!BT17=\"да\",1,0),IF('параметры заявки'!$D$8='Исходные данные'!$C$18,IF('Исходные данные'!BT18=\"да\",1,0),IF('параметры заявки'!$D$8='Исходные данные'!$C$19,IF('Исходные данные'!BT19=\"да\",1,0),IF('параметры заявки'!$D$8='Исходные данные'!$C$20,IF('Исходные данные'!BT20=\"да\",1,0))))))","v":1},{"$f":"IF('параметры заявки'!$D$8='Исходные данные'!$C$16,IF('Исходные данные'!BU16=\"да\",1,0),IF('параметры заявки'!$D$8='Исходные данные'!$C$17,IF('Исходные данные'!BU17=\"да\",1,0),IF('параметры заявки'!$D$8='Исходные данные'!$C$18,IF('Исходные данные'!BU18=\"да\",1,0),IF('параметры заявки'!$D$8='Исходные данные'!$C$19,IF('Исходные данные'!BU19=\"да\",1,0),IF('параметры заявки'!$D$8='Исходные данные'!$C$20,IF('Исходные данные'!BU20=\"да\",1,0))))))","v":1},{"$f":"IF('параметры заявки'!$D$8='Исходные данные'!$C$16,IF('Исходные данные'!BV16=\"да\",1,0),IF('параметры заявки'!$D$8='Исходные данные'!$C$17,IF('Исходные данные'!BV17=\"да\",1,0),IF('параметры заявки'!$D$8='Исходные данные'!$C$18,IF('Исходные данные'!BV18=\"да\",1,0),IF('параметры заявки'!$D$8='Исходные данные'!$C$19,IF('Исходные данные'!BV19=\"да\",1,0),IF('параметры заявки'!$D$8='Исходные данные'!$C$20,IF('Исходные данные'!BV20=\"да\",1,0))))))","v":1},{"$f":"IF('параметры заявки'!$D$8='Исходные данные'!$C$16,IF('Исходные данные'!BW16=\"да\",1,0),IF('параметры заявки'!$D$8='Исходные данные'!$C$17,IF('Исходные данные'!BW17=\"да\",1,0),IF('параметры заявки'!$D$8='Исходные данные'!$C$18,IF('Исходные данные'!BW18=\"да\",1,0),IF('параметры заявки'!$D$8='Исходные данные'!$C$19,IF('Исходные данные'!BW19=\"да\",1,0),IF('параметры заявки'!$D$8='Исходные данные'!$C$20,IF('Исходные данные'!BW20=\"да\",1,0))))))","v":1},{"$f":"IF('параметры заявки'!$D$8='Исходные данные'!$C$16,IF('Исходные данные'!BX16=\"да\",1,0),IF('параметры заявки'!$D$8='Исходные данные'!$C$17,IF('Исходные данные'!BX17=\"да\",1,0),IF('параметры заявки'!$D$8='Исходные данные'!$C$18,IF('Исходные данные'!BX18=\"да\",1,0),IF('параметры заявки'!$D$8='Исходные данные'!$C$19,IF('Исходные данные'!BX19=\"да\",1,0),IF('параметры заявки'!$D$8='Исходные данные'!$C$20,IF('Исходные данные'!BX20=\"да\",1,0))))))","v":1},{"$f":"IF('параметры заявки'!$D$8='Исходные данные'!$C$16,IF('Исходные данные'!BY16=\"да\",1,0),IF('параметры заявки'!$D$8='Исходные данные'!$C$17,IF('Исходные данные'!BY17=\"да\",1,0),IF('параметры заявки'!$D$8='Исходные данные'!$C$18,IF('Исходные данные'!BY18=\"да\",1,0),IF('параметры заявки'!$D$8='Исходные данные'!$C$19,IF('Исходные данные'!BY19=\"да\",1,0),IF('параметры заявки'!$D$8='Исходные данные'!$C$20,IF('Исходные данные'!BY20=\"да\",1,0))))))","v":1}]
[null,null,{"$f":"IF('параметры заявки'!D19=\"да\",'параметры заявки'!C19,IF('параметры заявки'!D20=\"да\",'параметры заявки'!C20,IF('параметры заявки'!D21=\"да\",'параметры заявки'!C21,IF('параметры заявки'!D22=\"да\",'параметры заявки'!C22,IF('параметры заявки'!D23=\"да\",'параметры заявки'!C23,0)))))","v":"БГ  >  5 млн и более"},{"$f":"IF('параметры заявки'!$D$4<'Исходные данные'!D4,IF($C$61=$C$38,IF(D38=\"да\",1,0),IF($C$61=$C$39,IF(D39=\"да\",1,0),IF($C$61=$C$40,IF(D40=\"да\",1,0),IF($C$61=$C$41,IF(D41=\"да\",1,0),IF($C$61=$C$42,IF(D42=\"да\",1,0)))))),0)","v":1},{"$f":"IF('параметры заявки'!$D$4<'Исходные данные'!E4,IF($C$61=$C$38,IF(E38=\"да\",1,0),IF($C$61=$C$39,IF(E39=\"да\",1,0),IF($C$61=$C$40,IF(E40=\"да\",1,0),IF($C$61=$C$41,IF(E41=\"да\",1,0),IF($C$61=$C$42,IF(E42=\"да\",1,0)))))),0)","v":1},{"$f":"IF('параметры заявки'!$D$4<'Исходные данные'!F4,IF($C$61=$C$38,IF(F38=\"да\",1,0),IF($C$61=$C$39,IF(F39=\"да\",1,0),IF($C$61=$C$40,IF(F40=\"да\",1,0),IF($C$61=$C$41,IF(F41=\"да\",1,0),IF($C$61=$C$42,IF(F42=\"да\",1,0)))))),0)","v":1},{"$f":"IF('параметры заявки'!$D$4<'Исходные данные'!G4,IF($C$61=$C$38,IF(G38=\"да\",1,0),IF($C$61=$C$39,IF(G39=\"да\",1,0),IF($C$61=$C$40,IF(G40=\"да\",1,0),IF($C$61=$C$41,IF(G41=\"да\",1,0),IF($C$61=$C$42,IF(G42=\"да\",1,0)))))),0)","v":1},{"$f":"IF('параметры заявки'!$D$4<'Исходные данные'!H4,IF($C$61=$C$38,IF(H38=\"да\",1,0),IF($C$61=$C$39,IF(H39=\"да\",1,0),IF($C$61=$C$40,IF(H40=\"да\",1,0),IF($C$61=$C$41,IF(H41=\"да\",1,0),IF($C$61=$C$42,IF(H42=\"да\",1,0)))))),0)","v":1},{"$f":"IF('параметры заявки'!$D$4<'Исходные данные'!I4,IF($C$61=$C$38,IF(I38=\"да\",1,0),IF($C$61=$C$39,IF(I39=\"да\",1,0),IF($C$61=$C$40,IF(I40=\"да\",1,0),IF($C$61=$C$41,IF(I41=\"да\",1,0),IF($C$61=$C$42,IF(I42=\"да\",1,0)))))),0)","v":1},{"$f":"IF('параметры заявки'!$D$4<'Исходные данные'!J4,IF($C$61=$C$38,IF(J38=\"да\",1,0),IF($C$61=$C$39,IF(J39=\"да\",1,0),IF($C$61=$C$40,IF(J40=\"да\",1,0),IF($C$61=$C$41,IF(J41=\"да\",1,0),IF($C$61=$C$42,IF(J42=\"да\",1,0)))))),0)","v":1},{"$f":"IF('параметры заявки'!$D$4<'Исходные данные'!K4,IF($C$61=$C$38,IF(K38=\"да\",1,0),IF($C$61=$C$39,IF(K39=\"да\",1,0),IF($C$61=$C$40,IF(K40=\"да\",1,0),IF($C$61=$C$41,IF(K41=\"да\",1,0),IF($C$61=$C$42,IF(K42=\"да\",1,0)))))),0)","v":1},{"$f":"IF('параметры заявки'!$D$4<'Исходные данные'!L4,IF($C$61=$C$38,IF(L38=\"да\",1,0),IF($C$61=$C$39,IF(L39=\"да\",1,0),IF($C$61=$C$40,IF(L40=\"да\",1,0),IF($C$61=$C$41,IF(L41=\"да\",1,0),IF($C$61=$C$42,IF(L42=\"да\",1,0)))))),0)","v":1},{"$f":"IF('параметры заявки'!$D$4<'Исходные данные'!M4,IF($C$61=$C$38,IF(M38=\"да\",1,0),IF($C$61=$C$39,IF(M39=\"да\",1,0),IF($C$61=$C$40,IF(M40=\"да\",1,0),IF($C$61=$C$41,IF(M41=\"да\",1,0),IF($C$61=$C$42,IF(M42=\"да\",1,0)))))),0)","v":1},{"$f":"IF('параметры заявки'!$D$4<'Исходные данные'!N4,IF($C$61=$C$38,IF(N38=\"да\",1,0),IF($C$61=$C$39,IF(N39=\"да\",1,0),IF($C$61=$C$40,IF(N40=\"да\",1,0),IF($C$61=$C$41,IF(N41=\"да\",1,0),IF($C$61=$C$42,IF(N42=\"да\",1,0)))))),0)","v":1},{"$f":"IF('параметры заявки'!$D$4<'Исходные данные'!O4,IF($C$61=$C$38,IF(O38=\"да\",1,0),IF($C$61=$C$39,IF(O39=\"да\",1,0),IF($C$61=$C$40,IF(O40=\"да\",1,0),IF($C$61=$C$41,IF(O41=\"да\",1,0),IF($C$61=$C$42,IF(O42=\"да\",1,0)))))),0)","v":1},{"$f":"IF('параметры заявки'!$D$4<'Исходные данные'!P4,IF($C$61=$C$38,IF(P38=\"да\",1,0),IF($C$61=$C$39,IF(P39=\"да\",1,0),IF($C$61=$C$40,IF(P40=\"да\",1,0),IF($C$61=$C$41,IF(P41=\"да\",1,0),IF($C$61=$C$42,IF(P42=\"да\",1,0)))))),0)","v":1},{"$f":"IF('параметры заявки'!$D$4<'Исходные данные'!Q4,IF($C$61=$C$38,IF(Q38=\"да\",1,0),IF($C$61=$C$39,IF(Q39=\"да\",1,0),IF($C$61=$C$40,IF(Q40=\"да\",1,0),IF($C$61=$C$41,IF(Q41=\"да\",1,0),IF($C$61=$C$42,IF(Q42=\"да\",1,0)))))),0)","v":1},{"$f":"IF('параметры заявки'!$D$4<'Исходные данные'!R4,IF($C$61=$C$38,IF(R38=\"да\",1,0),IF($C$61=$C$39,IF(R39=\"да\",1,0),IF($C$61=$C$40,IF(R40=\"да\",1,0),IF($C$61=$C$41,IF(R41=\"да\",1,0),IF($C$61=$C$42,IF(R42=\"да\",1,0)))))),0)","v":1},{"$f":"IF('параметры заявки'!$D$4<'Исходные данные'!S4,IF($C$61=$C$38,IF(S38=\"да\",1,0),IF($C$61=$C$39,IF(S39=\"да\",1,0),IF($C$61=$C$40,IF(S40=\"да\",1,0),IF($C$61=$C$41,IF(S41=\"да\",1,0),IF($C$61=$C$42,IF(S42=\"да\",1,0)))))),0)","v":0},{"$f":"IF('параметры заявки'!$D$4<'Исходные данные'!T4,IF($C$61=$C$38,IF(T38=\"да\",1,0),IF($C$61=$C$39,IF(T39=\"да\",1,0),IF($C$61=$C$40,IF(T40=\"да\",1,0),IF($C$61=$C$41,IF(T41=\"да\",1,0),IF($C$61=$C$42,IF(T42=\"да\",1,0)))))),0)","v":0},{"$f":"IF('параметры заявки'!$D$4<'Исходные данные'!U4,IF($C$61=$C$38,IF(U38=\"да\",1,0),IF($C$61=$C$39,IF(U39=\"да\",1,0),IF($C$61=$C$40,IF(U40=\"да\",1,0),IF($C$61=$C$41,IF(U41=\"да\",1,0),IF($C$61=$C$42,IF(U42=\"да\",1,0)))))),0)","v":1},{"$f":"IF('параметры заявки'!$D$4<'Исходные данные'!V4,IF($C$61=$C$38,IF(V38=\"да\",1,0),IF($C$61=$C$39,IF(V39=\"да\",1,0),IF($C$61=$C$40,IF(V40=\"да\",1,0),IF($C$61=$C$41,IF(V41=\"да\",1,0),IF($C$61=$C$42,IF(V42=\"да\",1,0)))))),0)","v":1},{"$f":"IF('параметры заявки'!$D$4<'Исходные данные'!W4,IF($C$61=$C$38,IF(W38=\"да\",1,0),IF($C$61=$C$39,IF(W39=\"да\",1,0),IF($C$61=$C$40,IF(W40=\"да\",1,0),IF($C$61=$C$41,IF(W41=\"да\",1,0),IF($C$61=$C$42,IF(W42=\"да\",1,0)))))),0)","v":1},{"$f":"IF('параметры заявки'!$D$4<'Исходные данные'!X4,IF($C$61=$C$38,IF(X38=\"да\",1,0),IF($C$61=$C$39,IF(X39=\"да\",1,0),IF($C$61=$C$40,IF(X40=\"да\",1,0),IF($C$61=$C$41,IF(X41=\"да\",1,0),IF($C$61=$C$42,IF(X42=\"да\",1,0)))))),0)","v":1},{"$f":"IF('параметры заявки'!$D$4<'Исходные данные'!Y4,IF($C$61=$C$38,IF(Y38=\"да\",1,0),IF($C$61=$C$39,IF(Y39=\"да\",1,0),IF($C$61=$C$40,IF(Y40=\"да\",1,0),IF($C$61=$C$41,IF(Y41=\"да\",1,0),IF($C$61=$C$42,IF(Y42=\"да\",1,0)))))),0)","v":1},{"$f":"IF('параметры заявки'!$D$4<'Исходные данные'!Z4,IF($C$61=$C$38,IF(Z38=\"да\",1,0),IF($C$61=$C$39,IF(Z39=\"да\",1,0),IF($C$61=$C$40,IF(Z40=\"да\",1,0),IF($C$61=$C$41,IF(Z41=\"да\",1,0),IF($C$61=$C$42,IF(Z42=\"да\",1,0)))))),0)","v":1},{"$f":"IF('параметры заявки'!$D$4<'Исходные данные'!AA4,IF($C$61=$C$38,IF(AA38=\"да\",1,0),IF($C$61=$C$39,IF(AA39=\"да\",1,0),IF($C$61=$C$40,IF(AA40=\"да\",1,0),IF($C$61=$C$41,IF(AA41=\"да\",1,0),IF($C$61=$C$42,IF(AA42=\"да\",1,0)))))),0)","v":1},{"$f":"IF('параметры заявки'!$D$4<'Исходные данные'!AB4,IF($C$61=$C$38,IF(AB38=\"да\",1,0),IF($C$61=$C$39,IF(AB39=\"да\",1,0),IF($C$61=$C$40,IF(AB40=\"да\",1,0),IF($C$61=$C$41,IF(AB41=\"да\",1,0),IF($C$61=$C$42,IF(AB42=\"да\",1,0)))))),0)","v":0},{"$f":"IF('параметры заявки'!$D$4<'Исходные данные'!AC4,IF($C$61=$C$38,IF(AC38=\"да\",1,0),IF($C$61=$C$39,IF(AC39=\"да\",1,0),IF($C$61=$C$40,IF(AC40=\"да\",1,0),IF($C$61=$C$41,IF(AC41=\"да\",1,0),IF($C$61=$C$42,IF(AC42=\"да\",1,0)))))),0)","v":1},{"$f":"IF('параметры заявки'!$D$4<'Исходные данные'!AD4,IF($C$61=$C$38,IF(AD38=\"да\",1,0),IF($C$61=$C$39,IF(AD39=\"да\",1,0),IF($C$61=$C$40,IF(AD40=\"да\",1,0),IF($C$61=$C$41,IF(AD41=\"да\",1,0),IF($C$61=$C$42,IF(AD42=\"да\",1,0)))))),0)","v":1},{"$f":"IF('параметры заявки'!$D$4<'Исходные данные'!AE4,IF($C$61=$C$38,IF(AE38=\"да\",1,0),IF($C$61=$C$39,IF(AE39=\"да\",1,0),IF($C$61=$C$40,IF(AE40=\"да\",1,0),IF($C$61=$C$41,IF(AE41=\"да\",1,0),IF($C$61=$C$42,IF(AE42=\"да\",1,0)))))),0)","v":1},{"$f":"IF('параметры заявки'!$D$4<'Исходные данные'!AF4,IF($C$61=$C$38,IF(AF38=\"да\",1,0),IF($C$61=$C$39,IF(AF39=\"да\",1,0),IF($C$61=$C$40,IF(AF40=\"да\",1,0),IF($C$61=$C$41,IF(AF41=\"да\",1,0),IF($C$61=$C$42,IF(AF42=\"да\",1,0)))))),0)","v":1},{"$f":"IF('параметры заявки'!$D$4<'Исходные данные'!AG4,IF($C$61=$C$38,IF(AG38=\"да\",1,0),IF($C$61=$C$39,IF(AG39=\"да\",1,0),IF($C$61=$C$40,IF(AG40=\"да\",1,0),IF($C$61=$C$41,IF(AG41=\"да\",1,0),IF($C$61=$C$42,IF(AG42=\"да\",1,0)))))),0)","v":0},{"$f":"IF('параметры заявки'!$D$4<'Исходные данные'!AH4,IF($C$61=$C$38,IF(AH38=\"да\",1,0),IF($C$61=$C$39,IF(AH39=\"да\",1,0),IF($C$61=$C$40,IF(AH40=\"да\",1,0),IF($C$61=$C$41,IF(AH41=\"да\",1,0),IF($C$61=$C$42,IF(AH42=\"да\",1,0)))))),0)","v":0},{"$f":"IF('параметры заявки'!$D$4<'Исходные данные'!AI4,IF($C$61=$C$38,IF(AI38=\"да\",1,0),IF($C$61=$C$39,IF(AI39=\"да\",1,0),IF($C$61=$C$40,IF(AI40=\"да\",1,0),IF($C$61=$C$41,IF(AI41=\"да\",1,0),IF($C$61=$C$42,IF(AI42=\"да\",1,0)))))),0)","v":1},{"$f":"IF('параметры заявки'!$D$4<'Исходные данные'!AJ4,IF($C$61=$C$38,IF(AJ38=\"да\",1,0),IF($C$61=$C$39,IF(AJ39=\"да\",1,0),IF($C$61=$C$40,IF(AJ40=\"да\",1,0),IF($C$61=$C$41,IF(AJ41=\"да\",1,0),IF($C$61=$C$42,IF(AJ42=\"да\",1,0)))))),0)","v":0},{"$f":"IF('параметры заявки'!$D$4<'Исходные данные'!AK4,IF($C$61=$C$38,IF(AK38=\"да\",1,0),IF($C$61=$C$39,IF(AK39=\"да\",1,0),IF($C$61=$C$40,IF(AK40=\"да\",1,0),IF($C$61=$C$41,IF(AK41=\"да\",1,0),IF($C$61=$C$42,IF(AK42=\"да\",1,0)))))),0)","v":0},{"$f":"IF('параметры заявки'!$D$4<'Исходные данные'!AL4,IF($C$61=$C$38,IF(AL38=\"да\",1,0),IF($C$61=$C$39,IF(AL39=\"да\",1,0),IF($C$61=$C$40,IF(AL40=\"да\",1,0),IF($C$61=$C$41,IF(AL41=\"да\",1,0),IF($C$61=$C$42,IF(AL42=\"да\",1,0)))))),0)","v":1},{"$f":"IF('параметры заявки'!$D$4<'Исходные данные'!AM4,IF($C$61=$C$38,IF(AM38=\"да\",1,0),IF($C$61=$C$39,IF(AM39=\"да\",1,0),IF($C$61=$C$40,IF(AM40=\"да\",1,0),IF($C$61=$C$41,IF(AM41=\"да\",1,0),IF($C$61=$C$42,IF(AM42=\"да\",1,0)))))),0)","v":0},{"$f":"IF('параметры заявки'!$D$4<'Исходные данные'!AN4,IF($C$61=$C$38,IF(AN38=\"да\",1,0),IF($C$61=$C$39,IF(AN39=\"да\",1,0),IF($C$61=$C$40,IF(AN40=\"да\",1,0),IF($C$61=$C$41,IF(AN41=\"да\",1,0),IF($C$61=$C$42,IF(AN42=\"да\",1,0)))))),0)","v":1},{"$f":"IF('параметры заявки'!$D$4<'Исходные данные'!AO4,IF($C$61=$C$38,IF(AO38=\"да\",1,0),IF($C$61=$C$39,IF(AO39=\"да\",1,0),IF($C$61=$C$40,IF(AO40=\"да\",1,0),IF($C$61=$C$41,IF(AO41=\"да\",1,0),IF($C$61=$C$42,IF(AO42=\"да\",1,0)))))),0)","v":1},{"$f":"IF('параметры заявки'!$D$4<'Исходные данные'!AP4,IF($C$61=$C$38,IF(AP38=\"да\",1,0),IF($C$61=$C$39,IF(AP39=\"да\",1,0),IF($C$61=$C$40,IF(AP40=\"да\",1,0),IF($C$61=$C$41,IF(AP41=\"да\",1,0),IF($C$61=$C$42,IF(AP42=\"да\",1,0)))))),0)","v":1},{"$f":"IF('параметры заявки'!$D$4<'Исходные данные'!AQ4,IF($C$61=$C$38,IF(AQ38=\"да\",1,0),IF($C$61=$C$39,IF(AQ39=\"да\",1,0),IF($C$61=$C$40,IF(AQ40=\"да\",1,0),IF($C$61=$C$41,IF(AQ41=\"да\",1,0),IF($C$61=$C$42,IF(AQ42=\"да\",1,0)))))),0)","v":1},{"$f":"IF('параметры заявки'!$D$4<'Исходные данные'!AR4,IF($C$61=$C$38,IF(AR38=\"да\",1,0),IF($C$61=$C$39,IF(AR39=\"да\",1,0),IF($C$61=$C$40,IF(AR40=\"да\",1,0),IF($C$61=$C$41,IF(AR41=\"да\",1,0),IF($C$61=$C$42,IF(AR42=\"да\",1,0)))))),0)","v":1},{"$f":"IF('параметры заявки'!$D$4<'Исходные данные'!AS4,IF($C$61=$C$38,IF(AS38=\"да\",1,0),IF($C$61=$C$39,IF(AS39=\"да\",1,0),IF($C$61=$C$40,IF(AS40=\"да\",1,0),IF($C$61=$C$41,IF(AS41=\"да\",1,0),IF($C$61=$C$42,IF(AS42=\"да\",1,0)))))),0)","v":1},{"$f":"IF('параметры заявки'!$D$4<'Исходные данные'!AT4,IF($C$61=$C$38,IF(AT38=\"да\",1,0),IF($C$61=$C$39,IF(AT39=\"да\",1,0),IF($C$61=$C$40,IF(AT40=\"да\",1,0),IF($C$61=$C$41,IF(AT41=\"да\",1,0),IF($C$61=$C$42,IF(AT42=\"да\",1,0)))))),0)","v":1},{"$f":"IF('параметры заявки'!$D$4<'Исходные данные'!AU4,IF($C$61=$C$38,IF(AU38=\"да\",1,0),IF($C$61=$C$39,IF(AU39=\"да\",1,0),IF($C$61=$C$40,IF(AU40=\"да\",1,0),IF($C$61=$C$41,IF(AU41=\"да\",1,0),IF($C$61=$C$42,IF(AU42=\"да\",1,0)))))),0)","v":1},{"$f":"IF('параметры заявки'!$D$4<'Исходные данные'!AV4,IF($C$61=$C$38,IF(AV38=\"да\",1,0),IF($C$61=$C$39,IF(AV39=\"да\",1,0),IF($C$61=$C$40,IF(AV40=\"да\",1,0),IF($C$61=$C$41,IF(AV41=\"да\",1,0),IF($C$61=$C$42,IF(AV42=\"да\",1,0)))))),0)","v":1},{"$f":"IF('параметры заявки'!$D$4<'Исходные данные'!AW4,IF($C$61=$C$38,IF(AW38=\"да\",1,0),IF($C$61=$C$39,IF(AW39=\"да\",1,0),IF($C$61=$C$40,IF(AW40=\"да\",1,0),IF($C$61=$C$41,IF(AW41=\"да\",1,0),IF($C$61=$C$42,IF(AW42=\"да\",1,0)))))),0)","v":1},{"$f":"IF('параметры заявки'!$D$4<'Исходные данные'!AX4,IF($C$61=$C$38,IF(AX38=\"да\",1,0),IF($C$61=$C$39,IF(AX39=\"да\",1,0),IF($C$61=$C$40,IF(AX40=\"да\",1,0),IF($C$61=$C$41,IF(AX41=\"да\",1,0),IF($C$61=$C$42,IF(AX42=\"да\",1,0)))))),0)","v":1},{"$f":"IF('параметры заявки'!$D$4<'Исходные данные'!AY4,IF($C$61=$C$38,IF(AY38=\"да\",1,0),IF($C$61=$C$39,IF(AY39=\"да\",1,0),IF($C$61=$C$40,IF(AY40=\"да\",1,0),IF($C$61=$C$41,IF(AY41=\"да\",1,0),IF($C$61=$C$42,IF(AY42=\"да\",1,0)))))),0)","v":1},{"$f":"IF('параметры заявки'!$D$4<'Исходные данные'!AZ4,IF($C$61=$C$38,IF(AZ38=\"да\",1,0),IF($C$61=$C$39,IF(AZ39=\"да\",1,0),IF($C$61=$C$40,IF(AZ40=\"да\",1,0),IF($C$61=$C$41,IF(AZ41=\"да\",1,0),IF($C$61=$C$42,IF(AZ42=\"да\",1,0)))))),0)","v":1},{"$f":"IF('параметры заявки'!$D$4<'Исходные данные'!BA4,IF($C$61=$C$38,IF(BA38=\"да\",1,0),IF($C$61=$C$39,IF(BA39=\"да\",1,0),IF($C$61=$C$40,IF(BA40=\"да\",1,0),IF($C$61=$C$41,IF(BA41=\"да\",1,0),IF($C$61=$C$42,IF(BA42=\"да\",1,0)))))),0)","v":1},{"$f":"IF('параметры заявки'!$D$4<'Исходные данные'!BB4,IF($C$61=$C$38,IF(BB38=\"да\",1,0),IF($C$61=$C$39,IF(BB39=\"да\",1,0),IF($C$61=$C$40,IF(BB40=\"да\",1,0),IF($C$61=$C$41,IF(BB41=\"да\",1,0),IF($C$61=$C$42,IF(BB42=\"да\",1,0)))))),0)","v":1},{"$f":"IF('параметры заявки'!$D$4<'Исходные данные'!BC4,IF($C$61=$C$38,IF(BC38=\"да\",1,0),IF($C$61=$C$39,IF(BC39=\"да\",1,0),IF($C$61=$C$40,IF(BC40=\"да\",1,0),IF($C$61=$C$41,IF(BC41=\"да\",1,0),IF($C$61=$C$42,IF(BC42=\"да\",1,0)))))),0)","v":1},{"$f":"IF('параметры заявки'!$D$4<'Исходные данные'!BD4,IF($C$61=$C$38,IF(BD38=\"да\",1,0),IF($C$61=$C$39,IF(BD39=\"да\",1,0),IF($C$61=$C$40,IF(BD40=\"да\",1,0),IF($C$61=$C$41,IF(BD41=\"да\",1,0),IF($C$61=$C$42,IF(BD42=\"да\",1,0)))))),0)","v":1},{"$f":"IF('параметры заявки'!$D$4<'Исходные данные'!BE4,IF($C$61=$C$38,IF(BE38=\"да\",1,0),IF($C$61=$C$39,IF(BE39=\"да\",1,0),IF($C$61=$C$40,IF(BE40=\"да\",1,0),IF($C$61=$C$41,IF(BE41=\"да\",1,0),IF($C$61=$C$42,IF(BE42=\"да\",1,0)))))),0)","v":1},{"$f":"IF('параметры заявки'!$D$4<'Исходные данные'!BF4,IF($C$61=$C$38,IF(BF38=\"да\",1,0),IF($C$61=$C$39,IF(BF39=\"да\",1,0),IF($C$61=$C$40,IF(BF40=\"да\",1,0),IF($C$61=$C$41,IF(BF41=\"да\",1,0),IF($C$61=$C$42,IF(BF42=\"да\",1,0)))))),0)","v":1},{"$f":"IF('параметры заявки'!$D$4<'Исходные данные'!BG4,IF($C$61=$C$38,IF(BG38=\"да\",1,0),IF($C$61=$C$39,IF(BG39=\"да\",1,0),IF($C$61=$C$40,IF(BG40=\"да\",1,0),IF($C$61=$C$41,IF(BG41=\"да\",1,0),IF($C$61=$C$42,IF(BG42=\"да\",1,0)))))),0)","v":1},{"$f":"IF('параметры заявки'!$D$4<'Исходные данные'!BH4,IF($C$61=$C$38,IF(BH38=\"да\",1,0),IF($C$61=$C$39,IF(BH39=\"да\",1,0),IF($C$61=$C$40,IF(BH40=\"да\",1,0),IF($C$61=$C$41,IF(BH41=\"да\",1,0),IF($C$61=$C$42,IF(BH42=\"да\",1,0)))))),0)","v":1},{"$f":"IF('параметры заявки'!$D$4<'Исходные данные'!BI4,IF($C$61=$C$38,IF(BI38=\"да\",1,0),IF($C$61=$C$39,IF(BI39=\"да\",1,0),IF($C$61=$C$40,IF(BI40=\"да\",1,0),IF($C$61=$C$41,IF(BI41=\"да\",1,0),IF($C$61=$C$42,IF(BI42=\"да\",1,0)))))),0)","v":0},{"$f":"IF('параметры заявки'!$D$4<'Исходные данные'!BJ4,IF($C$61=$C$38,IF(BJ38=\"да\",1,0),IF($C$61=$C$39,IF(BJ39=\"да\",1,0),IF($C$61=$C$40,IF(BJ40=\"да\",1,0),IF($C$61=$C$41,IF(BJ41=\"да\",1,0),IF($C$61=$C$42,IF(BJ42=\"да\",1,0)))))),0)","v":1},{"$f":"IF('параметры заявки'!$D$4<'Исходные данные'!BK4,IF($C$61=$C$38,IF(BK38=\"да\",1,0),IF($C$61=$C$39,IF(BK39=\"да\",1,0),IF($C$61=$C$40,IF(BK40=\"да\",1,0),IF($C$61=$C$41,IF(BK41=\"да\",1,0),IF($C$61=$C$42,IF(BK42=\"да\",1,0)))))),0)","v":1},{"$f":"IF('параметры заявки'!$D$4<'Исходные данные'!BL4,IF($C$61=$C$38,IF(BL38=\"да\",1,0),IF($C$61=$C$39,IF(BL39=\"да\",1,0),IF($C$61=$C$40,IF(BL40=\"да\",1,0),IF($C$61=$C$41,IF(BL41=\"да\",1,0),IF($C$61=$C$42,IF(BL42=\"да\",1,0)))))),0)","v":1},{"$f":"IF('параметры заявки'!$D$4<'Исходные данные'!BM4,IF($C$61=$C$38,IF(BM38=\"да\",1,0),IF($C$61=$C$39,IF(BM39=\"да\",1,0),IF($C$61=$C$40,IF(BM40=\"да\",1,0),IF($C$61=$C$41,IF(BM41=\"да\",1,0),IF($C$61=$C$42,IF(BM42=\"да\",1,0)))))),0)","v":1},{"$f":"IF('параметры заявки'!$D$4<'Исходные данные'!BN4,IF($C$61=$C$38,IF(BN38=\"да\",1,0),IF($C$61=$C$39,IF(BN39=\"да\",1,0),IF($C$61=$C$40,IF(BN40=\"да\",1,0),IF($C$61=$C$41,IF(BN41=\"да\",1,0),IF($C$61=$C$42,IF(BN42=\"да\",1,0)))))),0)","v":1},{"$f":"IF('параметры заявки'!$D$4<'Исходные данные'!BO4,IF($C$61=$C$38,IF(BO38=\"да\",1,0),IF($C$61=$C$39,IF(BO39=\"да\",1,0),IF($C$61=$C$40,IF(BO40=\"да\",1,0),IF($C$61=$C$41,IF(BO41=\"да\",1,0),IF($C$61=$C$42,IF(BO42=\"да\",1,0)))))),0)","v":1},{"$f":"IF('параметры заявки'!$D$4<'Исходные данные'!BP4,IF($C$61=$C$38,IF(BP38=\"да\",1,0),IF($C$61=$C$39,IF(BP39=\"да\",1,0),IF($C$61=$C$40,IF(BP40=\"да\",1,0),IF($C$61=$C$41,IF(BP41=\"да\",1,0),IF($C$61=$C$42,IF(BP42=\"да\",1,0)))))),0)","v":1},{"$f":"IF('параметры заявки'!$D$4<'Исходные данные'!BQ4,IF($C$61=$C$38,IF(BQ38=\"да\",1,0),IF($C$61=$C$39,IF(BQ39=\"да\",1,0),IF($C$61=$C$40,IF(BQ40=\"да\",1,0),IF($C$61=$C$41,IF(BQ41=\"да\",1,0),IF($C$61=$C$42,IF(BQ42=\"да\",1,0)))))),0)","v":1},{"$f":"IF('параметры заявки'!$D$4<'Исходные данные'!BR4,IF($C$61=$C$38,IF(BR38=\"да\",1,0),IF($C$61=$C$39,IF(BR39=\"да\",1,0),IF($C$61=$C$40,IF(BR40=\"да\",1,0),IF($C$61=$C$41,IF(BR41=\"да\",1,0),IF($C$61=$C$42,IF(BR42=\"да\",1,0)))))),0)","v":1},{"$f":"IF('параметры заявки'!$D$4<'Исходные данные'!BS4,IF($C$61=$C$38,IF(BS38=\"да\",1,0),IF($C$61=$C$39,IF(BS39=\"да\",1,0),IF($C$61=$C$40,IF(BS40=\"да\",1,0),IF($C$61=$C$41,IF(BS41=\"да\",1,0),IF($C$61=$C$42,IF(BS42=\"да\",1,0)))))),0)","v":1},{"$f":"IF('параметры заявки'!$D$4<'Исходные данные'!BT4,IF($C$61=$C$38,IF(BT38=\"да\",1,0),IF($C$61=$C$39,IF(BT39=\"да\",1,0),IF($C$61=$C$40,IF(BT40=\"да\",1,0),IF($C$61=$C$41,IF(BT41=\"да\",1,0),IF($C$61=$C$42,IF(BT42=\"да\",1,0)))))),0)","v":1},{"$f":"IF('параметры заявки'!$D$4<'Исходные данные'!BU4,IF($C$61=$C$38,IF(BU38=\"да\",1,0),IF($C$61=$C$39,IF(BU39=\"да\",1,0),IF($C$61=$C$40,IF(BU40=\"да\",1,0),IF($C$61=$C$41,IF(BU41=\"да\",1,0),IF($C$61=$C$42,IF(BU42=\"да\",1,0)))))),0)","v":1},{"$f":"IF('параметры заявки'!$D$4<'Исходные данные'!BV4,IF($C$61=$C$38,IF(BV38=\"да\",1,0),IF($C$61=$C$39,IF(BV39=\"да\",1,0),IF($C$61=$C$40,IF(BV40=\"да\",1,0),IF($C$61=$C$41,IF(BV41=\"да\",1,0),IF($C$61=$C$42,IF(BV42=\"да\",1,0)))))),0)","v":1},{"$f":"IF('параметры заявки'!$D$4<'Исходные данные'!BW4,IF($C$61=$C$38,IF(BW38=\"да\",1,0),IF($C$61=$C$39,IF(BW39=\"да\",1,0),IF($C$61=$C$40,IF(BW40=\"да\",1,0),IF($C$61=$C$41,IF(BW41=\"да\",1,0),IF($C$61=$C$42,IF(BW42=\"да\",1,0)))))),0)","v":1},{"$f":"IF('параметры заявки'!$D$4<'Исходные данные'!BX4,IF($C$61=$C$38,IF(BX38=\"да\",1,0),IF($C$61=$C$39,IF(BX39=\"да\",1,0),IF($C$61=$C$40,IF(BX40=\"да\",1,0),IF($C$61=$C$41,IF(BX41=\"да\",1,0),IF($C$61=$C$42,IF(BX42=\"да\",1,0)))))),0)","v":1},{"$f":"IF('параметры заявки'!$D$4<'Исходные данные'!BY4,IF($C$61=$C$38,IF(BY38=\"да\",1,0),IF($C$61=$C$39,IF(BY39=\"да\",1,0),IF($C$61=$C$40,IF(BY40=\"да\",1,0),IF($C$61=$C$41,IF(BY41=\"да\",1,0),IF($C$61=$C$42,IF(BY42=\"да\",1,0)))))),0)","v":1}]
[null,null,"дата регистрации предприятия",{"$f":"IF(D5+'параметры заявки'!$D$7>'параметры заявки'!$D$2,0,1)","v":1},{"$f":"IF(E5+'параметры заявки'!$D$7>'параметры заявки'!$D$2,0,1)","v":1},{"$f":"IF(F5+'параметры заявки'!$D$7>'параметры заявки'!$D$2,0,1)","v":1},{"$f":"IF(G5+'параметры заявки'!$D$7>'параметры заявки'!$D$2,0,1)","v":1},{"$f":"IF(H5+'параметры заявки'!$D$7>'параметры заявки'!$D$2,0,1)","v":1},{"$f":"IF(I5+'параметры заявки'!$D$7>'параметры заявки'!$D$2,0,1)","v":1},{"$f":"IF(J5+'параметры заявки'!$D$7>'параметры заявки'!$D$2,0,1)","v":1},{"$f":"IF(K5+'параметры заявки'!$D$7>'параметры заявки'!$D$2,0,1)","v":1},{"$f":"IF(L5+'параметры заявки'!$D$7>'параметры заявки'!$D$2,0,1)","v":1},{"$f":"IF(M5+'параметры заявки'!$D$7>'параметры заявки'!$D$2,0,1)","v":1},{"$f":"IF(N5+'параметры заявки'!$D$7>'параметры заявки'!$D$2,0,1)","v":1},{"$f":"IF(O5+'параметры заявки'!$D$7>'параметры заявки'!$D$2,0,1)","v":1},{"$f":"IF(P5+'параметры заявки'!$D$7>'параметры заявки'!$D$2,0,1)","v":1},{"$f":"IF(Q5+'параметры заявки'!$D$7>'параметры заявки'!$D$2,0,1)","v":1},{"$f":"IF(R5+'параметры заявки'!$D$7>'параметры заявки'!$D$2,0,1)","v":1},{"$f":"IF(S5+'параметры заявки'!$D$7>'параметры заявки'!$D$2,0,1)","v":1},{"$f":"IF(T5+'параметры заявки'!$D$7>'параметры заявки'!$D$2,0,1)","v":1},{"$f":"IF(U5+'параметры заявки'!$D$7>'параметры заявки'!$D$2,0,1)","v":1},{"$f":"IF(V5+'параметры заявки'!$D$7>'параметры заявки'!$D$2,0,1)","v":1},{"$f":"IF(W5+'параметры заявки'!$D$7>'параметры заявки'!$D$2,0,1)","v":1},{"$f":"IF(X5+'параметры заявки'!$D$7>'параметры заявки'!$D$2,0,1)","v":1},{"$f":"IF(Y5+'параметры заявки'!$D$7>'параметры заявки'!$D$2,0,1)","v":1},{"$f":"IF(Z5+'параметры заявки'!$D$7>'параметры заявки'!$D$2,0,1)","v":1},{"$f":"IF(AA5+'параметры заявки'!$D$7>'параметры заявки'!$D$2,0,1)","v":1},{"$f":"IF(AB5+'параметры заявки'!$D$7>'параметры заявки'!$D$2,0,1)","v":1},{"$f":"IF(AC5+'параметры заявки'!$D$7>'параметры заявки'!$D$2,0,1)","v":1},{"$f":"IF(AD5+'параметры заявки'!$D$7>'параметры заявки'!$D$2,0,1)","v":1},{"$f":"IF(AE5+'параметры заявки'!$D$7>'параметры заявки'!$D$2,0,1)","v":1},{"$f":"IF(AF5+'параметры заявки'!$D$7>'параметры заявки'!$D$2,0,1)","v":1},{"$f":"IF(AG5+'параметры заявки'!$D$7>'параметры заявки'!$D$2,0,1)","v":1},{"$f":"IF(AH5+'параметры заявки'!$D$7>'параметры заявки'!$D$2,0,1)","v":1},{"$f":"IF(AI5+'параметры заявки'!$D$7>'параметры заявки'!$D$2,0,1)","v":1},{"$f":"IF(AJ5+'параметры заявки'!$D$7>'параметры заявки'!$D$2,0,1)","v":1},{"$f":"IF(AK5+'параметры заявки'!$D$7>'параметры заявки'!$D$2,0,1)","v":1},{"$f":"IF(AL5+'параметры заявки'!$D$7>'параметры заявки'!$D$2,0,1)","v":1},{"$f":"IF(AM5+'параметры заявки'!$D$7>'параметры заявки'!$D$2,0,1)","v":1},{"$f":"IF(AN5+'параметры заявки'!$D$7>'параметры заявки'!$D$2,0,1)","v":1},{"$f":"IF(AO5+'параметры заявки'!$D$7>'параметры заявки'!$D$2,0,1)","v":1},{"$f":"IF(AP5+'параметры заявки'!$D$7>'параметры заявки'!$D$2,0,1)","v":1},{"$f":"IF(AQ5+'параметры заявки'!$D$7>'параметры заявки'!$D$2,0,1)","v":1},{"$f":"IF(AR5+'параметры заявки'!$D$7>'параметры заявки'!$D$2,0,1)","v":1},{"$f":"IF(AS5+'параметры заявки'!$D$7>'параметры заявки'!$D$2,0,1)","v":1},{"$f":"IF(AT5+'параметры заявки'!$D$7>'параметры заявки'!$D$2,0,1)","v":1},{"$f":"IF(AU5+'параметры заявки'!$D$7>'параметры заявки'!$D$2,0,1)","v":1},{"$f":"IF(AV5+'параметры заявки'!$D$7>'параметры заявки'!$D$2,0,1)","v":1},{"$f":"IF(AW5+'параметры заявки'!$D$7>'параметры заявки'!$D$2,0,1)","v":1},{"$f":"IF(AX5+'параметры заявки'!$D$7>'параметры заявки'!$D$2,0,1)","v":1},{"$f":"IF(AY5+'параметры заявки'!$D$7>'параметры заявки'!$D$2,0,1)","v":1},{"$f":"IF(AZ5+'параметры заявки'!$D$7>'параметры заявки'!$D$2,0,1)","v":1},{"$f":"IF(BA5+'параметры заявки'!$D$7>'параметры заявки'!$D$2,0,1)","v":1},{"$f":"IF(BB5+'параметры заявки'!$D$7>'параметры заявки'!$D$2,0,1)","v":1},{"$f":"IF(BC5+'параметры заявки'!$D$7>'параметры заявки'!$D$2,0,1)","v":1},{"$f":"IF(BD5+'параметры заявки'!$D$7>'параметры заявки'!$D$2,0,1)","v":1},{"$f":"IF(BE5+'параметры заявки'!$D$7>'параметры заявки'!$D$2,0,1)","v":1},{"$f":"IF(BF5+'параметры заявки'!$D$7>'параметры заявки'!$D$2,0,1)","v":1},{"$f":"IF(BG5+'параметры заявки'!$D$7>'параметры заявки'!$D$2,0,1)","v":1},{"$f":"IF(BH5+'параметры заявки'!$D$7>'параметры заявки'!$D$2,0,1)","v":1},{"$f":"IF(BI5+'параметры заявки'!$D$7>'параметры заявки'!$D$2,0,1)","v":1},{"$f":"IF(BJ5+'параметры заявки'!$D$7>'параметры заявки'!$D$2,0,1)","v":1},{"$f":"IF(BK5+'параметры заявки'!$D$7>'параметры заявки'!$D$2,0,1)","v":1},{"$f":"IF(BL5+'параметры заявки'!$D$7>'параметры заявки'!$D$2,0,1)","v":1},{"$f":"IF(BM5+'параметры заявки'!$D$7>'параметры заявки'!$D$2,0,1)","v":1},{"$f":"IF(BN5+'параметры заявки'!$D$7>'параметры заявки'!$D$2,0,1)","v":1},{"$f":"IF(BO5+'параметры заявки'!$D$7>'параметры заявки'!$D$2,0,1)","v":1},{"$f":"IF(BP5+'параметры заявки'!$D$7>'параметры заявки'!$D$2,0,1)","v":1},{"$f":"IF(BQ5+'параметры заявки'!$D$7>'параметры заявки'!$D$2,0,1)","v":1},{"$f":"IF(BR5+'параметры заявки'!$D$7>'параметры заявки'!$D$2,0,1)","v":1},{"$f":"IF(BS5+'параметры заявки'!$D$7>'параметры заявки'!$D$2,0,1)","v":1},{"$f":"IF(BT5+'параметры заявки'!$D$7>'параметры заявки'!$D$2,0,1)","v":1},{"$f":"IF(BU5+'параметры заявки'!$D$7>'параметры заявки'!$D$2,0,1)","v":1},{"$f":"IF(BV5+'параметры заявки'!$D$7>'параметры заявки'!$D$2,0,1)","v":1},{"$f":"IF(BW5+'параметры заявки'!$D$7>'параметры заявки'!$D$2,0,1)","v":1},{"$f":"IF(BX5+'параметры заявки'!$D$7>'параметры заявки'!$D$2,0,1)","v":1},{"$f":"IF(BY5+'параметры заявки'!$D$7>'параметры заявки'!$D$2,0,1)","v":1}]
[null,null,"срок БГ",{"$f":"IF(('параметры заявки'!$D$5-'параметры заявки'!$D$2)>(D14*31),0,1)","v":1},{"$f":"IF('параметры заявки'!$D$4<15000000,IF(('параметры заявки'!$D$5-'параметры заявки'!$D$2)>1130,0,1),IF(('параметры заявки'!$D$5-'параметры заявки'!$D$2)>806,0,1))","v":1},{"$f":"IF(('параметры заявки'!$D$5-'параметры заявки'!$D$2)>(F14*31),0,1)","v":1},{"$f":"IF(('параметры заявки'!$D$5-'параметры заявки'!$D$2)>(G14*31),0,1)","v":1},{"$f":"IF(('параметры заявки'!$D$5-'параметры заявки'!$D$2)>(H14*31),0,1)","v":1},{"$f":"IF(('параметры заявки'!$D$5-'параметры заявки'!$D$2)>(I14*31),0,1)","v":1},{"$f":"IF(('параметры заявки'!$D$5-'параметры заявки'!$D$2)>(J14*31),0,1)","v":1},{"$f":"IF(('параметры заявки'!$D$5-'параметры заявки'!$D$2)>(K14*31),0,1)","v":1},{"$f":"IF(('параметры заявки'!$D$5-'параметры заявки'!$D$2)>(L14*31),0,1)","v":1},{"$f":"IF(('параметры заявки'!$D$5-'параметры заявки'!$D$2)>(M14*31),0,1)","v":1},{"$f":"IF(('параметры заявки'!$D$5-'параметры заявки'!$D$2)>(N14*31),0,1)","v":1},{"$f":"IF(('параметры заявки'!$D$5-'параметры заявки'!$D$2)>(O14*31),0,1)","v":1},{"$f":"IF(('параметры заявки'!$D$5-'параметры заявки'!$D$2)>(P14*31),0,1)","v":1},{"$f":"IF(('параметры заявки'!$D$5-'параметры заявки'!$D$2)>(Q14*31),0,1)","v":1},{"$f":"IF(('параметры заявки'!$D$5-'параметры заявки'!$D$2)>(R14*31),0,1)","v":1},{"$f":"IF(('параметры заявки'!$D$5-'параметры заявки'!$D$2)>(S14*31),0,1)","v":1},{"$f":"IF(('параметры заявки'!$D$5-'параметры заявки'!$D$2)>(T14*31),0,1)","v":1},{"$f":"IF(('параметры заявки'!$D$5-'параметры заявки'!$D$2)>(U14*31),0,1)","v":1},{"$f":"IF(('параметры заявки'!$D$5-'параметры заявки'!$D$2)>(V14*31),0,1)","v":1},{"$f":"IF(('параметры заявки'!$D$5-'параметры заявки'!$D$2)>(W14*31),0,1)","v":1},{"$f":"IF(('параметры заявки'!$D$5-'параметры заявки'!$D$2)>(X14*31),0,1)","v":1},{"$f":"IF(('параметры заявки'!$D$5-'параметры заявки'!$D$2)>(Y14*31),0,1)","v":1},{"$f":"IF(('параметры заявки'!$D$5-'параметры заявки'!$D$2)>(Z14*31),0,1)","v":1},{"$f":"IF(('параметры заявки'!$D$5-'параметры заявки'!$D$2)>(AA14*31),0,1)","v":1},{"$f":"IF(('параметры заявки'!$D$5-'параметры заявки'!$D$2)>(AB14*31),0,1)","v":1},{"$f":"IF(('параметры заявки'!$D$5-'параметры заявки'!$D$2)>(AC14*31),0,1)","v":1},{"$f":"IF(('параметры заявки'!$D$5-'параметры заявки'!$D$2)>(AD14*31),0,1)","v":1},{"$f":"IF(('параметры заявки'!$D$5-'параметры заявки'!$D$2)>(AE14*31),0,1)","v":1},{"$f":"IF(('параметры заявки'!$D$5-'параметры заявки'!$D$2)>(AF14*31),0,1)","v":1},{"$f":"IF(('параметры заявки'!$D$5-'параметры заявки'!$D$2)>(AG14*31),0,1)","v":1},{"$f":"IF(('параметры заявки'!$D$5-'параметры заявки'!$D$2)>(AH14*31),0,1)","v":1},{"$f":"IF(('параметры заявки'!$D$5-'параметры заявки'!$D$2)>(AI14*31),0,1)","v":1},{"$f":"IF(('параметры заявки'!$D$5-'параметры заявки'!$D$2)>(AJ14*31),0,1)","v":1},{"$f":"IF(('параметры заявки'!$D$5-'параметры заявки'!$D$2)>(AK14*31),0,1)","v":1},{"$f":"IF(('параметры заявки'!$D$5-'параметры заявки'!$D$2)>(AL14*31),0,1)","v":1},{"$f":"IF(('параметры заявки'!$D$5-'параметры заявки'!$D$2)>(AM14*31),0,1)","v":1},{"$f":"IF(('параметры заявки'!$D$5-'параметры заявки'!$D$2)>(AN14*31),0,1)","v":1},{"$f":"IF(('параметры заявки'!$D$5-'параметры заявки'!$D$2)>(AO14*31),0,1)","v":1},{"$f":"IF(('параметры заявки'!$D$5-'параметры заявки'!$D$2)>(AP14*31),0,1)","v":1},{"$f":"IF(('параметры заявки'!$D$5-'параметры заявки'!$D$2)>(AQ14*31),0,1)","v":1},{"$f":"IF(('параметры заявки'!$D$5-'параметры заявки'!$D$2)>(AR14*31),0,1)","v":1},{"$f":"IF(('параметры заявки'!$D$5-'параметры заявки'!$D$2)>(AS14*31),0,1)","v":1},{"$f":"IF(('параметры заявки'!$D$5-'параметры заявки'!$D$2)>(AT14*31),0,1)","v":1},{"$f":"IF(('параметры заявки'!$D$5-'параметры заявки'!$D$2)>(AU14*31),0,1)","v":1},{"$f":"IF(('параметры заявки'!$D$5-'параметры заявки'!$D$2)>(AV14*31),0,1)","v":1},{"$f":"IF(('параметры заявки'!$D$5-'параметры заявки'!$D$2)>(AW14*31),0,1)","v":1},{"$f":"IF(('параметры заявки'!$D$5-'параметры заявки'!$D$2)>(AX14*31),0,1)","v":1},{"$f":"IF(('параметры заявки'!$D$5-'параметры заявки'!$D$2)>(AY14*31),0,1)","v":1},{"$f":"IF(('параметры заявки'!$D$5-'параметры заявки'!$D$2)>(AZ14*31),0,1)","v":1},{"$f":"IF(('параметры заявки'!$D$5-'параметры заявки'!$D$2)>(BA14*31),0,1)","v":1},{"$f":"IF(('параметры заявки'!$D$5-'параметры заявки'!$D$2)>(BB14*31),0,1)","v":1},{"$f":"IF(('параметры заявки'!$D$5-'параметры заявки'!$D$2)>(BC14*31),0,1)","v":1},{"$f":"IF(('параметры заявки'!$D$5-'параметры заявки'!$D$2)>(BD14*31),0,1)","v":1},{"$f":"IF(('параметры заявки'!$D$5-'параметры заявки'!$D$2)>(BE14*31),0,1)","v":1},{"$f":"IF(('параметры заявки'!$D$5-'параметры заявки'!$D$2)>(BF14*31),0,1)","v":1},{"$f":"IF(('параметры заявки'!$D$5-'параметры заявки'!$D$2)>(BG14*31),0,1)","v":1},{"$f":"IF(('параметры заявки'!$D$5-'параметры заявки'!$D$2)>(BH14*31),0,1)","v":1},{"$f":"IF(('параметры заявки'!$D$5-'параметры заявки'!$D$2)>(BI14*31),0,1)","v":1},{"$f":"IF(('параметры заявки'!$D$5-'параметры заявки'!$D$2)>(BJ14*31),0,1)","v":1},{"$f":"IF(('параметры заявки'!$D$5-'параметры заявки'!$D$2)>(BK14*31),0,1)","v":1},{"$f":"IF(('параметры заявки'!$D$5-'параметры заявки'!$D$2)>(BL14*31),0,1)","v":1},{"$f":"IF(('параметры заявки'!$D$5-'параметры заявки'!$D$2)>(BM14*31),0,1)","v":1},{"$f":"IF(('параметры заявки'!$D$5-'параметры заявки'!$D$2)>(BN14*31),0,1)","v":1},{"$f":"IF(('параметры заявки'!$D$5-'параметры заявки'!$D$2)>(BO14*31),0,1)","v":1},{"$f":"IF(('параметры заявки'!$D$5-'параметры заявки'!$D$2)>(BP14*31),0,1)","v":1},{"$f":"IF(('параметры заявки'!$D$5-'параметры заявки'!$D$2)>(BQ14*31),0,1)","v":1},{"$f":"IF(('параметры заявки'!$D$5-'параметры заявки'!$D$2)>(BR14*31),0,1)","v":1},{"$f":"IF(('параметры заявки'!$D$5-'параметры заявки'!$D$2)>(BS14*31),0,1)","v":1},{"$f":"IF(('параметры заявки'!$D$5-'параметры заявки'!$D$2)>(BT14*31),0,1)","v":1},{"$f":"IF(('параметры заявки'!$D$5-'параметры заявки'!$D$2)>(BU14*31),0,1)","v":1},{"$f":"IF(('параметры заявки'!$D$5-'параметры заявки'!$D$2)>(BV14*31),0,1)","v":1},{"$f":"IF(('параметры заявки'!$D$5-'параметры заявки'!$D$2)>(BW14*31),0,1)","v":1},{"$f":"IF(('параметры заявки'!$D$5-'параметры заявки'!$D$2)>(BX14*31),0,1)","v":1},{"$f":"IF(('параметры заявки'!$D$5-'параметры заявки'!$D$2)>(BY14*31),0,1)","v":1}]
[null,null,"Коммерческие БГ ",{"$f":"IF('параметры заявки'!$D$11=\"пусто\",1,IF('параметры заявки'!$D$11='Исходные данные'!D30,1,0))","v":1},{"$f":"IF('параметры заявки'!$D$11=\"пусто\",1,IF('параметры заявки'!$D$11='Исходные данные'!E30,1,0))","v":1},{"$f":"IF('параметры заявки'!$D$11=\"пусто\",1,IF('параметры заявки'!$D$11='Исходные данные'!F30,1,0))","v":1},{"$f":"IF('параметры заявки'!$D$11=\"пусто\",1,IF('параметры заявки'!$D$11='Исходные данные'!G30,1,0))","v":1},{"$f":"IF('параметры заявки'!$D$11=\"пусто\",1,IF('параметры заявки'!$D$11='Исходные данные'!H30,1,0))","v":1},{"$f":"IF('параметры заявки'!$D$11=\"пусто\",1,IF('параметры заявки'!$D$11='Исходные данные'!I30,1,0))","v":1},{"$f":"IF('параметры заявки'!$D$11=\"пусто\",1,IF('параметры заявки'!$D$11='Исходные данные'!J30,1,0))","v":1},{"$f":"IF('параметры заявки'!$D$11=\"пусто\",1,IF('параметры заявки'!$D$11='Исходные данные'!K30,1,0))","v":1},{"$f":"IF('параметры заявки'!$D$11=\"пусто\",1,IF('параметры заявки'!$D$11='Исходные данные'!L30,1,0))","v":1},{"$f":"IF('параметры заявки'!$D$11=\"пусто\",1,IF('параметры заявки'!$D$11='Исходные данные'!M30,1,0))","v":1},{"$f":"IF('параметры заявки'!$D$11=\"пусто\",1,IF('параметры заявки'!$D$11='Исходные данные'!N30,1,0))","v":1},{"$f":"IF('параметры заявки'!$D$11=\"пусто\",1,IF('параметры заявки'!$D$11='Исходные данные'!O30,1,0))","v":1},{"$f":"IF('параметры заявки'!$D$11=\"пусто\",1,IF('параметры заявки'!$D$11='Исходные данные'!P30,1,0))","v":1},{"$f":"IF('параметры заявки'!$D$11=\"пусто\",1,IF('параметры заявки'!$D$11='Исходные данные'!Q30,1,0))","v":1},{"$f":"IF('параметры заявки'!$D$11=\"пусто\",1,IF('параметры заявки'!$D$11='Исходные данные'!R30,1,0))","v":1},{"$f":"IF('параметры заявки'!$D$11=\"пусто\",1,IF('параметры заявки'!$D$11='Исходные данные'!S30,1,0))","v":1},{"$f":"IF('параметры заявки'!$D$11=\"пусто\",1,IF('параметры заявки'!$D$11='Исходные данные'!T30,1,0))","v":1},{"$f":"IF('параметры заявки'!$D$11=\"пусто\",1,IF('параметры заявки'!$D$11='Исходные данные'!U30,1,0))","v":1},{"$f":"IF('параметры заявки'!$D$11=\"пусто\",1,IF('параметры заявки'!$D$11='Исходные данные'!V30,1,0))","v":1},{"$f":"IF('параметры заявки'!$D$11=\"пусто\",1,IF('параметры заявки'!$D$11='Исходные данные'!W30,1,0))","v":1},{"$f":"IF('параметры заявки'!$D$11=\"пусто\",1,IF('параметры заявки'!$D$11='Исходные данные'!X30,1,0))","v":1},{"$f":"IF('параметры заявки'!$D$11=\"пусто\",1,IF('параметры заявки'!$D$11='Исходные данные'!Y30,1,0))","v":1},{"$f":"IF('параметры заявки'!$D$11=\"пусто\",1,IF('параметры заявки'!$D$11='Исходные данные'!Z30,1,0))","v":1},{"$f":"IF('параметры заявки'!$D$11=\"пусто\",1,IF('параметры заявки'!$D$11='Исходные данные'!AA30,1,0))","v":1},{"$f":"IF('параметры заявки'!$D$11=\"пусто\",1,IF('параметры заявки'!$D$11='Исходные данные'!AB30,1,0))","v":1},{"$f":"IF('параметры заявки'!$D$11=\"пусто\",1,IF('параметры заявки'!$D$11='Исходные данные'!AC30,1,0))","v":1},{"$f":"IF('параметры заявки'!$D$11=\"пусто\",1,IF('параметры заявки'!$D$11='Исходные данные'!AD30,1,0))","v":1},{"$f":"IF('параметры заявки'!$D$11=\"пусто\",1,IF('параметры заявки'!$D$11='Исходные данные'!AE30,1,0))","v":1},{"$f":"IF('параметры заявки'!$D$11=\"пусто\",1,IF('параметры заявки'!$D$11='Исходные данные'!AF30,1,0))","v":1},{"$f":"IF('параметры заявки'!$D$11=\"пусто\",1,IF('параметры заявки'!$D$11='Исходные данные'!AG30,1,0))","v":1},{"$f":"IF('параметры заявки'!$D$11=\"пусто\",1,IF('параметры заявки'!$D$11='Исходные данные'!AH30,1,0))","v":1},{"$f":"IF('параметры заявки'!$D$11=\"пусто\",1,IF('параметры заявки'!$D$11='Исходные данные'!AI30,1,0))","v":1},{"$f":"IF('параметры заявки'!$D$11=\"пусто\",1,IF('параметры заявки'!$D$11='Исходные данные'!AJ30,1,0))","v":1},{"$f":"IF('параметры заявки'!$D$11=\"пусто\",1,IF('параметры заявки'!$D$11='Исходные данные'!AK30,1,0))","v":1},{"$f":"IF('параметры заявки'!$D$11=\"пусто\",1,IF('параметры заявки'!$D$11='Исходные данные'!AL30,1,0))","v":1},{"$f":"IF('параметры заявки'!$D$11=\"пусто\",1,IF('параметры заявки'!$D$11='Исходные данные'!AM30,1,0))","v":1},{"$f":"IF('параметры заявки'!$D$11=\"пусто\",1,IF('параметры заявки'!$D$11='Исходные данные'!AN30,1,0))","v":1},{"$f":"IF('параметры заявки'!$D$11=\"пусто\",1,IF('параметры заявки'!$D$11='Исходные данные'!AO30,1,0))","v":1},{"$f":"IF('параметры заявки'!$D$11=\"пусто\",1,IF('параметры заявки'!$D$11='Исходные данные'!AP30,1,0))","v":1},{"$f":"IF('параметры заявки'!$D$11=\"пусто\",1,IF('параметры заявки'!$D$11='Исходные данные'!AQ30,1,0))","v":1},{"$f":"IF('параметры заявки'!$D$11=\"пусто\",1,IF('параметры заявки'!$D$11='Исходные данные'!AR30,1,0))","v":1},{"$f":"IF('параметры заявки'!$D$11=\"пусто\",1,IF('параметры заявки'!$D$11='Исходные данные'!AS30,1,0))","v":1},{"$f":"IF('параметры заявки'!$D$11=\"пусто\",1,IF('параметры заявки'!$D$11='Исходные данные'!AT30,1,0))","v":1},{"$f":"IF('параметры заявки'!$D$11=\"пусто\",1,IF('параметры заявки'!$D$11='Исходные данные'!AU30,1,0))","v":1},{"$f":"IF('параметры заявки'!$D$11=\"пусто\",1,IF('параметры заявки'!$D$11='Исходные данные'!AV30,1,0))","v":1},{"$f":"IF('параметры заявки'!$D$11=\"пусто\",1,IF('параметры заявки'!$D$11='Исходные данные'!AW30,1,0))","v":1},{"$f":"IF('параметры заявки'!$D$11=\"пусто\",1,IF('параметры заявки'!$D$11='Исходные данные'!AX30,1,0))","v":1},{"$f":"IF('параметры заявки'!$D$11=\"пусто\",1,IF('параметры заявки'!$D$11='Исходные данные'!AY30,1,0))","v":1},{"$f":"IF('параметры заявки'!$D$11=\"пусто\",1,IF('параметры заявки'!$D$11='Исходные данные'!AZ30,1,0))","v":1},{"$f":"IF('параметры заявки'!$D$11=\"пусто\",1,IF('параметры заявки'!$D$11='Исходные данные'!BA30,1,0))","v":1},{"$f":"IF('параметры заявки'!$D$11=\"пусто\",1,IF('параметры заявки'!$D$11='Исходные данные'!BB30,1,0))","v":1},{"$f":"IF('параметры заявки'!$D$11=\"пусто\",1,IF('параметры заявки'!$D$11='Исходные данные'!BC30,1,0))","v":1},{"$f":"IF('параметры заявки'!$D$11=\"пусто\",1,IF('параметры заявки'!$D$11='Исходные данные'!BD30,1,0))","v":1},{"$f":"IF('параметры заявки'!$D$11=\"пусто\",1,IF('параметры заявки'!$D$11='Исходные данные'!BE30,1,0))","v":1},{"$f":"IF('параметры заявки'!$D$11=\"пусто\",1,IF('параметры заявки'!$D$11='Исходные данные'!BF30,1,0))","v":1},{"$f":"IF('параметры заявки'!$D$11=\"пусто\",1,IF('параметры заявки'!$D$11='Исходные данные'!BG30,1,0))","v":1},{"$f":"IF('параметры заявки'!$D$11=\"пусто\",1,IF('параметры заявки'!$D$11='Исходные данные'!BH30,1,0))","v":1},{"$f":"IF('параметры заявки'!$D$11=\"пусто\",1,IF('параметры заявки'!$D$11='Исходные данные'!BI30,1,0))","v":1},{"$f":"IF('параметры заявки'!$D$11=\"пусто\",1,IF('параметры заявки'!$D$11='Исходные данные'!BJ30,1,0))","v":1},{"$f":"IF('параметры заявки'!$D$11=\"пусто\",1,IF('параметры заявки'!$D$11='Исходные данные'!BK30,1,0))","v":1},{"$f":"IF('параметры заявки'!$D$11=\"пусто\",1,IF('параметры заявки'!$D$11='Исходные данные'!BL30,1,0))","v":1},{"$f":"IF('параметры заявки'!$D$11=\"пусто\",1,IF('параметры заявки'!$D$11='Исходные данные'!BM30,1,0))","v":1},{"$f":"IF('параметры заявки'!$D$11=\"пусто\",1,IF('параметры заявки'!$D$11='Исходные данные'!BN30,1,0))","v":1},{"$f":"IF('параметры заявки'!$D$11=\"пусто\",1,IF('параметры заявки'!$D$11='Исходные данные'!BO30,1,0))","v":1},{"$f":"IF('параметры заявки'!$D$11=\"пусто\",1,IF('параметры заявки'!$D$11='Исходные данные'!BP30,1,0))","v":1},{"$f":"IF('параметры заявки'!$D$11=\"пусто\",1,IF('параметры заявки'!$D$11='Исходные данные'!BQ30,1,0))","v":1},{"$f":"IF('параметры заявки'!$D$11=\"пусто\",1,IF('параметры заявки'!$D$11='Исходные данные'!BR30,1,0))","v":1},{"$f":"IF('параметры заявки'!$D$11=\"пусто\",1,IF('параметры заявки'!$D$11='Исходные данные'!BS30,1,0))","v":1},{"$f":"IF('параметры заявки'!$D$11=\"пусто\",1,IF('параметры заявки'!$D$11='Исходные данные'!BT30,1,0))","v":1},{"$f":"IF('параметры заявки'!$D$11=\"пусто\",1,IF('параметры заявки'!$D$11='Исходные данные'!BU30,1,0))","v":1},{"$f":"IF('параметры заявки'!$D$11=\"пусто\",1,IF('параметры заявки'!$D$11='Исходные данные'!BV30,1,0))","v":1},{"$f":"IF('параметры заявки'!$D$11=\"пусто\",1,IF('параметры заявки'!$D$11='Исходные данные'!BW30,1,0))","v":1},{"$f":"IF('параметры заявки'!$D$11=\"пусто\",1,IF('параметры заявки'!$D$11='Исходные данные'!BX30,1,0))","v":1},{"$f":"IF('параметры заявки'!$D$11=\"пусто\",1,IF('параметры заявки'!$D$11='Исходные данные'!BY30,1,0))","v":1}]
[null,null,"Возврат аванса",{"$f":"IF('параметры заявки'!$D$12=\"пусто\",1,IF('параметры заявки'!$D$12='Исходные данные'!D31,1,0))","v":1},{"$f":"IF('параметры заявки'!$D$12=\"пусто\",1,IF('параметры заявки'!$D$12='Исходные данные'!E31,1,0))","v":1},{"$f":"IF('параметры заявки'!$D$12=\"пусто\",1,IF('параметры заявки'!$D$12='Исходные данные'!F31,1,0))","v":1},{"$f":"IF('параметры заявки'!$D$12=\"пусто\",1,IF('параметры заявки'!$D$12='Исходные данные'!G31,1,0))","v":1},{"$f":"IF('параметры заявки'!$D$12=\"пусто\",1,IF('параметры заявки'!$D$12='Исходные данные'!H31,1,0))","v":1},{"$f":"IF('параметры заявки'!$D$12=\"пусто\",1,IF('параметры заявки'!$D$12='Исходные данные'!I31,1,0))","v":1},{"$f":"IF('параметры заявки'!$D$12=\"пусто\",1,IF('параметры заявки'!$D$12='Исходные данные'!J31,1,0))","v":1},{"$f":"IF('параметры заявки'!$D$12=\"пусто\",1,IF('параметры заявки'!$D$12='Исходные данные'!K31,1,0))","v":1},{"$f":"IF('параметры заявки'!$D$12=\"пусто\",1,IF('параметры заявки'!$D$12='Исходные данные'!L31,1,0))","v":1},{"$f":"IF('параметры заявки'!$D$12=\"пусто\",1,IF('параметры заявки'!$D$12='Исходные данные'!M31,1,0))","v":1},{"$f":"IF('параметры заявки'!$D$12=\"пусто\",1,IF('параметры заявки'!$D$12='Исходные данные'!N31,1,0))","v":1},{"$f":"IF('параметры заявки'!$D$12=\"пусто\",1,IF('параметры заявки'!$D$12='Исходные данные'!O31,1,0))","v":1},{"$f":"IF('параметры заявки'!$D$12=\"пусто\",1,IF('параметры заявки'!$D$12='Исходные данные'!P31,1,0))","v":1},{"$f":"IF('параметры заявки'!$D$12=\"пусто\",1,IF('параметры заявки'!$D$12='Исходные данные'!Q31,1,0))","v":1},{"$f":"IF('параметры заявки'!$D$12=\"пусто\",1,IF('параметры заявки'!$D$12='Исходные данные'!R31,1,0))","v":1},{"$f":"IF('параметры заявки'!$D$12=\"пусто\",1,IF('параметры заявки'!$D$12='Исходные данные'!S31,1,0))","v":1},{"$f":"IF('параметры заявки'!$D$12=\"пусто\",1,IF('параметры заявки'!$D$12='Исходные данные'!T31,1,0))","v":1},{"$f":"IF('параметры заявки'!$D$12=\"пусто\",1,IF('параметры заявки'!$D$12='Исходные данные'!U31,1,0))","v":1},{"$f":"IF('параметры заявки'!$D$12=\"пусто\",1,IF('параметры заявки'!$D$12='Исходные данные'!V31,1,0))","v":1},{"$f":"IF('параметры заявки'!$D$12=\"пусто\",1,IF('параметры заявки'!$D$12='Исходные данные'!W31,1,0))","v":1},{"$f":"IF('параметры заявки'!$D$12=\"пусто\",1,IF('параметры заявки'!$D$12='Исходные данные'!X31,1,0))","v":1},{"$f":"IF('параметры заявки'!$D$12=\"пусто\",1,IF('параметры заявки'!$D$12='Исходные данные'!Y31,1,0))","v":1},{"$f":"IF('параметры заявки'!$D$12=\"пусто\",1,IF('параметры заявки'!$D$12='Исходные данные'!Z31,1,0))","v":1},{"$f":"IF('параметры заявки'!$D$12=\"пусто\",1,IF('параметры заявки'!$D$12='Исходные данные'!AA31,1,0))","v":1},{"$f":"IF('параметры заявки'!$D$12=\"пусто\",1,IF('параметры заявки'!$D$12='Исходные данные'!AB31,1,0))","v":1},{"$f":"IF('параметры заявки'!$D$12=\"пусто\",1,IF('параметры заявки'!$D$12='Исходные данные'!AC31,1,0))","v":1},{"$f":"IF('параметры заявки'!$D$12=\"пусто\",1,IF('параметры заявки'!$D$12='Исходные данные'!AD31,1,0))","v":1},{"$f":"IF('параметры заявки'!$D$12=\"пусто\",1,IF('параметры заявки'!$D$12='Исходные данные'!AE31,1,0))","v":1},{"$f":"IF('параметры заявки'!$D$12=\"пусто\",1,IF('параметры заявки'!$D$12='Исходные данные'!AF31,1,0))","v":1},{"$f":"IF('параметры заявки'!$D$12=\"пусто\",1,IF('параметры заявки'!$D$12='Исходные данные'!AG31,1,0))","v":1},{"$f":"IF('параметры заявки'!$D$12=\"пусто\",1,IF('параметры заявки'!$D$12='Исходные данные'!AH31,1,0))","v":1},{"$f":"IF('параметры заявки'!$D$12=\"пусто\",1,IF('параметры заявки'!$D$12='Исходные данные'!AI31,1,0))","v":1},{"$f":"IF('параметры заявки'!$D$12=\"пусто\",1,IF('параметры заявки'!$D$12='Исходные данные'!AJ31,1,0))","v":1},{"$f":"IF('параметры заявки'!$D$12=\"пусто\",1,IF('параметры заявки'!$D$12='Исходные данные'!AK31,1,0))","v":1},{"$f":"IF('параметры заявки'!$D$12=\"пусто\",1,IF('параметры заявки'!$D$12='Исходные данные'!AL31,1,0))","v":1},{"$f":"IF('параметры заявки'!$D$12=\"пусто\",1,IF('параметры заявки'!$D$12='Исходные данные'!AM31,1,0))","v":1},{"$f":"IF('параметры заявки'!$D$12=\"пусто\",1,IF('параметры заявки'!$D$12='Исходные данные'!AN31,1,0))","v":1},{"$f":"IF('параметры заявки'!$D$12=\"пусто\",1,IF('параметры заявки'!$D$12='Исходные данные'!AO31,1,0))","v":1},{"$f":"IF('параметры заявки'!$D$12=\"пусто\",1,IF('параметры заявки'!$D$12='Исходные данные'!AP31,1,0))","v":1},{"$f":"IF('параметры заявки'!$D$12=\"пусто\",1,IF('параметры заявки'!$D$12='Исходные данные'!AQ31,1,0))","v":1},{"$f":"IF('параметры заявки'!$D$12=\"пусто\",1,IF('параметры заявки'!$D$12='Исходные данные'!AR31,1,0))","v":1},{"$f":"IF('параметры заявки'!$D$12=\"пусто\",1,IF('параметры заявки'!$D$12='Исходные данные'!AS31,1,0))","v":1},{"$f":"IF('параметры заявки'!$D$12=\"пусто\",1,IF('параметры заявки'!$D$12='Исходные данные'!AT31,1,0))","v":1},{"$f":"IF('параметры заявки'!$D$12=\"пусто\",1,IF('параметры заявки'!$D$12='Исходные данные'!AU31,1,0))","v":1},{"$f":"IF('параметры заявки'!$D$12=\"пусто\",1,IF('параметры заявки'!$D$12='Исходные данные'!AV31,1,0))","v":1},{"$f":"IF('параметры заявки'!$D$12=\"пусто\",1,IF('параметры заявки'!$D$12='Исходные данные'!AW31,1,0))","v":1},{"$f":"IF('параметры заявки'!$D$12=\"пусто\",1,IF('параметры заявки'!$D$12='Исходные данные'!AX31,1,0))","v":1},{"$f":"IF('параметры заявки'!$D$12=\"пусто\",1,IF('параметры заявки'!$D$12='Исходные данные'!AY31,1,0))","v":1},{"$f":"IF('параметры заявки'!$D$12=\"пусто\",1,IF('параметры заявки'!$D$12='Исходные данные'!AZ31,1,0))","v":1},{"$f":"IF('параметры заявки'!$D$12=\"пусто\",1,IF('параметры заявки'!$D$12='Исходные данные'!BA31,1,0))","v":1},{"$f":"IF('параметры заявки'!$D$12=\"пусто\",1,IF('параметры заявки'!$D$12='Исходные данные'!BB31,1,0))","v":1},{"$f":"IF('параметры заявки'!$D$12=\"пусто\",1,IF('параметры заявки'!$D$12='Исходные данные'!BC31,1,0))","v":1},{"$f":"IF('параметры заявки'!$D$12=\"пусто\",1,IF('параметры заявки'!$D$12='Исходные данные'!BD31,1,0))","v":1},{"$f":"IF('параметры заявки'!$D$12=\"пусто\",1,IF('параметры заявки'!$D$12='Исходные данные'!BE31,1,0))","v":1},{"$f":"IF('параметры заявки'!$D$12=\"пусто\",1,IF('параметры заявки'!$D$12='Исходные данные'!BF31,1,0))","v":1},{"$f":"IF('параметры заявки'!$D$12=\"пусто\",1,IF('параметры заявки'!$D$12='Исходные данные'!BG31,1,0))","v":1},{"$f":"IF('параметры заявки'!$D$12=\"пусто\",1,IF('параметры заявки'!$D$12='Исходные данные'!BH31,1,0))","v":1},{"$f":"IF('параметры заявки'!$D$12=\"пусто\",1,IF('параметры заявки'!$D$12='Исходные данные'!BI31,1,0))","v":1},{"$f":"IF('параметры заявки'!$D$12=\"пусто\",1,IF('параметры заявки'!$D$12='Исходные данные'!BJ31,1,0))","v":1},{"$f":"IF('параметры заявки'!$D$12=\"пусто\",1,IF('параметры заявки'!$D$12='Исходные данные'!BK31,1,0))","v":1},{"$f":"IF('параметры заявки'!$D$12=\"пусто\",1,IF('параметры заявки'!$D$12='Исходные данные'!BL31,1,0))","v":1},{"$f":"IF('параметры заявки'!$D$12=\"пусто\",1,IF('параметры заявки'!$D$12='Исходные данные'!BM31,1,0))","v":1},{"$f":"IF('параметры заявки'!$D$12=\"пусто\",1,IF('параметры заявки'!$D$12='Исходные данные'!BN31,1,0))","v":1},{"$f":"IF('параметры заявки'!$D$12=\"пусто\",1,IF('параметры заявки'!$D$12='Исходные данные'!BO31,1,0))","v":1},{"$f":"IF('параметры заявки'!$D$12=\"пусто\",1,IF('параметры заявки'!$D$12='Исходные данные'!BP31,1,0))","v":1},{"$f":"IF('параметры заявки'!$D$12=\"пусто\",1,IF('параметры заявки'!$D$12='Исходные данные'!BQ31,1,0))","v":1},{"$f":"IF('параметры заявки'!$D$12=\"пусто\",1,IF('параметры заявки'!$D$12='Исходные данные'!BR31,1,0))","v":1},{"$f":"IF('параметры заявки'!$D$12=\"пусто\",1,IF('параметры заявки'!$D$12='Исходные данные'!BS31,1,0))","v":1},{"$f":"IF('параметры заявки'!$D$12=\"пусто\",1,IF('параметры заявки'!$D$12='Исходные данные'!BT31,1,0))","v":1},{"$f":"IF('параметры заявки'!$D$12=\"пусто\",1,IF('параметры заявки'!$D$12='Исходные данные'!BU31,1,0))","v":1},{"$f":"IF('параметры заявки'!$D$12=\"пусто\",1,IF('параметры заявки'!$D$12='Исходные данные'!BV31,1,0))","v":1},{"$f":"IF('параметры заявки'!$D$12=\"пусто\",1,IF('параметры заявки'!$D$12='Исходные данные'!BW31,1,0))","v":1},{"$f":"IF('параметры заявки'!$D$12=\"пусто\",1,IF('параметры заявки'!$D$12='Исходные данные'!BX31,1,0))","v":1},{"$f":"IF('параметры заявки'!$D$12=\"пусто\",1,IF('параметры заявки'!$D$12='Исходные данные'!BY31,1,0))","v":1}]
[null,null,"БГ по форме заказчика",{"$f":"IF('параметры заявки'!$D$13=\"пусто\",1,IF('параметры заявки'!$D$13='Исходные данные'!D32,1,0))","v":1},{"$f":"IF('параметры заявки'!$D$13=\"пусто\",1,IF('параметры заявки'!$D$13='Исходные данные'!E32,1,0))","v":1},{"$f":"IF('параметры заявки'!$D$13=\"пусто\",1,IF('параметры заявки'!$D$13='Исходные данные'!F32,1,0))","v":1},{"$f":"IF('параметры заявки'!$D$13=\"пусто\",1,IF('параметры заявки'!$D$13='Исходные данные'!G32,1,0))","v":1},{"$f":"IF('параметры заявки'!$D$13=\"пусто\",1,IF('параметры заявки'!$D$13='Исходные данные'!H32,1,0))","v":1},{"$f":"IF('параметры заявки'!$D$13=\"пусто\",1,IF('параметры заявки'!$D$13='Исходные данные'!I32,1,0))","v":1},{"$f":"IF('параметры заявки'!$D$13=\"пусто\",1,IF('параметры заявки'!$D$13='Исходные данные'!J32,1,0))","v":1},{"$f":"IF('параметры заявки'!$D$13=\"пусто\",1,IF('параметры заявки'!$D$13='Исходные данные'!K32,1,0))","v":1},{"$f":"IF('параметры заявки'!$D$13=\"пусто\",1,IF('параметры заявки'!$D$13='Исходные данные'!L32,1,0))","v":1},{"$f":"IF('параметры заявки'!$D$13=\"пусто\",1,IF('параметры заявки'!$D$13='Исходные данные'!M32,1,0))","v":1},{"$f":"IF('параметры заявки'!$D$13=\"пусто\",1,IF('параметры заявки'!$D$13='Исходные данные'!N32,1,0))","v":1},{"$f":"IF('параметры заявки'!$D$13=\"пусто\",1,IF('параметры заявки'!$D$13='Исходные данные'!O32,1,0))","v":1},{"$f":"IF('параметры заявки'!$D$13=\"пусто\",1,IF('параметры заявки'!$D$13='Исходные данные'!P32,1,0))","v":1},{"$f":"IF('параметры заявки'!$D$13=\"пусто\",1,IF('параметры заявки'!$D$13='Исходные данные'!Q32,1,0))","v":1},{"$f":"IF('параметры заявки'!$D$13=\"пусто\",1,IF('параметры заявки'!$D$13='Исходные данные'!R32,1,0))","v":1},{"$f":"IF('параметры заявки'!$D$13=\"пусто\",1,IF('параметры заявки'!$D$13='Исходные данные'!S32,1,0))","v":1},{"$f":"IF('параметры заявки'!$D$13=\"пусто\",1,IF('параметры заявки'!$D$13='Исходные данные'!T32,1,0))","v":1},{"$f":"IF('параметры заявки'!$D$13=\"пусто\",1,IF('параметры заявки'!$D$13='Исходные данные'!U32,1,0))","v":1},{"$f":"IF('параметры заявки'!$D$13=\"пусто\",1,IF('параметры заявки'!$D$13='Исходные данные'!V32,1,0))","v":1},{"$f":"IF('параметры заявки'!$D$13=\"пусто\",1,IF('параметры заявки'!$D$13='Исходные данные'!W32,1,0))","v":1},{"$f":"IF('параметры заявки'!$D$13=\"пусто\",1,IF('параметры заявки'!$D$13='Исходные данные'!X32,1,0))","v":1},{"$f":"IF('параметры заявки'!$D$13=\"пусто\",1,IF('параметры заявки'!$D$13='Исходные данные'!Y32,1,0))","v":1},{"$f":"IF('параметры заявки'!$D$13=\"пусто\",1,IF('параметры заявки'!$D$13='Исходные данные'!Z32,1,0))","v":1},{"$f":"IF('параметры заявки'!$D$13=\"пусто\",1,IF('параметры заявки'!$D$13='Исходные данные'!AA32,1,0))","v":1},{"$f":"IF('параметры заявки'!$D$13=\"пусто\",1,IF('параметры заявки'!$D$13='Исходные данные'!AB32,1,0))","v":1},{"$f":"IF('параметры заявки'!$D$13=\"пусто\",1,IF('параметры заявки'!$D$13='Исходные данные'!AC32,1,0))","v":1},{"$f":"IF('параметры заявки'!$D$13=\"пусто\",1,IF('параметры заявки'!$D$13='Исходные данные'!AD32,1,0))","v":1},{"$f":"IF('параметры заявки'!$D$13=\"пусто\",1,IF('параметры заявки'!$D$13='Исходные данные'!AE32,1,0))","v":1},{"$f":"IF('параметры заявки'!$D$13=\"пусто\",1,IF('параметры заявки'!$D$13='Исходные данные'!AF32,1,0))","v":1},{"$f":"IF('параметры заявки'!$D$13=\"пусто\",1,IF('параметры заявки'!$D$13='Исходные данные'!AG32,1,0))","v":1},{"$f":"IF('параметры заявки'!$D$13=\"пусто\",1,IF('параметры заявки'!$D$13='Исходные данные'!AH32,1,0))","v":1},{"$f":"IF('параметры заявки'!$D$13=\"пусто\",1,IF('параметры заявки'!$D$13='Исходные данные'!AI32,1,0))","v":1},{"$f":"IF('параметры заявки'!$D$13=\"пусто\",1,IF('параметры заявки'!$D$13='Исходные данные'!AJ32,1,0))","v":1},{"$f":"IF('параметры заявки'!$D$13=\"пусто\",1,IF('параметры заявки'!$D$13='Исходные данные'!AK32,1,0))","v":1},{"$f":"IF('параметры заявки'!$D$13=\"пусто\",1,IF('параметры заявки'!$D$13='Исходные данные'!AL32,1,0))","v":1},{"$f":"IF('параметры заявки'!$D$13=\"пусто\",1,IF('параметры заявки'!$D$13='Исходные данные'!AM32,1,0))","v":1},{"$f":"IF('параметры заявки'!$D$13=\"пусто\",1,IF('параметры заявки'!$D$13='Исходные данные'!AN32,1,0))","v":1},{"$f":"IF('параметры заявки'!$D$13=\"пусто\",1,IF('параметры заявки'!$D$13='Исходные данные'!AO32,1,0))","v":1},{"$f":"IF('параметры заявки'!$D$13=\"пусто\",1,IF('параметры заявки'!$D$13='Исходные данные'!AP32,1,0))","v":1},{"$f":"IF('параметры заявки'!$D$13=\"пусто\",1,IF('параметры заявки'!$D$13='Исходные данные'!AQ32,1,0))","v":1},{"$f":"IF('параметры заявки'!$D$13=\"пусто\",1,IF('параметры заявки'!$D$13='Исходные данные'!AR32,1,0))","v":1},{"$f":"IF('параметры заявки'!$D$13=\"пусто\",1,IF('параметры заявки'!$D$13='Исходные данные'!AS32,1,0))","v":1},{"$f":"IF('параметры заявки'!$D$13=\"пусто\",1,IF('параметры заявки'!$D$13='Исходные данные'!AT32,1,0))","v":1},{"$f":"IF('параметры заявки'!$D$13=\"пусто\",1,IF('параметры заявки'!$D$13='Исходные данные'!AU32,1,0))","v":1},{"$f":"IF('параметры заявки'!$D$13=\"пусто\",1,IF('параметры заявки'!$D$13='Исходные данные'!AV32,1,0))","v":1},{"$f":"IF('параметры заявки'!$D$13=\"пусто\",1,IF('параметры заявки'!$D$13='Исходные данные'!AW32,1,0))","v":1},{"$f":"IF('параметры заявки'!$D$13=\"пусто\",1,IF('параметры заявки'!$D$13='Исходные данные'!AX32,1,0))","v":1},{"$f":"IF('параметры заявки'!$D$13=\"пусто\",1,IF('параметры заявки'!$D$13='Исходные данные'!AY32,1,0))","v":1},{"$f":"IF('параметры заявки'!$D$13=\"пусто\",1,IF('параметры заявки'!$D$13='Исходные данные'!AZ32,1,0))","v":1},{"$f":"IF('параметры заявки'!$D$13=\"пусто\",1,IF('параметры заявки'!$D$13='Исходные данные'!BA32,1,0))","v":1},{"$f":"IF('параметры заявки'!$D$13=\"пусто\",1,IF('параметры заявки'!$D$13='Исходные данные'!BB32,1,0))","v":1},{"$f":"IF('параметры заявки'!$D$13=\"пусто\",1,IF('параметры заявки'!$D$13='Исходные данные'!BC32,1,0))","v":1},{"$f":"IF('параметры заявки'!$D$13=\"пусто\",1,IF('параметры заявки'!$D$13='Исходные данные'!BD32,1,0))","v":1},{"$f":"IF('параметры заявки'!$D$13=\"пусто\",1,IF('параметры заявки'!$D$13='Исходные данные'!BE32,1,0))","v":1},{"$f":"IF('параметры заявки'!$D$13=\"пусто\",1,IF('параметры заявки'!$D$13='Исходные данные'!BF32,1,0))","v":1},{"$f":"IF('параметры заявки'!$D$13=\"пусто\",1,IF('параметры заявки'!$D$13='Исходные данные'!BG32,1,0))","v":1},{"$f":"IF('параметры заявки'!$D$13=\"пусто\",1,IF('параметры заявки'!$D$13='Исходные данные'!BH32,1,0))","v":1},{"$f":"IF('параметры заявки'!$D$13=\"пусто\",1,IF('параметры заявки'!$D$13='Исходные данные'!BI32,1,0))","v":1},{"$f":"IF('параметры заявки'!$D$13=\"пусто\",1,IF('параметры заявки'!$D$13='Исходные данные'!BJ32,1,0))","v":1},{"$f":"IF('параметры заявки'!$D$13=\"пусто\",1,IF('параметры заявки'!$D$13='Исходные данные'!BK32,1,0))","v":1},{"$f":"IF('параметры заявки'!$D$13=\"пусто\",1,IF('параметры заявки'!$D$13='Исходные данные'!BL32,1,0))","v":1},{"$f":"IF('параметры заявки'!$D$13=\"пусто\",1,IF('параметры заявки'!$D$13='Исходные данные'!BM32,1,0))","v":1},{"$f":"IF('параметры заявки'!$D$13=\"пусто\",1,IF('параметры заявки'!$D$13='Исходные данные'!BN32,1,0))","v":1},{"$f":"IF('параметры заявки'!$D$13=\"пусто\",1,IF('параметры заявки'!$D$13='Исходные данные'!BO32,1,0))","v":1},{"$f":"IF('параметры заявки'!$D$13=\"пусто\",1,IF('параметры заявки'!$D$13='Исходные данные'!BP32,1,0))","v":1},{"$f":"IF('параметры заявки'!$D$13=\"пусто\",1,IF('параметры заявки'!$D$13='Исходные данные'!BQ32,1,0))","v":1},{"$f":"IF('параметры заявки'!$D$13=\"пусто\",1,IF('параметры заявки'!$D$13='Исходные данные'!BR32,1,0))","v":1},{"$f":"IF('параметры заявки'!$D$13=\"пусто\",1,IF('параметры заявки'!$D$13='Исходные данные'!BS32,1,0))","v":1},{"$f":"IF('параметры заявки'!$D$13=\"пусто\",1,IF('параметры заявки'!$D$13='Исходные данные'!BT32,1,0))","v":1},{"$f":"IF('параметры заявки'!$D$13=\"пусто\",1,IF('параметры заявки'!$D$13='Исходные данные'!BU32,1,0))","v":1},{"$f":"IF('параметры заявки'!$D$13=\"пусто\",1,IF('параметры заявки'!$D$13='Исходные данные'!BV32,1,0))","v":1},{"$f":"IF('параметры заявки'!$D$13=\"пусто\",1,IF('параметры заявки'!$D$13='Исходные данные'!BW32,1,0))","v":1},{"$f":"IF('параметры заявки'!$D$13=\"пусто\",1,IF('параметры заявки'!$D$13='Исходные данные'!BX32,1,0))","v":1},{"$f":"IF('параметры заявки'!$D$13=\"пусто\",1,IF('параметры заявки'!$D$13='Исходные данные'!BY32,1,0))","v":1}]
[null,null,"Закрытый аукцион",{"$f":"IF('параметры заявки'!$D$14=\"пусто\",1,IF('параметры заявки'!$D$14='Исходные данные'!D33,1,0))","v":1},{"$f":"IF('параметры заявки'!$D$14=\"пусто\",1,IF('параметры заявки'!$D$14='Исходные данные'!E33,1,0))","v":1},{"$f":"IF('параметры заявки'!$D$14=\"пусто\",1,IF('параметры заявки'!$D$14='Исходные данные'!F33,1,0))","v":1},{"$f":"IF('параметры заявки'!$D$14=\"пусто\",1,IF('параметры заявки'!$D$14='Исходные данные'!G33,1,0))","v":1},{"$f":"IF('параметры заявки'!$D$14=\"пусто\",1,IF('параметры заявки'!$D$14='Исходные данные'!H33,1,0))","v":1},{"$f":"IF('параметры заявки'!$D$14=\"пусто\",1,IF('параметры заявки'!$D$14='Исходные данные'!I33,1,0))","v":1},{"$f":"IF('параметры заявки'!$D$14=\"пусто\",1,IF('параметры заявки'!$D$14='Исходные данные'!J33,1,0))","v":1},{"$f":"IF('параметры заявки'!$D$14=\"пусто\",1,IF('параметры заявки'!$D$14='Исходные данные'!K33,1,0))","v":1},{"$f":"IF('параметры заявки'!$D$14=\"пусто\",1,IF('параметры заявки'!$D$14='Исходные данные'!L33,1,0))","v":1},{"$f":"IF('параметры заявки'!$D$14=\"пусто\",1,IF('параметры заявки'!$D$14='Исходные данные'!M33,1,0))","v":1},{"$f":"IF('параметры заявки'!$D$14=\"пусто\",1,IF('параметры заявки'!$D$14='Исходные данные'!N33,1,0))","v":1},{"$f":"IF('параметры заявки'!$D$14=\"пусто\",1,IF('параметры заявки'!$D$14='Исходные данные'!O33,1,0))","v":1},{"$f":"IF('параметры заявки'!$D$14=\"пусто\",1,IF('параметры заявки'!$D$14='Исходные данные'!P33,1,0))","v":1},{"$f":"IF('параметры заявки'!$D$14=\"пусто\",1,IF('параметры заявки'!$D$14='Исходные данные'!Q33,1,0))","v":1},{"$f":"IF('параметры заявки'!$D$14=\"пусто\",1,IF('параметры заявки'!$D$14='Исходные данные'!R33,1,0))","v":1},{"$f":"IF('параметры заявки'!$D$14=\"пусто\",1,IF('параметры заявки'!$D$14='Исходные данные'!S33,1,0))","v":1},{"$f":"IF('параметры заявки'!$D$14=\"пусто\",1,IF('параметры заявки'!$D$14='Исходные данные'!T33,1,0))","v":1},{"$f":"IF('параметры заявки'!$D$14=\"пусто\",1,IF('параметры заявки'!$D$14='Исходные данные'!U33,1,0))","v":1},{"$f":"IF('параметры заявки'!$D$14=\"пусто\",1,IF('параметры заявки'!$D$14='Исходные данные'!V33,1,0))","v":1},{"$f":"IF('параметры заявки'!$D$14=\"пусто\",1,IF('параметры заявки'!$D$14='Исходные данные'!W33,1,0))","v":1},{"$f":"IF('параметры заявки'!$D$14=\"пусто\",1,IF('параметры заявки'!$D$14='Исходные данные'!X33,1,0))","v":1},{"$f":"IF('параметры заявки'!$D$14=\"пусто\",1,IF('параметры заявки'!$D$14='Исходные данные'!Y33,1,0))","v":1},{"$f":"IF('параметры заявки'!$D$14=\"пусто\",1,IF('параметры заявки'!$D$14='Исходные данные'!Z33,1,0))","v":1},{"$f":"IF('параметры заявки'!$D$14=\"пусто\",1,IF('параметры заявки'!$D$14='Исходные данные'!AA33,1,0))","v":1},{"$f":"IF('параметры заявки'!$D$14=\"пусто\",1,IF('параметры заявки'!$D$14='Исходные данные'!AB33,1,0))","v":1},{"$f":"IF('параметры заявки'!$D$14=\"пусто\",1,IF('параметры заявки'!$D$14='Исходные данные'!AC33,1,0))","v":1},{"$f":"IF('параметры заявки'!$D$14=\"пусто\",1,IF('параметры заявки'!$D$14='Исходные данные'!AD33,1,0))","v":1},{"$f":"IF('параметры заявки'!$D$14=\"пусто\",1,IF('параметры заявки'!$D$14='Исходные данные'!AE33,1,0))","v":1},{"$f":"IF('параметры заявки'!$D$14=\"пусто\",1,IF('параметры заявки'!$D$14='Исходные данные'!AF33,1,0))","v":1},{"$f":"IF('параметры заявки'!$D$14=\"пусто\",1,IF('параметры заявки'!$D$14='Исходные данные'!AG33,1,0))","v":1},{"$f":"IF('параметры заявки'!$D$14=\"пусто\",1,IF('параметры заявки'!$D$14='Исходные данные'!AH33,1,0))","v":1},{"$f":"IF('параметры заявки'!$D$14=\"пусто\",1,IF('параметры заявки'!$D$14='Исходные данные'!AI33,1,0))","v":1},{"$f":"IF('параметры заявки'!$D$14=\"пусто\",1,IF('параметры заявки'!$D$14='Исходные данные'!AJ33,1,0))","v":1},{"$f":"IF('параметры заявки'!$D$14=\"пусто\",1,IF('параметры заявки'!$D$14='Исходные данные'!AK33,1,0))","v":1},{"$f":"IF('параметры заявки'!$D$14=\"пусто\",1,IF('параметры заявки'!$D$14='Исходные данные'!AL33,1,0))","v":1},{"$f":"IF('параметры заявки'!$D$14=\"пусто\",1,IF('параметры заявки'!$D$14='Исходные данные'!AM33,1,0))","v":1},{"$f":"IF('параметры заявки'!$D$14=\"пусто\",1,IF('параметры заявки'!$D$14='Исходные данные'!AN33,1,0))","v":1},{"$f":"IF('параметры заявки'!$D$14=\"пусто\",1,IF('параметры заявки'!$D$14='Исходные данные'!AO33,1,0))","v":1},{"$f":"IF('параметры заявки'!$D$14=\"пусто\",1,IF('параметры заявки'!$D$14='Исходные данные'!AP33,1,0))","v":1},{"$f":"IF('параметры заявки'!$D$14=\"пусто\",1,IF('параметры заявки'!$D$14='Исходные данные'!AQ33,1,0))","v":1},{"$f":"IF('параметры заявки'!$D$14=\"пусто\",1,IF('параметры заявки'!$D$14='Исходные данные'!AR33,1,0))","v":1},{"$f":"IF('параметры заявки'!$D$14=\"пусто\",1,IF('параметры заявки'!$D$14='Исходные данные'!AS33,1,0))","v":1},{"$f":"IF('параметры заявки'!$D$14=\"пусто\",1,IF('параметры заявки'!$D$14='Исходные данные'!AT33,1,0))","v":1},{"$f":"IF('параметры заявки'!$D$14=\"пусто\",1,IF('параметры заявки'!$D$14='Исходные данные'!AU33,1,0))","v":1},{"$f":"IF('параметры заявки'!$D$14=\"пусто\",1,IF('параметры заявки'!$D$14='Исходные данные'!AV33,1,0))","v":1},{"$f":"IF('параметры заявки'!$D$14=\"пусто\",1,IF('параметры заявки'!$D$14='Исходные данные'!AW33,1,0))","v":1},{"$f":"IF('параметры заявки'!$D$14=\"пусто\",1,IF('параметры заявки'!$D$14='Исходные данные'!AX33,1,0))","v":1},{"$f":"IF('параметры заявки'!$D$14=\"пусто\",1,IF('параметры заявки'!$D$14='Исходные данные'!AY33,1,0))","v":1},{"$f":"IF('параметры заявки'!$D$14=\"пусто\",1,IF('параметры заявки'!$D$14='Исходные данные'!AZ33,1,0))","v":1},{"$f":"IF('параметры заявки'!$D$14=\"пусто\",1,IF('параметры заявки'!$D$14='Исходные данные'!BA33,1,0))","v":1},{"$f":"IF('параметры заявки'!$D$14=\"пусто\",1,IF('параметры заявки'!$D$14='Исходные данные'!BB33,1,0))","v":1},{"$f":"IF('параметры заявки'!$D$14=\"пусто\",1,IF('параметры заявки'!$D$14='Исходные данные'!BC33,1,0))","v":1},{"$f":"IF('параметры заявки'!$D$14=\"пусто\",1,IF('параметры заявки'!$D$14='Исходные данные'!BD33,1,0))","v":1},{"$f":"IF('параметры заявки'!$D$14=\"пусто\",1,IF('параметры заявки'!$D$14='Исходные данные'!BE33,1,0))","v":1},{"$f":"IF('параметры заявки'!$D$14=\"пусто\",1,IF('параметры заявки'!$D$14='Исходные данные'!BF33,1,0))","v":1},{"$f":"IF('параметры заявки'!$D$14=\"пусто\",1,IF('параметры заявки'!$D$14='Исходные данные'!BG33,1,0))","v":1},{"$f":"IF('параметры заявки'!$D$14=\"пусто\",1,IF('параметры заявки'!$D$14='Исходные данные'!BH33,1,0))","v":1},{"$f":"IF('параметры заявки'!$D$14=\"пусто\",1,IF('параметры заявки'!$D$14='Исходные данные'!BI33,1,0))","v":1},{"$f":"IF('параметры заявки'!$D$14=\"пусто\",1,IF('параметры заявки'!$D$14='Исходные данные'!BJ33,1,0))","v":1},{"$f":"IF('параметры заявки'!$D$14=\"пусто\",1,IF('параметры заявки'!$D$14='Исходные данные'!BK33,1,0))","v":1},{"$f":"IF('параметры заявки'!$D$14=\"пусто\",1,IF('параметры заявки'!$D$14='Исходные данные'!BL33,1,0))","v":1},{"$f":"IF('параметры заявки'!$D$14=\"пусто\",1,IF('параметры заявки'!$D$14='Исходные данные'!BM33,1,0))","v":1},{"$f":"IF('параметры заявки'!$D$14=\"пусто\",1,IF('параметры заявки'!$D$14='Исходные данные'!BN33,1,0))","v":1},{"$f":"IF('параметры заявки'!$D$14=\"пусто\",1,IF('параметры заявки'!$D$14='Исходные данные'!BO33,1,0))","v":1},{"$f":"IF('параметры заявки'!$D$14=\"пусто\",1,IF('параметры заявки'!$D$14='Исходные данные'!BP33,1,0))","v":1},{"$f":"IF('параметры заявки'!$D$14=\"пусто\",1,IF('параметры заявки'!$D$14='Исходные данные'!BQ33,1,0))","v":1},{"$f":"IF('параметры заявки'!$D$14=\"пусто\",1,IF('параметры заявки'!$D$14='Исходные данные'!BR33,1,0))","v":1},{"$f":"IF('параметры заявки'!$D$14=\"пусто\",1,IF('параметры заявки'!$D$14='Исходные данные'!BS33,1,0))","v":1},{"$f":"IF('параметры заявки'!$D$14=\"пусто\",1,IF('параметры заявки'!$D$14='Исходные данные'!BT33,1,0))","v":1},{"$f":"IF('параметры заявки'!$D$14=\"пусто\",1,IF('параметры заявки'!$D$14='Исходные данные'!BU33,1,0))","v":1},{"$f":"IF('параметры заявки'!$D$14=\"пусто\",1,IF('параметры заявки'!$D$14='Исходные данные'!BV33,1,0))","v":1},{"$f":"IF('параметры заявки'!$D$14=\"пусто\",1,IF('параметры заявки'!$D$14='Исходные данные'!BW33,1,0))","v":1},{"$f":"IF('параметры заявки'!$D$14=\"пусто\",1,IF('параметры заявки'!$D$14='Исходные данные'!BX33,1,0))","v":1},{"$f":"IF('параметры заявки'!$D$14=\"пусто\",1,IF('параметры заявки'!$D$14='Исходные данные'!BY33,1,0))","v":1}]
[null,null,"Многолот",{"$f":"IF('параметры заявки'!$D$15=\"пусто\",1,IF('параметры заявки'!$D$15='Исходные данные'!D34,1,0))","v":1},{"$f":"IF('параметры заявки'!$D$15=\"пусто\",1,IF('параметры заявки'!$D$15='Исходные данные'!E34,1,0))","v":1},{"$f":"IF('параметры заявки'!$D$15=\"пусто\",1,IF('параметры заявки'!$D$15='Исходные данные'!F34,1,0))","v":1},{"$f":"IF('параметры заявки'!$D$15=\"пусто\",1,IF('параметры заявки'!$D$15='Исходные данные'!G34,1,0))","v":1},{"$f":"IF('параметры заявки'!$D$15=\"пусто\",1,IF('параметры заявки'!$D$15='Исходные данные'!H34,1,0))","v":1},{"$f":"IF('параметры заявки'!$D$15=\"пусто\",1,IF('параметры заявки'!$D$15='Исходные данные'!I34,1,0))","v":1},{"$f":"IF('параметры заявки'!$D$15=\"пусто\",1,IF('параметры заявки'!$D$15='Исходные данные'!J34,1,0))","v":1},{"$f":"IF('параметры заявки'!$D$15=\"пусто\",1,IF('параметры заявки'!$D$15='Исходные данные'!K34,1,0))","v":1},{"$f":"IF('параметры заявки'!$D$15=\"пусто\",1,IF('параметры заявки'!$D$15='Исходные данные'!L34,1,0))","v":1},{"$f":"IF('параметры заявки'!$D$15=\"пусто\",1,IF('параметры заявки'!$D$15='Исходные данные'!M34,1,0))","v":1},{"$f":"IF('параметры заявки'!$D$15=\"пусто\",1,IF('параметры заявки'!$D$15='Исходные данные'!N34,1,0))","v":1},{"$f":"IF('параметры заявки'!$D$15=\"пусто\",1,IF('параметры заявки'!$D$15='Исходные данные'!O34,1,0))","v":1},{"$f":"IF('параметры заявки'!$D$15=\"пусто\",1,IF('параметры заявки'!$D$15='Исходные данные'!P34,1,0))","v":1},{"$f":"IF('параметры заявки'!$D$15=\"пусто\",1,IF('параметры заявки'!$D$15='Исходные данные'!Q34,1,0))","v":1},{"$f":"IF('параметры заявки'!$D$15=\"пусто\",1,IF('параметры заявки'!$D$15='Исходные данные'!R34,1,0))","v":1},{"$f":"IF('параметры заявки'!$D$15=\"пусто\",1,IF('параметры заявки'!$D$15='Исходные данные'!S34,1,0))","v":1},{"$f":"IF('параметры заявки'!$D$15=\"пусто\",1,IF('параметры заявки'!$D$15='Исходные данные'!T34,1,0))","v":1},{"$f":"IF('параметры заявки'!$D$15=\"пусто\",1,IF('параметры заявки'!$D$15='Исходные данные'!U34,1,0))","v":1},{"$f":"IF('параметры заявки'!$D$15=\"пусто\",1,IF('параметры заявки'!$D$15='Исходные данные'!V34,1,0))","v":1},{"$f":"IF('параметры заявки'!$D$15=\"пусто\",1,IF('параметры заявки'!$D$15='Исходные данные'!W34,1,0))","v":1},{"$f":"IF('параметры заявки'!$D$15=\"пусто\",1,IF('параметры заявки'!$D$15='Исходные данные'!X34,1,0))","v":1},{"$f":"IF('параметры заявки'!$D$15=\"пусто\",1,IF('параметры заявки'!$D$15='Исходные данные'!Y34,1,0))","v":1},{"$f":"IF('параметры заявки'!$D$15=\"пусто\",1,IF('параметры заявки'!$D$15='Исходные данные'!Z34,1,0))","v":1},{"$f":"IF('параметры заявки'!$D$15=\"пусто\",1,IF('параметры заявки'!$D$15='Исходные данные'!AA34,1,0))","v":1},{"$f":"IF('параметры заявки'!$D$15=\"пусто\",1,IF('параметры заявки'!$D$15='Исходные данные'!AB34,1,0))","v":1},{"$f":"IF('параметры заявки'!$D$15=\"пусто\",1,IF('параметры заявки'!$D$15='Исходные данные'!AC34,1,0))","v":1},{"$f":"IF('параметры заявки'!$D$15=\"пусто\",1,IF('параметры заявки'!$D$15='Исходные данные'!AD34,1,0))","v":1},{"$f":"IF('параметры заявки'!$D$15=\"пусто\",1,IF('параметры заявки'!$D$15='Исходные данные'!AE34,1,0))","v":1},{"$f":"IF('параметры заявки'!$D$15=\"пусто\",1,IF('параметры заявки'!$D$15='Исходные данные'!AF34,1,0))","v":1},{"$f":"IF('параметры заявки'!$D$15=\"пусто\",1,IF('параметры заявки'!$D$15='Исходные данные'!AG34,1,0))","v":1},{"$f":"IF('параметры заявки'!$D$15=\"пусто\",1,IF('параметры заявки'!$D$15='Исходные данные'!AH34,1,0))","v":1},{"$f":"IF('параметры заявки'!$D$15=\"пусто\",1,IF('параметры заявки'!$D$15='Исходные данные'!AI34,1,0))","v":1},{"$f":"IF('параметры заявки'!$D$15=\"пусто\",1,IF('параметры заявки'!$D$15='Исходные данные'!AJ34,1,0))","v":1},{"$f":"IF('параметры заявки'!$D$15=\"пусто\",1,IF('параметры заявки'!$D$15='Исходные данные'!AK34,1,0))","v":1},{"$f":"IF('параметры заявки'!$D$15=\"пусто\",1,IF('параметры заявки'!$D$15='Исходные данные'!AL34,1,0))","v":1},{"$f":"IF('параметры заявки'!$D$15=\"пусто\",1,IF('параметры заявки'!$D$15='Исходные данные'!AM34,1,0))","v":1},{"$f":"IF('параметры заявки'!$D$15=\"пусто\",1,IF('параметры заявки'!$D$15='Исходные данные'!AN34,1,0))","v":1},{"$f":"IF('параметры заявки'!$D$15=\"пусто\",1,IF('параметры заявки'!$D$15='Исходные данные'!AO34,1,0))","v":1},{"$f":"IF('параметры заявки'!$D$15=\"пусто\",1,IF('параметры заявки'!$D$15='Исходные данные'!AP34,1,0))","v":1},{"$f":"IF('параметры заявки'!$D$15=\"пусто\",1,IF('параметры заявки'!$D$15='Исходные данные'!AQ34,1,0))","v":1},{"$f":"IF('параметры заявки'!$D$15=\"пусто\",1,IF('параметры заявки'!$D$15='Исходные данные'!AR34,1,0))","v":1},{"$f":"IF('параметры заявки'!$D$15=\"пусто\",1,IF('параметры заявки'!$D$15='Исходные данные'!AS34,1,0))","v":1},{"$f":"IF('параметры заявки'!$D$15=\"пусто\",1,IF('параметры заявки'!$D$15='Исходные данные'!AT34,1,0))","v":1},{"$f":"IF('параметры заявки'!$D$15=\"пусто\",1,IF('параметры заявки'!$D$15='Исходные данные'!AU34,1,0))","v":1},{"$f":"IF('параметры заявки'!$D$15=\"пусто\",1,IF('параметры заявки'!$D$15='Исходные данные'!AV34,1,0))","v":1},{"$f":"IF('параметры заявки'!$D$15=\"пусто\",1,IF('параметры заявки'!$D$15='Исходные данные'!AW34,1,0))","v":1},{"$f":"IF('параметры заявки'!$D$15=\"пусто\",1,IF('параметры заявки'!$D$15='Исходные данные'!AX34,1,0))","v":1},{"$f":"IF('параметры заявки'!$D$15=\"пусто\",1,IF('параметры заявки'!$D$15='Исходные данные'!AY34,1,0))","v":1},{"$f":"IF('параметры заявки'!$D$15=\"пусто\",1,IF('параметры заявки'!$D$15='Исходные данные'!AZ34,1,0))","v":1},{"$f":"IF('параметры заявки'!$D$15=\"пусто\",1,IF('параметры заявки'!$D$15='Исходные данные'!BA34,1,0))","v":1},{"$f":"IF('параметры заявки'!$D$15=\"пусто\",1,IF('параметры заявки'!$D$15='Исходные данные'!BB34,1,0))","v":1},{"$f":"IF('параметры заявки'!$D$15=\"пусто\",1,IF('параметры заявки'!$D$15='Исходные данные'!BC34,1,0))","v":1},{"$f":"IF('параметры заявки'!$D$15=\"пусто\",1,IF('параметры заявки'!$D$15='Исходные данные'!BD34,1,0))","v":1},{"$f":"IF('параметры заявки'!$D$15=\"пусто\",1,IF('параметры заявки'!$D$15='Исходные данные'!BE34,1,0))","v":1},{"$f":"IF('параметры заявки'!$D$15=\"пусто\",1,IF('параметры заявки'!$D$15='Исходные данные'!BF34,1,0))","v":1},{"$f":"IF('параметры заявки'!$D$15=\"пусто\",1,IF('параметры заявки'!$D$15='Исходные данные'!BG34,1,0))","v":1},{"$f":"IF('параметры заявки'!$D$15=\"пусто\",1,IF('параметры заявки'!$D$15='Исходные данные'!BH34,1,0))","v":1},{"$f":"IF('параметры заявки'!$D$15=\"пусто\",1,IF('параметры заявки'!$D$15='Исходные данные'!BI34,1,0))","v":1},{"$f":"IF('параметры заявки'!$D$15=\"пусто\",1,IF('параметры заявки'!$D$15='Исходные данные'!BJ34,1,0))","v":1},{"$f":"IF('параметры заявки'!$D$15=\"пусто\",1,IF('параметры заявки'!$D$15='Исходные данные'!BK34,1,0))","v":1},{"$f":"IF('параметры заявки'!$D$15=\"пусто\",1,IF('параметры заявки'!$D$15='Исходные данные'!BL34,1,0))","v":1},{"$f":"IF('параметры заявки'!$D$15=\"пусто\",1,IF('параметры заявки'!$D$15='Исходные данные'!BM34,1,0))","v":1},{"$f":"IF('параметры заявки'!$D$15=\"пусто\",1,IF('параметры заявки'!$D$15='Исходные данные'!BN34,1,0))","v":1},{"$f":"IF('параметры заявки'!$D$15=\"пусто\",1,IF('параметры заявки'!$D$15='Исходные данные'!BO34,1,0))","v":1},{"$f":"IF('параметры заявки'!$D$15=\"пусто\",1,IF('параметры заявки'!$D$15='Исходные данные'!BP34,1,0))","v":1},{"$f":"IF('параметры заявки'!$D$15=\"пусто\",1,IF('параметры заявки'!$D$15='Исходные данные'!BQ34,1,0))","v":1},{"$f":"IF('параметры заявки'!$D$15=\"пусто\",1,IF('параметры заявки'!$D$15='Исходные данные'!BR34,1,0))","v":1},{"$f":"IF('параметры заявки'!$D$15=\"пусто\",1,IF('параметры заявки'!$D$15='Исходные данные'!BS34,1,0))","v":1},{"$f":"IF('параметры заявки'!$D$15=\"пусто\",1,IF('параметры заявки'!$D$15='Исходные данные'!BT34,1,0))","v":1},{"$f":"IF('параметры заявки'!$D$15=\"пусто\",1,IF('параметры заявки'!$D$15='Исходные данные'!BU34,1,0))","v":1},{"$f":"IF('параметры заявки'!$D$15=\"пусто\",1,IF('параметры заявки'!$D$15='Исходные данные'!BV34,1,0))","v":1},{"$f":"IF('параметры заявки'!$D$15=\"пусто\",1,IF('параметры заявки'!$D$15='Исходные данные'!BW34,1,0))","v":1},{"$f":"IF('параметры заявки'!$D$15=\"пусто\",1,IF('параметры заявки'!$D$15='Исходные данные'!BX34,1,0))","v":1},{"$f":"IF('параметры заявки'!$D$15=\"пусто\",1,IF('параметры заявки'!$D$15='Исходные данные'!BY34,1,0))","v":1}]
[null,null,"Переобеспечение (продление сроков)",{"$f":"IF('параметры заявки'!$D$16=\"пусто\",1,IF('параметры заявки'!$D$16='Исходные данные'!D35,1,0))","v":1},{"$f":"IF('параметры заявки'!$D$16=\"пусто\",1,IF('параметры заявки'!$D$16='Исходные данные'!E35,1,0))","v":1},{"$f":"IF('параметры заявки'!$D$16=\"пусто\",1,IF('параметры заявки'!$D$16='Исходные данные'!F35,1,0))","v":1},{"$f":"IF('параметры заявки'!$D$16=\"пусто\",1,IF('параметры заявки'!$D$16='Исходные данные'!G35,1,0))","v":1},{"$f":"IF('параметры заявки'!$D$16=\"пусто\",1,IF('параметры заявки'!$D$16='Исходные данные'!H35,1,0))","v":1},{"$f":"IF('параметры заявки'!$D$16=\"пусто\",1,IF('параметры заявки'!$D$16='Исходные данные'!I35,1,0))","v":1},{"$f":"IF('параметры заявки'!$D$16=\"пусто\",1,IF('параметры заявки'!$D$16='Исходные данные'!J35,1,0))","v":1},{"$f":"IF('параметры заявки'!$D$16=\"пусто\",1,IF('параметры заявки'!$D$16='Исходные данные'!K35,1,0))","v":1},{"$f":"IF('параметры заявки'!$D$16=\"пусто\",1,IF('параметры заявки'!$D$16='Исходные данные'!L35,1,0))","v":1},{"$f":"IF('параметры заявки'!$D$16=\"пусто\",1,IF('параметры заявки'!$D$16='Исходные данные'!M35,1,0))","v":1},{"$f":"IF('параметры заявки'!$D$16=\"пусто\",1,IF('параметры заявки'!$D$16='Исходные данные'!N35,1,0))","v":1},{"$f":"IF('параметры заявки'!$D$16=\"пусто\",1,IF('параметры заявки'!$D$16='Исходные данные'!O35,1,0))","v":1},{"$f":"IF('параметры заявки'!$D$16=\"пусто\",1,IF('параметры заявки'!$D$16='Исходные данные'!P35,1,0))","v":1},{"$f":"IF('параметры заявки'!$D$16=\"пусто\",1,IF('параметры заявки'!$D$16='Исходные данные'!Q35,1,0))","v":1},{"$f":"IF('параметры заявки'!$D$16=\"пусто\",1,IF('параметры заявки'!$D$16='Исходные данные'!R35,1,0))","v":1},{"$f":"IF('параметры заявки'!$D$16=\"пусто\",1,IF('параметры заявки'!$D$16='Исходные данные'!S35,1,0))","v":1},{"$f":"IF('параметры заявки'!$D$16=\"пусто\",1,IF('параметры заявки'!$D$16='Исходные данные'!T35,1,0))","v":1},{"$f":"IF('параметры заявки'!$D$16=\"пусто\",1,IF('параметры заявки'!$D$16='Исходные данные'!U35,1,0))","v":1},{"$f":"IF('параметры заявки'!$D$16=\"пусто\",1,IF('параметры заявки'!$D$16='Исходные данные'!V35,1,0))","v":1},{"$f":"IF('параметры заявки'!$D$16=\"пусто\",1,IF('параметры заявки'!$D$16='Исходные данные'!W35,1,0))","v":1},{"$f":"IF('параметры заявки'!$D$16=\"пусто\",1,IF('параметры заявки'!$D$16='Исходные данные'!X35,1,0))","v":1},{"$f":"IF('параметры заявки'!$D$16=\"пусто\",1,IF('параметры заявки'!$D$16='Исходные данные'!Y35,1,0))","v":1},{"$f":"IF('параметры заявки'!$D$16=\"пусто\",1,IF('параметры заявки'!$D$16='Исходные данные'!Z35,1,0))","v":1},{"$f":"IF('параметры заявки'!$D$16=\"пусто\",1,IF('параметры заявки'!$D$16='Исходные данные'!AA35,1,0))","v":1},{"$f":"IF('параметры заявки'!$D$16=\"пусто\",1,IF('параметры заявки'!$D$16='Исходные данные'!AB35,1,0))","v":1},{"$f":"IF('параметры заявки'!$D$16=\"пусто\",1,IF('параметры заявки'!$D$16='Исходные данные'!AC35,1,0))","v":1},{"$f":"IF('параметры заявки'!$D$16=\"пусто\",1,IF('параметры заявки'!$D$16='Исходные данные'!AD35,1,0))","v":1},{"$f":"IF('параметры заявки'!$D$16=\"пусто\",1,IF('параметры заявки'!$D$16='Исходные данные'!AE35,1,0))","v":1},{"$f":"IF('параметры заявки'!$D$16=\"пусто\",1,IF('параметры заявки'!$D$16='Исходные данные'!AF35,1,0))","v":1},{"$f":"IF('параметры заявки'!$D$16=\"пусто\",1,IF('параметры заявки'!$D$16='Исходные данные'!AG35,1,0))","v":1},{"$f":"IF('параметры заявки'!$D$16=\"пусто\",1,IF('параметры заявки'!$D$16='Исходные данные'!AH35,1,0))","v":1},{"$f":"IF('параметры заявки'!$D$16=\"пусто\",1,IF('параметры заявки'!$D$16='Исходные данные'!AI35,1,0))","v":1},{"$f":"IF('параметры заявки'!$D$16=\"пусто\",1,IF('параметры заявки'!$D$16='Исходные данные'!AJ35,1,0))","v":1},{"$f":"IF('параметры заявки'!$D$16=\"пусто\",1,IF('параметры заявки'!$D$16='Исходные данные'!AK35,1,0))","v":1},{"$f":"IF('параметры заявки'!$D$16=\"пусто\",1,IF('параметры заявки'!$D$16='Исходные данные'!AL35,1,0))","v":1},{"$f":"IF('параметры заявки'!$D$16=\"пусто\",1,IF('параметры заявки'!$D$16='Исходные данные'!AM35,1,0))","v":1},{"$f":"IF('параметры заявки'!$D$16=\"пусто\",1,IF('параметры заявки'!$D$16='Исходные данные'!AN35,1,0))","v":1},{"$f":"IF('параметры заявки'!$D$16=\"пусто\",1,IF('параметры заявки'!$D$16='Исходные данные'!AO35,1,0))","v":1},{"$f":"IF('параметры заявки'!$D$16=\"пусто\",1,IF('параметры заявки'!$D$16='Исходные данные'!AP35,1,0))","v":1},{"$f":"IF('параметры заявки'!$D$16=\"пусто\",1,IF('параметры заявки'!$D$16='Исходные данные'!AQ35,1,0))","v":1},{"$f":"IF('параметры заявки'!$D$16=\"пусто\",1,IF('параметры заявки'!$D$16='Исходные данные'!AR35,1,0))","v":1},{"$f":"IF('параметры заявки'!$D$16=\"пусто\",1,IF('параметры заявки'!$D$16='Исходные данные'!AS35,1,0))","v":1},{"$f":"IF('параметры заявки'!$D$16=\"пусто\",1,IF('параметры заявки'!$D$16='Исходные данные'!AT35,1,0))","v":1},{"$f":"IF('параметры заявки'!$D$16=\"пусто\",1,IF('параметры заявки'!$D$16='Исходные данные'!AU35,1,0))","v":1},{"$f":"IF('параметры заявки'!$D$16=\"пусто\",1,IF('параметры заявки'!$D$16='Исходные данные'!AV35,1,0))","v":1},{"$f":"IF('параметры заявки'!$D$16=\"пусто\",1,IF('параметры заявки'!$D$16='Исходные данные'!AW35,1,0))","v":1},{"$f":"IF('параметры заявки'!$D$16=\"пусто\",1,IF('параметры заявки'!$D$16='Исходные данные'!AX35,1,0))","v":1},{"$f":"IF('параметры заявки'!$D$16=\"пусто\",1,IF('параметры заявки'!$D$16='Исходные данные'!AY35,1,0))","v":1},{"$f":"IF('параметры заявки'!$D$16=\"пусто\",1,IF('параметры заявки'!$D$16='Исходные данные'!AZ35,1,0))","v":1},{"$f":"IF('параметры заявки'!$D$16=\"пусто\",1,IF('параметры заявки'!$D$16='Исходные данные'!BA35,1,0))","v":1},{"$f":"IF('параметры заявки'!$D$16=\"пусто\",1,IF('параметры заявки'!$D$16='Исходные данные'!BB35,1,0))","v":1},{"$f":"IF('параметры заявки'!$D$16=\"пусто\",1,IF('параметры заявки'!$D$16='Исходные данные'!BC35,1,0))","v":1},{"$f":"IF('параметры заявки'!$D$16=\"пусто\",1,IF('параметры заявки'!$D$16='Исходные данные'!BD35,1,0))","v":1},{"$f":"IF('параметры заявки'!$D$16=\"пусто\",1,IF('параметры заявки'!$D$16='Исходные данные'!BE35,1,0))","v":1},{"$f":"IF('параметры заявки'!$D$16=\"пусто\",1,IF('параметры заявки'!$D$16='Исходные данные'!BF35,1,0))","v":1},{"$f":"IF('параметры заявки'!$D$16=\"пусто\",1,IF('параметры заявки'!$D$16='Исходные данные'!BG35,1,0))","v":1},{"$f":"IF('параметры заявки'!$D$16=\"пусто\",1,IF('параметры заявки'!$D$16='Исходные данные'!BH35,1,0))","v":1},{"$f":"IF('параметры заявки'!$D$16=\"пусто\",1,IF('параметры заявки'!$D$16='Исходные данные'!BI35,1,0))","v":1},{"$f":"IF('параметры заявки'!$D$16=\"пусто\",1,IF('параметры заявки'!$D$16='Исходные данные'!BJ35,1,0))","v":1},{"$f":"IF('параметры заявки'!$D$16=\"пусто\",1,IF('параметры заявки'!$D$16='Исходные данные'!BK35,1,0))","v":1},{"$f":"IF('параметры заявки'!$D$16=\"пусто\",1,IF('параметры заявки'!$D$16='Исходные данные'!BL35,1,0))","v":1},{"$f":"IF('параметры заявки'!$D$16=\"пусто\",1,IF('параметры заявки'!$D$16='Исходные данные'!BM35,1,0))","v":1},{"$f":"IF('параметры заявки'!$D$16=\"пусто\",1,IF('параметры заявки'!$D$16='Исходные данные'!BN35,1,0))","v":1},{"$f":"IF('параметры заявки'!$D$16=\"пусто\",1,IF('параметры заявки'!$D$16='Исходные данные'!BO35,1,0))","v":1},{"$f":"IF('параметры заявки'!$D$16=\"пусто\",1,IF('параметры заявки'!$D$16='Исходные данные'!BP35,1,0))","v":1},{"$f":"IF('параметры заявки'!$D$16=\"пусто\",1,IF('параметры заявки'!$D$16='Исходные данные'!BQ35,1,0))","v":1},{"$f":"IF('параметры заявки'!$D$16=\"пусто\",1,IF('параметры заявки'!$D$16='Исходные данные'!BR35,1,0))","v":1},{"$f":"IF('параметры заявки'!$D$16=\"пусто\",1,IF('параметры заявки'!$D$16='Исходные данные'!BS35,1,0))","v":1},{"$f":"IF('параметры заявки'!$D$16=\"пусто\",1,IF('параметры заявки'!$D$16='Исходные данные'!BT35,1,0))","v":1},{"$f":"IF('параметры заявки'!$D$16=\"пусто\",1,IF('параметры заявки'!$D$16='Исходные данные'!BU35,1,0))","v":1},{"$f":"IF('параметры заявки'!$D$16=\"пусто\",1,IF('параметры заявки'!$D$16='Исходные данные'!BV35,1,0))","v":1},{"$f":"IF('параметры заявки'!$D$16=\"пусто\",1,IF('параметры заявки'!$D$16='Исходные данные'!BW35,1,0))","v":1},{"$f":"IF('параметры заявки'!$D$16=\"пусто\",1,IF('параметры заявки'!$D$16='Исходные данные'!BX35,1,0))","v":1},{"$f":"IF('параметры заявки'!$D$16=\"пусто\",1,IF('параметры заявки'!$D$16='Исходные данные'!BY35,1,0))","v":1}]
[null,null,"Требование к пакету документов до 1 млн.руб",{"$f":"IF('параметры заявки'!$D$17=\"пусто\",1,IF('параметры заявки'!$D$17='Исходные данные'!D36,1,0))","v":1},{"$f":"IF('параметры заявки'!$D$17=\"пусто\",1,IF('параметры заявки'!$D$17='Исходные данные'!E36,1,0))","v":1},{"$f":"IF('параметры заявки'!$D$17=\"пусто\",1,IF('параметры заявки'!$D$17='Исходные данные'!F36,1,0))","v":1},{"$f":"IF('параметры заявки'!$D$17=\"пусто\",1,IF('параметры заявки'!$D$17='Исходные данные'!G36,1,0))","v":1},{"$f":"IF('параметры заявки'!$D$17=\"пусто\",1,IF('параметры заявки'!$D$17='Исходные данные'!H36,1,0))","v":1},{"$f":"IF('параметры заявки'!$D$17=\"пусто\",1,IF('параметры заявки'!$D$17='Исходные данные'!I36,1,0))","v":1},{"$f":"IF('параметры заявки'!$D$17=\"пусто\",1,IF('параметры заявки'!$D$17='Исходные данные'!J36,1,0))","v":1},{"$f":"IF('параметры заявки'!$D$17=\"пусто\",1,IF('параметры заявки'!$D$17='Исходные данные'!K36,1,0))","v":1},{"$f":"IF('параметры заявки'!$D$17=\"пусто\",1,IF('параметры заявки'!$D$17='Исходные данные'!L36,1,0))","v":1},{"$f":"IF('параметры заявки'!$D$17=\"пусто\",1,IF('параметры заявки'!$D$17='Исходные данные'!M36,1,0))","v":1},{"$f":"IF('параметры заявки'!$D$17=\"пусто\",1,IF('параметры заявки'!$D$17='Исходные данные'!N36,1,0))","v":1},{"$f":"IF('параметры заявки'!$D$17=\"пусто\",1,IF('параметры заявки'!$D$17='Исходные данные'!O36,1,0))","v":1},{"$f":"IF('параметры заявки'!$D$17=\"пусто\",1,IF('параметры заявки'!$D$17='Исходные данные'!P36,1,0))","v":1},{"$f":"IF('параметры заявки'!$D$17=\"пусто\",1,IF('параметры заявки'!$D$17='Исходные данные'!Q36,1,0))","v":1},{"$f":"IF('параметры заявки'!$D$17=\"пусто\",1,IF('параметры заявки'!$D$17='Исходные данные'!R36,1,0))","v":1},{"$f":"IF('параметры заявки'!$D$17=\"пусто\",1,IF('параметры заявки'!$D$17='Исходные данные'!S36,1,0))","v":1},{"$f":"IF('параметры заявки'!$D$17=\"пусто\",1,IF('параметры заявки'!$D$17='Исходные данные'!T36,1,0))","v":1},{"$f":"IF('параметры заявки'!$D$17=\"пусто\",1,IF('параметры заявки'!$D$17='Исходные данные'!U36,1,0))","v":1},{"$f":"IF('параметры заявки'!$D$17=\"пусто\",1,IF('параметры заявки'!$D$17='Исходные данные'!V36,1,0))","v":1},{"$f":"IF('параметры заявки'!$D$17=\"пусто\",1,IF('параметры заявки'!$D$17='Исходные данные'!W36,1,0))","v":1},{"$f":"IF('параметры заявки'!$D$17=\"пусто\",1,IF('параметры заявки'!$D$17='Исходные данные'!X36,1,0))","v":1},{"$f":"IF('параметры заявки'!$D$17=\"пусто\",1,IF('параметры заявки'!$D$17='Исходные данные'!Y36,1,0))","v":1},{"$f":"IF('параметры заявки'!$D$17=\"пусто\",1,IF('параметры заявки'!$D$17='Исходные данные'!Z36,1,0))","v":1},{"$f":"IF('параметры заявки'!$D$17=\"пусто\",1,IF('параметры заявки'!$D$17='Исходные данные'!AA36,1,0))","v":1},{"$f":"IF('параметры заявки'!$D$17=\"пусто\",1,IF('параметры заявки'!$D$17='Исходные данные'!AB36,1,0))","v":1},{"$f":"IF('параметры заявки'!$D$17=\"пусто\",1,IF('параметры заявки'!$D$17='Исходные данные'!AC36,1,0))","v":1},{"$f":"IF('параметры заявки'!$D$17=\"пусто\",1,IF('параметры заявки'!$D$17='Исходные данные'!AD36,1,0))","v":1},{"$f":"IF('параметры заявки'!$D$17=\"пусто\",1,IF('параметры заявки'!$D$17='Исходные данные'!AE36,1,0))","v":1},{"$f":"IF('параметры заявки'!$D$17=\"пусто\",1,IF('параметры заявки'!$D$17='Исходные данные'!AF36,1,0))","v":1},{"$f":"IF('параметры заявки'!$D$17=\"пусто\",1,IF('параметры заявки'!$D$17='Исходные данные'!AG36,1,0))","v":1},{"$f":"IF('параметры заявки'!$D$17=\"пусто\",1,IF('параметры заявки'!$D$17='Исходные данные'!AH36,1,0))","v":1},{"$f":"IF('параметры заявки'!$D$17=\"пусто\",1,IF('параметры заявки'!$D$17='Исходные данные'!AI36,1,0))","v":1},{"$f":"IF('параметры заявки'!$D$17=\"пусто\",1,IF('параметры заявки'!$D$17='Исходные данные'!AJ36,1,0))","v":1},{"$f":"IF('параметры заявки'!$D$17=\"пусто\",1,IF('параметры заявки'!$D$17='Исходные данные'!AK36,1,0))","v":1},{"$f":"IF('параметры заявки'!$D$17=\"пусто\",1,IF('параметры заявки'!$D$17='Исходные данные'!AL36,1,0))","v":1},{"$f":"IF('параметры заявки'!$D$17=\"пусто\",1,IF('параметры заявки'!$D$17='Исходные данные'!AM36,1,0))","v":1},{"$f":"IF('параметры заявки'!$D$17=\"пусто\",1,IF('параметры заявки'!$D$17='Исходные данные'!AN36,1,0))","v":1},{"$f":"IF('параметры заявки'!$D$17=\"пусто\",1,IF('параметры заявки'!$D$17='Исходные данные'!AO36,1,0))","v":1},{"$f":"IF('параметры заявки'!$D$17=\"пусто\",1,IF('параметры заявки'!$D$17='Исходные данные'!AP36,1,0))","v":1},{"$f":"IF('параметры заявки'!$D$17=\"пусто\",1,IF('параметры заявки'!$D$17='Исходные данные'!AQ36,1,0))","v":1},{"$f":"IF('параметры заявки'!$D$17=\"пусто\",1,IF('параметры заявки'!$D$17='Исходные данные'!AR36,1,0))","v":1},{"$f":"IF('параметры заявки'!$D$17=\"пусто\",1,IF('параметры заявки'!$D$17='Исходные данные'!AS36,1,0))","v":1},{"$f":"IF('параметры заявки'!$D$17=\"пусто\",1,IF('параметры заявки'!$D$17='Исходные данные'!AT36,1,0))","v":1},{"$f":"IF('параметры заявки'!$D$17=\"пусто\",1,IF('параметры заявки'!$D$17='Исходные данные'!AU36,1,0))","v":1},{"$f":"IF('параметры заявки'!$D$17=\"пусто\",1,IF('параметры заявки'!$D$17='Исходные данные'!AV36,1,0))","v":1},{"$f":"IF('параметры заявки'!$D$17=\"пусто\",1,IF('параметры заявки'!$D$17='Исходные данные'!AW36,1,0))","v":1},{"$f":"IF('параметры заявки'!$D$17=\"пусто\",1,IF('параметры заявки'!$D$17='Исходные данные'!AX36,1,0))","v":1},{"$f":"IF('параметры заявки'!$D$17=\"пусто\",1,IF('параметры заявки'!$D$17='Исходные данные'!AY36,1,0))","v":1},{"$f":"IF('параметры заявки'!$D$17=\"пусто\",1,IF('параметры заявки'!$D$17='Исходные данные'!AZ36,1,0))","v":1},{"$f":"IF('параметры заявки'!$D$17=\"пусто\",1,IF('параметры заявки'!$D$17='Исходные данные'!BA36,1,0))","v":1},{"$f":"IF('параметры заявки'!$D$17=\"пусто\",1,IF('параметры заявки'!$D$17='Исходные данные'!BB36,1,0))","v":1},{"$f":"IF('параметры заявки'!$D$17=\"пусто\",1,IF('параметры заявки'!$D$17='Исходные данные'!BC36,1,0))","v":1},{"$f":"IF('параметры заявки'!$D$17=\"пусто\",1,IF('параметры заявки'!$D$17='Исходные данные'!BD36,1,0))","v":1},{"$f":"IF('параметры заявки'!$D$17=\"пусто\",1,IF('параметры заявки'!$D$17='Исходные данные'!BE36,1,0))","v":1},{"$f":"IF('параметры заявки'!$D$17=\"пусто\",1,IF('параметры заявки'!$D$17='Исходные данные'!BF36,1,0))","v":1},{"$f":"IF('параметры заявки'!$D$17=\"пусто\",1,IF('параметры заявки'!$D$17='Исходные данные'!BG36,1,0))","v":1},{"$f":"IF('параметры заявки'!$D$17=\"пусто\",1,IF('параметры заявки'!$D$17='Исходные данные'!BH36,1,0))","v":1},{"$f":"IF('параметры заявки'!$D$17=\"пусто\",1,IF('параметры заявки'!$D$17='Исходные данные'!BI36,1,0))","v":1},{"$f":"IF('параметры заявки'!$D$17=\"пусто\",1,IF('параметры заявки'!$D$17='Исходные данные'!BJ36,1,0))","v":1},{"$f":"IF('параметры заявки'!$D$17=\"пусто\",1,IF('параметры заявки'!$D$17='Исходные данные'!BK36,1,0))","v":1},{"$f":"IF('параметры заявки'!$D$17=\"пусто\",1,IF('параметры заявки'!$D$17='Исходные данные'!BL36,1,0))","v":1},{"$f":"IF('параметры заявки'!$D$17=\"пусто\",1,IF('параметры заявки'!$D$17='Исходные данные'!BM36,1,0))","v":1},{"$f":"IF('параметры заявки'!$D$17=\"пусто\",1,IF('параметры заявки'!$D$17='Исходные данные'!BN36,1,0))","v":1},{"$f":"IF('параметры заявки'!$D$17=\"пусто\",1,IF('параметры заявки'!$D$17='Исходные данные'!BO36,1,0))","v":1},{"$f":"IF('параметры заявки'!$D$17=\"пусто\",1,IF('параметры заявки'!$D$17='Исходные данные'!BP36,1,0))","v":1},{"$f":"IF('параметры заявки'!$D$17=\"пусто\",1,IF('параметры заявки'!$D$17='Исходные данные'!BQ36,1,0))","v":1},{"$f":"IF('параметры заявки'!$D$17=\"пусто\",1,IF('параметры заявки'!$D$17='Исходные данные'!BR36,1,0))","v":1},{"$f":"IF('параметры заявки'!$D$17=\"пусто\",1,IF('параметры заявки'!$D$17='Исходные данные'!BS36,1,0))","v":1},{"$f":"IF('параметры заявки'!$D$17=\"пусто\",1,IF('параметры заявки'!$D$17='Исходные данные'!BT36,1,0))","v":1},{"$f":"IF('параметры заявки'!$D$17=\"пусто\",1,IF('параметры заявки'!$D$17='Исходные данные'!BU36,1,0))","v":1},{"$f":"IF('параметры заявки'!$D$17=\"пусто\",1,IF('параметры заявки'!$D$17='Исходные данные'!BV36,1,0))","v":1},{"$f":"IF('параметры заявки'!$D$17=\"пусто\",1,IF('параметры заявки'!$D$17='Исходные данные'!BW36,1,0))","v":1},{"$f":"IF('параметры заявки'!$D$17=\"пусто\",1,IF('параметры заявки'!$D$17='Исходные данные'!BX36,1,0))","v":1},{"$f":"IF('параметры заявки'!$D$17=\"пусто\",1,IF('параметры заявки'!$D$17='Исходные данные'!BY36,1,0))","v":1}]
[null,null,"Оплата от 3-его лица",{"$f":"IF('параметры заявки'!$D$18=\"пусто\",1,IF('параметры заявки'!$D$18='Исходные данные'!D37,1,0))","v":1},{"$f":"IF('параметры заявки'!$D$18=\"пусто\",1,IF('параметры заявки'!$D$18='Исходные данные'!E37,1,0))","v":1},{"$f":"IF('параметры заявки'!$D$18=\"пусто\",1,IF('параметры заявки'!$D$18='Исходные данные'!F37,1,0))","v":1},{"$f":"IF('параметры заявки'!$D$18=\"пусто\",1,IF('параметры заявки'!$D$18='Исходные данные'!G37,1,0))","v":1},{"$f":"IF('параметры заявки'!$D$18=\"пусто\",1,IF('параметры заявки'!$D$18='Исходные данные'!H37,1,0))","v":1},{"$f":"IF('параметры заявки'!$D$18=\"пусто\",1,IF('параметры заявки'!$D$18='Исходные данные'!I37,1,0))","v":1},{"$f":"IF('параметры заявки'!$D$18=\"пусто\",1,IF('параметры заявки'!$D$18='Исходные данные'!J37,1,0))","v":1},{"$f":"IF('параметры заявки'!$D$18=\"пусто\",1,IF('параметры заявки'!$D$18='Исходные данные'!K37,1,0))","v":1},{"$f":"IF('параметры заявки'!$D$18=\"пусто\",1,IF('параметры заявки'!$D$18='Исходные данные'!L37,1,0))","v":1},{"$f":"IF('параметры заявки'!$D$18=\"пусто\",1,IF('параметры заявки'!$D$18='Исходные данные'!M37,1,0))","v":1},{"$f":"IF('параметры заявки'!$D$18=\"пусто\",1,IF('параметры заявки'!$D$18='Исходные данные'!N37,1,0))","v":1},{"$f":"IF('параметры заявки'!$D$18=\"пусто\",1,IF('параметры заявки'!$D$18='Исходные данные'!O37,1,0))","v":1},{"$f":"IF('параметры заявки'!$D$18=\"пусто\",1,IF('параметры заявки'!$D$18='Исходные данные'!P37,1,0))","v":1},{"$f":"IF('параметры заявки'!$D$18=\"пусто\",1,IF('параметры заявки'!$D$18='Исходные данные'!Q37,1,0))","v":1},{"$f":"IF('параметры заявки'!$D$18=\"пусто\",1,IF('параметры заявки'!$D$18='Исходные данные'!R37,1,0))","v":1},{"$f":"IF('параметры заявки'!$D$18=\"пусто\",1,IF('параметры заявки'!$D$18='Исходные данные'!S37,1,0))","v":1},{"$f":"IF('параметры заявки'!$D$18=\"пусто\",1,IF('параметры заявки'!$D$18='Исходные данные'!T37,1,0))","v":1},{"$f":"IF('параметры заявки'!$D$18=\"пусто\",1,IF('параметры заявки'!$D$18='Исходные данные'!U37,1,0))","v":1},{"$f":"IF('параметры заявки'!$D$18=\"пусто\",1,IF('параметры заявки'!$D$18='Исходные данные'!V37,1,0))","v":1},{"$f":"IF('параметры заявки'!$D$18=\"пусто\",1,IF('параметры заявки'!$D$18='Исходные данные'!W37,1,0))","v":1},{"$f":"IF('параметры заявки'!$D$18=\"пусто\",1,IF('параметры заявки'!$D$18='Исходные данные'!X37,1,0))","v":1},{"$f":"IF('параметры заявки'!$D$18=\"пусто\",1,IF('параметры заявки'!$D$18='Исходные данные'!Y37,1,0))","v":1},{"$f":"IF('параметры заявки'!$D$18=\"пусто\",1,IF('параметры заявки'!$D$18='Исходные данные'!Z37,1,0))","v":1},{"$f":"IF('параметры заявки'!$D$18=\"пусто\",1,IF('параметры заявки'!$D$18='Исходные данные'!AA37,1,0))","v":1},{"$f":"IF('параметры заявки'!$D$18=\"пусто\",1,IF('параметры заявки'!$D$18='Исходные данные'!AB37,1,0))","v":1},{"$f":"IF('параметры заявки'!$D$18=\"пусто\",1,IF('параметры заявки'!$D$18='Исходные данные'!AC37,1,0))","v":1},{"$f":"IF('параметры заявки'!$D$18=\"пусто\",1,IF('параметры заявки'!$D$18='Исходные данные'!AD37,1,0))","v":1},{"$f":"IF('параметры заявки'!$D$18=\"пусто\",1,IF('параметры заявки'!$D$18='Исходные данные'!AE37,1,0))","v":1},{"$f":"IF('параметры заявки'!$D$18=\"пусто\",1,IF('параметры заявки'!$D$18='Исходные данные'!AF37,1,0))","v":1},{"$f":"IF('параметры заявки'!$D$18=\"пусто\",1,IF('параметры заявки'!$D$18='Исходные данные'!AG37,1,0))","v":1},{"$f":"IF('параметры заявки'!$D$18=\"пусто\",1,IF('параметры заявки'!$D$18='Исходные данные'!AH37,1,0))","v":1},{"$f":"IF('параметры заявки'!$D$18=\"пусто\",1,IF('параметры заявки'!$D$18='Исходные данные'!AI37,1,0))","v":1},{"$f":"IF('параметры заявки'!$D$18=\"пусто\",1,IF('параметры заявки'!$D$18='Исходные данные'!AJ37,1,0))","v":1},{"$f":"IF('параметры заявки'!$D$18=\"пусто\",1,IF('параметры заявки'!$D$18='Исходные данные'!AK37,1,0))","v":1},{"$f":"IF('параметры заявки'!$D$18=\"пусто\",1,IF('параметры заявки'!$D$18='Исходные данные'!AL37,1,0))","v":1},{"$f":"IF('параметры заявки'!$D$18=\"пусто\",1,IF('параметры заявки'!$D$18='Исходные данные'!AM37,1,0))","v":1},{"$f":"IF('параметры заявки'!$D$18=\"пусто\",1,IF('параметры заявки'!$D$18='Исходные данные'!AN37,1,0))","v":1},{"$f":"IF('параметры заявки'!$D$18=\"пусто\",1,IF('параметры заявки'!$D$18='Исходные данные'!AO37,1,0))","v":1},{"$f":"IF('параметры заявки'!$D$18=\"пусто\",1,IF('параметры заявки'!$D$18='Исходные данные'!AP37,1,0))","v":1},{"$f":"IF('параметры заявки'!$D$18=\"пусто\",1,IF('параметры заявки'!$D$18='Исходные данные'!AQ37,1,0))","v":1},{"$f":"IF('параметры заявки'!$D$18=\"пусто\",1,IF('параметры заявки'!$D$18='Исходные данные'!AR37,1,0))","v":1},{"$f":"IF('параметры заявки'!$D$18=\"пусто\",1,IF('параметры заявки'!$D$18='Исходные данные'!AS37,1,0))","v":1},{"$f":"IF('параметры заявки'!$D$18=\"пусто\",1,IF('параметры заявки'!$D$18='Исходные данные'!AT37,1,0))","v":1},{"$f":"IF('параметры заявки'!$D$18=\"пусто\",1,IF('параметры заявки'!$D$18='Исходные данные'!AU37,1,0))","v":1},{"$f":"IF('параметры заявки'!$D$18=\"пусто\",1,IF('параметры заявки'!$D$18='Исходные данные'!AV37,1,0))","v":1},{"$f":"IF('параметры заявки'!$D$18=\"пусто\",1,IF('параметры заявки'!$D$18='Исходные данные'!AW37,1,0))","v":1},{"$f":"IF('параметры заявки'!$D$18=\"пусто\",1,IF('параметры заявки'!$D$18='Исходные данные'!AX37,1,0))","v":1},{"$f":"IF('параметры заявки'!$D$18=\"пусто\",1,IF('параметры заявки'!$D$18='Исходные данные'!AY37,1,0))","v":1},{"$f":"IF('параметры заявки'!$D$18=\"пусто\",1,IF('параметры заявки'!$D$18='Исходные данные'!AZ37,1,0))","v":1},{"$f":"IF('параметры заявки'!$D$18=\"пусто\",1,IF('параметры заявки'!$D$18='Исходные данные'!BA37,1,0))","v":1},{"$f":"IF('параметры заявки'!$D$18=\"пусто\",1,IF('параметры заявки'!$D$18='Исходные данные'!BB37,1,0))","v":1},{"$f":"IF('параметры заявки'!$D$18=\"пусто\",1,IF('параметры заявки'!$D$18='Исходные данные'!BC37,1,0))","v":1},{"$f":"IF('параметры заявки'!$D$18=\"пусто\",1,IF('параметры заявки'!$D$18='Исходные данные'!BD37,1,0))","v":1},{"$f":"IF('параметры заявки'!$D$18=\"пусто\",1,IF('параметры заявки'!$D$18='Исходные данные'!BE37,1,0))","v":1},{"$f":"IF('параметры заявки'!$D$18=\"пусто\",1,IF('параметры заявки'!$D$18='Исходные данные'!BF37,1,0))","v":1},{"$f":"IF('параметры заявки'!$D$18=\"пусто\",1,IF('параметры заявки'!$D$18='Исходные данные'!BG37,1,0))","v":1},{"$f":"IF('параметры заявки'!$D$18=\"пусто\",1,IF('параметры заявки'!$D$18='Исходные данные'!BH37,1,0))","v":1},{"$f":"IF('параметры заявки'!$D$18=\"пусто\",1,IF('параметры заявки'!$D$18='Исходные данные'!BI37,1,0))","v":1},{"$f":"IF('параметры заявки'!$D$18=\"пусто\",1,IF('параметры заявки'!$D$18='Исходные данные'!BJ37,1,0))","v":1},{"$f":"IF('параметры заявки'!$D$18=\"пусто\",1,IF('параметры заявки'!$D$18='Исходные данные'!BK37,1,0))","v":1},{"$f":"IF('параметры заявки'!$D$18=\"пусто\",1,IF('параметры заявки'!$D$18='Исходные данные'!BL37,1,0))","v":1},{"$f":"IF('параметры заявки'!$D$18=\"пусто\",1,IF('параметры заявки'!$D$18='Исходные данные'!BM37,1,0))","v":1},{"$f":"IF('параметры заявки'!$D$18=\"пусто\",1,IF('параметры заявки'!$D$18='Исходные данные'!BN37,1,0))","v":1},{"$f":"IF('параметры заявки'!$D$18=\"пусто\",1,IF('параметры заявки'!$D$18='Исходные данные'!BO37,1,0))","v":1},{"$f":"IF('параметры заявки'!$D$18=\"пусто\",1,IF('параметры заявки'!$D$18='Исходные данные'!BP37,1,0))","v":1},{"$f":"IF('параметры заявки'!$D$18=\"пусто\",1,IF('параметры заявки'!$D$18='Исходные данные'!BQ37,1,0))","v":1},{"$f":"IF('параметры заявки'!$D$18=\"пусто\",1,IF('параметры заявки'!$D$18='Исходные данные'!BR37,1,0))","v":1},{"$f":"IF('параметры заявки'!$D$18=\"пусто\",1,IF('параметры заявки'!$D$18='Исходные данные'!BS37,1,0))","v":1},{"$f":"IF('параметры заявки'!$D$18=\"пусто\",1,IF('параметры заявки'!$D$18='Исходные данные'!BT37,1,0))","v":1},{"$f":"IF('параметры заявки'!$D$18=\"пусто\",1,IF('параметры заявки'!$D$18='Исходные данные'!BU37,1,0))","v":1},{"$f":"IF('параметры заявки'!$D$18=\"пусто\",1,IF('параметры заявки'!$D$18='Исходные данные'!BV37,1,0))","v":1},{"$f":"IF('параметры заявки'!$D$18=\"пусто\",1,IF('параметры заявки'!$D$18='Исходные данные'!BW37,1,0))","v":1},{"$f":"IF('параметры заявки'!$D$18=\"пусто\",1,IF('параметры заявки'!$D$18='Исходные данные'!BX37,1,0))","v":1},{"$f":"IF('параметры заявки'!$D$18=\"пусто\",1,IF('параметры заявки'!$D$18='Исходные данные'!BY37,1,0))","v":1}]
[]
[]
[null,null,"площадка",{"$f":"IF(AND(D62=1,D61=1,D60=1,D59=1,D58=1,D63=1,D64=1,D65=1,D66=1,D67=1,D68=1,D69=1,D70=1,D71=1),D2,0)","v":0},{"$f":"IF(AND(E62=1,E61=1,E60=1,E59=1,E58=1,E63=1,E64=1,E65=1,E66=1,E67=1,E68=1,E69=1,E70=1,E71=1),E2,0)","v":0},0,0,"ВБЦ",0,0,0,0,0,0,0,0,"ВБЦ",0,0,0,0,0,0,"TenderHelp",0,"TenderHelp",0,0,"TenderHuв",0,0,0,0,0,0,0,0,0,0,"МеталлИнвестБанк",0,0,0,0,0,0,"ТендерТех",0,0,0,0,0,0,0,0,0,0,"Elfin",0,0,0,0,{"$f":"IF(AND(BK62=1,BK61=1,BK60=1,BK59=1,BK58=1,BK63=1,BK64=1,BK65=1,BK66=1,BK67=1,BK68=1,BK69=1,BK70=1,BK71=1),BK2,0)","v":0},0,{"$f":"IF(AND(BM62=1,BM61=1,BM60=1,BM59=1,BM58=1,BM63=1,BM64=1,BM65=1,BM66=1,BM67=1,BM68=1,BM69=1,BM70=1,BM71=1),BM2,0)","v":"Yofin"},{"$f":"IF(AND(BN62=1,BN61=1,BN60=1,BN59=1,BN58=1,BN63=1,BN64=1,BN65=1,BN66=1,BN67=1,BN68=1,BN69=1,BN70=1,BN71=1),BN2,0)","v":"МодульБанк"},0,{"$f":"IF(AND(BP62=1,BP61=1,BP60=1,BP59=1,BP58=1,BP63=1,BP64=1,BP65=1,BP66=1,BP67=1,BP68=1,BP69=1,BP70=1,BP71=1),BP2,0)","v":"Алеф-банк"},0,{"$f":"IF(AND(BR62=1,BR61=1,BR60=1,BR59=1,BR58=1,BR63=1,BR64=1,BR65=1,BR66=1,BR67=1,BR68=1,BR69=1,BR70=1,BR71=1),BR2,0)","v":0},"Феникс",0,"Банк Зенит",0,0,0,0]
[null,null,"наименование банка",{"$f":"IF(AND(D62=1,D61=1,D60=1,D59=1,D58=1,D63=1,D64=1,D65=1,D66=1,D67=1,D68=1,D69=1,D70=1,D71=1),D3,0)","v":0},{"$f":"IF(AND(E62=1,E61=1,E60=1,E59=1,E58=1,E63=1,E64=1,E65=1,E66=1,E67=1,E68=1,E69=1,E70=1,E71=1),E3,0)","v":0},0,0,"СМП Банк",0,0,0,0,0,0,0,0,"Банк Зенит",0,0,0,0,0,0,"МеталлИнвестБанк",0,"Абсолют Банк",0,0,"МеталлИнвестБанк",0,0,0,0,0,0,0,0,0,0,"МеталлИнвестБанк",0,0,0,0,0,0,"Банк Зенит",0,0,0,0,0,0,0,0,0,0,"Банк Зенит",0,0,0,0,{"$f":"IF(AND(BK62=1,BK61=1,BK60=1,BK59=1,BK58=1,BK63=1,BK64=1,BK65=1,BK66=1,BK67=1,BK68=1,BK69=1,BK70=1,BK71=1),BK3,0)","v":0},0,{"$f":"IF(AND(BM62=1,BM61=1,BM60=1,BM59=1,BM58=1,BM63=1,BM64=1,BM65=1,BM66=1,BM67=1,BM68=1,BM69=1,BM70=1,BM71=1),BM3,0)","v":"Алеф-банк"},{"$f":"IF(AND(BN62=1,BN61=1,BN60=1,BN59=1,BN58=1,BN63=1,BN64=1,BN65=1,BN66=1,BN67=1,BN68=1,BN69=1,BN70=1,BN71=1),BN3,0)","v":"МодульБанк"},0,{"$f":"IF(AND(BP62=1,BP61=1,BP60=1,BP59=1,BP58=1,BP63=1,BP64=1,BP65=1,BP66=1,BP67=1,BP68=1,BP69=1,BP70=1,BP71=1),BP3,0)","v":"Алеф-банк"},0,{"$f":"IF(AND(BR62=1,BR61=1,BR60=1,BR59=1,BR58=1,BR63=1,BR64=1,BR65=1,BR66=1,BR67=1,BR68=1,BR69=1,BR70=1,BR71=1),BR3,0)","v":0},"Абсолют Банк",0,"Банк Зенит",0,0,0,0]
[]
[]
[null,null,null,1,2,3,4,5,6,7,8,9,10,11,12,13,14,15,16,17,18,19,20,21,22,23,24,25,26,27,28,29,30,31,32,33,34,35,36,37,38,39,40,41,42,43,44,45,46,47,48,49,50,51,52,53,54,55,56,57,58,59,60,61,62,63,64,65,66,67,68,69,70,71,72,73,74]

{"sheet":"список","index":3,"n_rows":76,"n_cols":6,"rows_kept":76,"cut":false,"hidden":true,"merged":[]}
[]
[]
[null,null,"Столбец1","Зайнетдинова Кристина ","Попова Анастасия ","Алексей К."]
[null,null,"СберБанк",{"$f":"IF($D$3=Лист5!B10,\"СберБанк\",\"-\")","v":"-"},{"$f":"IF($E$3=Лист5!C10,\"\",\"-\")","v":"-"},{"$f":"IF($F$3=Лист5!D10,\"в работе\",\"-\")","v":"-"}]
[null,null,"СеверГазБанк",{"$f":"IF($D$3=Лист5!B11,\"СберБанк\",\"-\")","v":"-"},{"$f":"IF($E$3=Лист5!C11,\"в работе\",\"-\")","v":"-"},{"$f":"IF($F$3=Лист5!D11,\"в работе\",\"-\")","v":"-"}]
[null,null,"ГазПромБанк",{"$f":"IF($D$3=Лист5!B12,\"СберБанк\",\"-\")","v":"-"},{"$f":"IF($E$3=Лист5!C12,\"в работе\",\"-\")","v":"-"},{"$f":"IF($F$3=Лист5!D12,\"в работе\",\"-\")","v":"-"}]
[null,null,"МКБ Банк",{"$f":"IF($D$3=Лист5!B13,\"СберБанк\",\"-\")","v":"-"},{"$f":"IF($E$3=Лист5!C13,\"в работе\",\"-\")","v":"-"},{"$f":"IF($F$3=Лист5!D13,\"в работе\",\"-\")","v":"-"}]
[null,null,"СМП Банк",{"$f":"IF($D$3=Лист5!B14,\"СберБанк\",\"-\")","v":"-"},{"$f":"IF($E$3=Лист5!C14,\"в работе\",\"-\")","v":"-"},{"$f":"IF($F$3=Лист5!D14,\"в работе\",\"-\")","v":"-"}]
[null,null,"АК Барс банк",{"$f":"IF($D$3=Лист5!B15,\"СберБанк\",\"-\")","v":"-"},{"$f":"IF($E$3=Лист5!C15,\"в работе\",\"-\")","v":"-"},{"$f":"IF($F$3=Лист5!D15,\"в работе\",\"-\")","v":"-"}]
[null,null,"Санкт-Петербург Банк",{"$f":"IF($D$3=Лист5!B16,\"СберБанк\",\"-\")","v":"-"},{"$f":"IF($E$3=Лист5!C16,\"в работе\",\"-\")","v":"-"},{"$f":"IF($F$3=Лист5!D16,\"в работе\",\"-\")","v":"-"}]
[null,null,"УралсибБанк",{"$f":"IF($D$3=Лист5!B17,\"СберБанк\",\"-\")","v":"-"},{"$f":"IF($E$3=Лист5!C17,\"в работе\",\"-\")","v":"-"},{"$f":"IF($F$3=Лист5!D17,\"в работе\",\"-\")","v":"-"}]
[null,null,"МинБанк",{"$f":"IF($D$3=Лист5!B18,\"СберБанк\",\"-\")","v":"-"},{"$f":"IF($E$3=Лист5!C18,\"в работе\",\"-\")","v":"-"},{"$f":"IF($F$3=Лист5!D18,\"в работе\",\"-\")","v":"-"}]
[null,null,"РосБанк",{"$f":"IF($D$3=Лист5!B19,\"СберБанк\",\"-\")","v":"-"},{"$f":"IF($E$3=Лист5!C19,\"в работе\",\"-\")","v":"-"},{"$f":"IF($F$3=Лист5!D19,\"в работе\",\"-\")","v":"-"}]
[null,null,"МТС Банк",{"$f":"IF($D$3=Лист5!B20,\"СберБанк\",\"-\")","v":"-"},{"$f":"IF($E$3=Лист5!C20,\"в работе\",\"-\")","v":"-"},{"$f":"IF($F$3=Лист5!D20,\"в работе\",\"-\")","v":"-"}]
[null,null,"Союз Банк",{"$f":"IF($D$3=Лист5!B21,\"СберБанк\",\"-\")","v":"-"},{"$f":"IF($E$3=Лист5!C21,\"в работе\",\"-\")","v":"-"},{"$f":"IF($F$3=Лист5!D21,\"в работе\",\"-\")","v":"-"}]
[null,null,"Русский Стандарт",{"$f":"IF($D$3=Лист5!B22,\"СберБанк\",\"-\")","v":"-"},{"$f":"IF($E$3=Лист5!C22,\"в работе\",\"-\")","v":"-"},{"$f":"IF($F$3=Лист5!D22,\"в работе\",\"-\")","v":"-"}]
[null,null,"Банк Зенит",{"$f":"IF($D$3=Лист5!B23,\"СберБанк\",\"-\")","v":"-"},{"$f":"IF($E$3=Лист5!C23,\"в работе\",\"-\")","v":"-"},{"$f":"IF($F$3=Лист5!D23,\"в работе\",\"-\")","v":"-"}]
[null,null,"Инбанк",{"$f":"IF($D$3=Лист5!B24,\"СберБанк\",\"-\")","v":"-"},{"$f":"IF($E$3=Лист5!C24,\"в работе\",\"-\")","v":"-"},{"$f":"IF($F$3=Лист5!D24,\"в работе\",\"-\")","v":"-"}]
[null,null,"МСП Банк",{"$f":"IF($D$3=Лист5!B25,\"СберБанк\",\"-\")","v":"-"},{"$f":"IF($E$3=Лист5!C25,\"в работе\",\"-\")","v":"-"},{"$f":"IF($F$3=Лист5!D25,\"в работе\",\"-\")","v":"-"}]
[null,null,"Банк Россия",{"$f":"IF($D$3=Лист5!B26,\"СберБанк\",\"-\")","v":"-"},{"$f":"IF($E$3=Лист5!C26,\"в работе\",\"-\")","v":"-"},{"$f":"IF($F$3=Лист5!D26,\"в работе\",\"-\")","v":"-"}]
[null,null,"Киви банк",{"$f":"IF($D$3=Лист5!B27,\"СберБанк\",\"-\")","v":"-"},{"$f":"IF($E$3=Лист5!C27,\"в работе\",\"-\")","v":"-"},{"$f":"IF($F$3=Лист5!D27,\"в работе\",\"-\")","v":"-"}]
[null,null,"Инбанк",{"$f":"IF($D$3=Лист5!B28,\"СберБанк\",\"-\")","v":"-"},{"$f":"IF($E$3=Лист5!C28,\"в работе\",\"-\")","v":"-"},{"$f":"IF($F$3=Лист5!D28,\"в работе\",\"-\")","v":"-"}]
[null,null,"ПромСвязьБанк",{"$f":"IF($D$3=Лист5!B29,\"СберБанк\",\"-\")","v":"-"},{"$f":"IF($E$3=Лист5!C29,\"в работе\",\"-\")","v":"-"},{"$f":"IF($F$3=Лист5!D29,\"в работе\",\"-\")","v":"-"}]
[null,null,"МеталлИнвестБанк",{"$f":"IF($D$3=Лист5!B30,\"СберБанк\",\"-\")","v":"-"},{"$f":"IF($E$3=Лист5!C30,\"в работе\",\"-\")","v":"-"},{"$f":"IF($F$3=Лист5!D30,\"в работе\",\"-\")","v":"-"}]
[null,null,"Санкт-Петербург Банк",{"$f":"IF($D$3=Лист5!B31,\"СберБанк\",\"-\")","v":"-"},{"$f":"IF($E$3=Лист5!C31,\"в работе\",\"-\")","v":"-"},{"$f":"IF($F$3=Лист5!D31,\"в работе\",\"-\")","v":"-"}]
[null,null,"Абсолют Банк",{"$f":"IF($D$3=Лист5!B32,\"СберБанк\",\"-\")","v":"-"},{"$f":"IF($E$3=Лист5!C32,\"в работе\",\"-\")","v":"-"},{"$f":"IF($F$3=Лист5!D32,\"в работе\",\"-\")","v":"-"}]
[null,null,"Альфа-банк",{"$f":"IF($D$3=Лист5!B33,\"СберБанк\",\"-\")","v":"-"},{"$f":"IF($E$3=Лист5!C33,\"в работе\",\"-\")","v":"-"},{"$f":"IF($F$3=Лист5!D33,\"в работе\",\"-\")","v":"-"}]
[null,null,"СберБанк",{"$f":"IF($D$3=Лист5!B34,\"СберБанк\",\"-\")","v":"-"},{"$f":"IF($E$3=Лист5!C34,\"в работе\",\"-\")","v":"-"},{"$f":"IF($F$3=Лист5!D34,\"в работе\",\"-\")","v":"-"}]
[null,null,"МеталлИнвестБанк",{"$f":"IF($D$3=Лист5!B35,\"СберБанк\",\"-\")","v":"-"},{"$f":"IF($E$3=Лист5!C35,\"в работе\",\"-\")","v":"-"},{"$f":"IF($F$3=Лист5!D35,\"в работе\",\"-\")","v":"-"}]
[null,null,"SBI Банк",{"$f":"IF($D$3=Лист5!B36,\"СберБанк\",\"-\")","v":"-"},{"$f":"IF($E$3=Лист5!C36,\"в работе\",\"-\")","v":"-"},{"$f":"IF($F$3=Лист5!D36,\"в работе\",\"-\")","v":"-"}]
[null,null,"ЭкспоБанк",{"$f":"IF($D$3=Лист5!B37,\"СберБанк\",\"-\")","v":"-"},{"$f":"IF($E$3=Лист5!C37,\"в работе\",\"-\")","v":"-"},{"$f":"IF($F$3=Лист5!D37,\"в работе\",\"-\")","v":"-"}]
[null,null,"Кредит Европа Банк",{"$f":"IF($D$3=Лист5!B38,\"СберБанк\",\"-\")","v":"-"},{"$f":"IF($E$3=Лист5!C38,\"в работе\",\"-\")","v":"-"},{"$f":"IF($F$3=Лист5!D38,\"в работе\",\"-\")","v":"-"}]
[null,null,"СДМ-Банк",{"$f":"IF($D$3=Лист5!B39,\"СберБанк\",\"-\")","v":"-"},{"$f":"IF($E$3=Лист5!C39,\"в работе\",\"-\")","v":"-"},{"$f":"IF($F$3=Лист5!D39,\"в работе\",\"-\")","v":"-"}]
[null,null,"Первоуральский Банк",{"$f":"IF($D$3=Лист5!B40,\"СберБанк\",\"-\")","v":"-"},{"$f":"IF($E$3=Лист5!C40,\"в работе\",\"-\")","v":"-"},{"$f":"IF($F$3=Лист5!D40,\"в работе\",\"-\")","v":"-"}]
[null,null,"Кубань Кредит Банк",{"$f":"IF($D$3=Лист5!B41,\"СберБанк\",\"-\")","v":"-"},{"$f":"IF($E$3=Лист5!C41,\"в работе\",\"-\")","v":"-"},{"$f":"IF($F$3=Лист5!D41,\"в работе\",\"-\")","v":"-"}]
[null,null,"Примсоцбанк",{"$f":"IF($D$3=Лист5!B42,\"СберБанк\",\"-\")","v":"-"},{"$f":"IF($E$3=Лист5!C42,\"в работе\",\"-\")","v":"-"},{"$f":"IF($F$3=Лист5!D42,\"в работе\",\"-\")","v":"-"}]
[null,null,"МоскомБанк",{"$f":"IF($D$3=Лист5!B43,\"СберБанк\",\"-\")","v":"-"},{"$f":"IF($E$3=Лист5!C43,\"в работе\",\"-\")","v":"-"},{"$f":"IF($F$3=Лист5!D43,\"в работе\",\"-\")","v":"-"}]
[null,null,"МТС Банк",{"$f":"IF($D$3=Лист5!B44,\"СберБанк\",\"-\")","v":"-"},{"$f":"IF($E$3=Лист5!C44,\"в работе\",\"-\")","v":"-"},{"$f":"IF($F$3=Лист5!D44,\"в работе\",\"-\")","v":"-"}]
[null,null,"Санкт-Петербург Банк",{"$f":"IF($D$3=Лист5!B45,\"СберБанк\",\"-\")","v":"-"},{"$f":"IF($E$3=Лист5!C45,\"в работе\",\"-\")","v":"-"},{"$f":"IF($F$3=Лист5!D45,\"в работе\",\"-\")","v":"-"}]
[null,null,"МеталлИнвестБанк",{"$f":"IF($D$3=Лист5!B46,\"СберБанк\",\"-\")","v":"-"},{"$f":"IF($E$3=Лист5!C46,\"в работе\",\"-\")","v":"-"},{"$f":"IF($F$3=Лист5!D46,\"в работе\",\"-\")","v":"-"}]
[null,null,"ЛокоБанк",{"$f":"IF($D$3=Лист5!B47,\"СберБанк\",\"-\")","v":"-"},{"$f":"IF($E$3=Лист5!C47,\"в работе\",\"-\")","v":"-"},{"$f":"IF($F$3=Лист5!D47,\"в работе\",\"-\")","v":"-"}]
[null,null,"РГС Банк",{"$f":"IF($D$3=Лист5!B48,\"СберБанк\",\"-\")","v":"-"},{"$f":"IF($E$3=Лист5!C48,\"в работе\",\"-\")","v":"-"},{"$f":"IF($F$3=Лист5!D48,\"в работе\",\"-\")","v":"-"}]
[null,null,"Союз Банк",{"$f":"IF($D$3=Лист5!B49,\"СберБанк\",\"-\")","v":"-"},{"$f":"IF($E$3=Лист5!C49,\"в работе\",\"-\")","v":"-"},{"$f":"IF($F$3=Лист5!D49,\"в работе\",\"-\")","v":"-"}]
[null,null,"УралсибБанк",{"$f":"IF($D$3=Лист5!B50,\"СберБанк\",\"-\")","v":"-"},{"$f":"IF($E$3=Лист5!C50,\"в работе\",\"-\")","v":"-"},{"$f":"IF($F$3=Лист5!D50,\"в работе\",\"-\")","v":"-"}]
[null,null,"ТКБ Банк",{"$f":"IF($D$3=Лист5!B51,\"СберБанк\",\"-\")","v":"-"},{"$f":"IF($E$3=Лист5!C51,\"в работе\",\"-\")","v":"-"},{"$f":"IF($F$3=Лист5!D51,\"в работе\",\"-\")","v":"-"}]
[null,null,"Росбанк",{"$f":"IF($D$3=Лист5!B52,\"СберБанк\",\"-\")","v":"-"},{"$f":"IF($E$3=Лист5!C52,\"в работе\",\"-\")","v":"-"},{"$f":"IF($F$3=Лист5!D52,\"в работе\",\"-\")","v":"-"}]
[null,null,"Банк Зенит",{"$f":"IF($D$3=Лист5!B53,\"СберБанк\",\"-\")","v":"-"},{"$f":"IF($E$3=Лист5!C53,\"в работе\",\"-\")","v":"-"},{"$f":"IF($F$3=Лист5!D53,\"в работе\",\"-\")","v":"-"}]
[null,null,"ПромСвязьБанк",{"$f":"IF($D$3=Лист5!B54,\"СберБанк\",\"-\")","v":"-"},{"$f":"IF($E$3=Лист5!C54,\"в работе\",\"-\")","v":"-"},{"$f":"IF($F$3=Лист5!D54,\"в работе\",\"-\")","v":"-"}]
[null,null,"Альфа-банк",{"$f":"IF($D$3=Лист5!B55,\"СберБанк\",\"-\")","v":"-"},{"$f":"IF($E$3=Лист5!C55,\"в работе\",\"-\")","v":"-"},{"$f":"IF($F$3=Лист5!D55,\"в работе\",\"-\")","v":"-"}]
[null,null,"ПочтаБанк",{"$f":"IF($D$3=Лист5!B56,\"СберБанк\",\"-\")","v":"-"},{"$f":"IF($E$3=Лист5!C56,\"в работе\",\"-\")","v":"-"},{"$f":"IF($F$3=Лист5!D56,\"в работе\",\"-\")","v":"-"}]
[null,null,"УралсибБанк",{"$f":"IF($D$3=Лист5!B57,\"СберБанк\",\"-\")","v":"-"},{"$f":"IF($E$3=Лист5!C57,\"в работе\",\"-\")","v":"-"},{"$f":"IF($F$3=Лист5!D57,\"в работе\",\"-\")","v":"-"}]
[null,null,"МТС Банк",{"$f":"IF($D$3=Лист5!B58,\"СберБанк\",\"-\")","v":"-"},{"$f":"IF($E$3=Лист5!C58,\"в работе\",\"-\")","v":"-"},{"$f":"IF($F$3=Лист5!D58,\"в работе\",\"-\")","v":"-"}]
[null,null,"ПромСвязьБанк",{"$f":"IF($D$3=Лист5!B59,\"СберБанк\",\"-\")","v":"-"},{"$f":"IF($E$3=Лист5!C59,\"в работе\",\"-\")","v":"-"},{"$f":"IF($F$3=Лист5!D59,\"в работе\",\"-\")","v":"-"}]
[null,null,"РГС Банк",{"$f":"IF($D$3=Лист5!B60,\"СберБанк\",\"-\")","v":"-"},{"$f":"IF($E$3=Лист5!C60,\"в работе\",\"-\")","v":"-"},{"$f":"IF($F$3=Лист5!D60,\"в работе\",\"-\")","v":"-"}]
[null,null,"SBI Банк",{"$f":"IF($D$3=Лист5!B61,\"СберБанк\",\"-\")","v":"-"},{"$f":"IF($E$3=Лист5!C61,\"в работе\",\"-\")","v":"-"},{"$f":"IF($F$3=Лист5!D61,\"в работе\",\"-\")","v":"-"}]
[null,null,"ГазПромБанк",{"$f":"IF($D$3=Лист5!B62,\"СберБанк\",\"-\")","v":"-"},{"$f":"IF($E$3=Лист5!C62,\"в работе\",\"-\")","v":"-"},{"$f":"IF($F$3=Лист5!D62,\"в работе\",\"-\")","v":"-"}]
[null,null,"МКБ Банк",{"$f":"IF($D$3=Лист5!B63,\"СберБанк\",\"-\")","v":"-"},{"$f":"IF($E$3=Лист5!C63,\"в работе\",\"-\")","v":"-"},{"$f":"IF($F$3=Лист5!D63,\"в работе\",\"-\")","v":"-"}]
[null,null,"Банк Зенит",{"$f":"IF($D$3=Лист5!B64,\"СберБанк\",\"-\")","v":"-"},{"$f":"IF($E$3=Лист5!C64,\"в работе\",\"-\")","v":"-"},{"$f":"IF($F$3=Лист5!D64,\"в работе\",\"-\")","v":"-"}]
[null,null,"Санкт-Петербург Банк",{"$f":"IF($D$3=Лист5!B65,\"СберБанк\",\"-\")","v":"-"},{"$f":"IF($E$3=Лист5!C65,\"в работе\",\"-\")","v":"-"},{"$f":"IF($F$3=Лист5!D65,\"в работе\",\"-\")","v":"-"}]
[null,null,"АТБ Банк",{"$f":"IF($D$3=Лист5!B66,\"СберБанк\",\"-\")","v":"-"},{"$f":"IF($E$3=Лист5!C66,\"в работе\",\"-\")","v":"-"},{"$f":"IF($F$3=Лист5!D66,\"в работе\",\"-\")","v":"-"}]
[null,null,"РГС Банк",{"$f":"IF($D$3=Лист5!B67,\"СберБанк\",\"-\")","v":"-"},{"$f":"IF($E$3=Лист5!C67,\"в работе\",\"-\")","v":"-"},{"$f":"IF($F$3=Лист5!D67,\"в работе\",\"-\")","v":"-"}]
[null,null,"Кредит Европа Банк",{"$f":"IF($D$3=Лист5!B68,\"СберБанк\",\"-\")","v":"-"},{"$f":"IF($E$3=Лист5!C68,\"в работе\",\"-\")","v":"-"},{"$f":"IF($F$3=Лист5!D68,\"в работе\",\"-\")","v":"-"}]
[null,null,"Кубань Кредит Банк",{"$f":"IF($D$3=Лист5!B69,\"СберБанк\",\"-\")","v":"-"},{"$f":"IF($E$3=Лист5!C69,\"в работе\",\"-\")","v":"-"},{"$f":"IF($F$3=Лист5!D69,\"в работе\",\"-\")","v":"-"}]
[null,null,"Банк Столичный Кредит",{"$f":"IF($D$3=Лист5!B70,\"СберБанк\",\"-\")","v":"-"},{"$f":"IF($E$3=Лист5!C70,\"в работе\",\"-\")","v":"-"},{"$f":"IF($F$3=Лист5!D70,\"в работе\",\"-\")","v":"-"}]
[null,null,"МодульБанк",{"$f":"IF($D$3=Лист5!B71,\"СберБанк\",\"-\")","v":"-"},{"$f":"IF($E$3=Лист5!C71,\"в работе\",\"-\")","v":"-"},{"$f":"IF($F$3=Лист5!D71,\"в работе\",\"-\")","v":"-"}]
[null,null,"МоскоммерцБанк",{"$f":"IF($D$3=Лист5!B72,\"СберБанк\",\"-\")","v":"-"},{"$f":"IF($E$3=Лист5!C72,\"в работе\",\"-\")","v":"-"},{"$f":"IF($F$3=Лист5!D72,\"в работе\",\"-\")","v":"-"}]
[null,null,"Алеф-банк",{"$f":"IF($D$3=Лист5!B73,\"СберБанк\",\"-\")","v":"-"},{"$f":"IF($E$3=Лист5!C73,\"в работе\",\"-\")","v":"-"},{"$f":"IF($F$3=Лист5!D73,\"в работе\",\"-\")","v":"-"}]
[null,null,"МТС Банк",{"$f":"IF($D$3=Лист5!B74,\"СберБанк\",\"-\")","v":"-"},{"$f":"IF($E$3=Лист5!C74,\"в работе\",\"-\")","v":"-"},{"$f":"IF($F$3=Лист5!D74,\"в работе\",\"-\")","v":"-"}]
[null,null,"АК Барс банк",{"$f":"IF($D$3=Лист5!B75,\"СберБанк\",\"-\")","v":"-"},{"$f":"IF($E$3=Лист5!C75,\"в работе\",\"-\")","v":"-"},{"$f":"IF($F$3=Лист5!D75,\"в работе\",\"-\")","v":"-"}]
[null,null,"Абсолют Банк",{"$f":"IF($D$3=Лист5!B76,\"СберБанк\",\"-\")","v":"-"},{"$f":"IF($E$3=Лист5!C76,\"в работе\",\"-\")","v":"-"},{"$f":"IF($F$3=Лист5!D76,\"в работе\",\"-\")","v":"-"}]
[null,null,"Реалист Банк",{"$f":"IF($D$3=Лист5!B77,\"СберБанк\",\"-\")","v":"-"},{"$f":"IF($E$3=Лист5!C77,\"в работе\",\"-\")","v":"-"},{"$f":"IF($F$3=Лист5!D77,\"в работе\",\"-\")","v":"-"}]
[null,null,"Банк Зенит",{"$f":"IF($D$3=Лист5!B78,\"СберБанк\",\"-\")","v":"-"},{"$f":"IF($E$3=Лист5!C78,\"в работе\",\"-\")","v":"-"},{"$f":"IF($F$3=Лист5!D78,\"в работе\",\"-\")","v":"-"}]
[null,null,"МеткомБанк",{"$f":"IF($D$3=Лист5!B79,\"СберБанк\",\"-\")","v":"-"},{"$f":"IF($E$3=Лист5!C79,\"в работе\",\"-\")","v":"-"},{"$f":"IF($F$3=Лист5!D79,\"в работе\",\"-\")","v":"-"}]
[null,null,"Инбанк",{"$f":"IF($D$3=Лист5!B80,\"СберБанк\",\"-\")","v":"-"},{"$f":"IF($E$3=Лист5!C80,\"в работе\",\"-\")","v":"-"},{"$f":"IF($F$3=Лист5!D80,\"в работе\",\"-\")","v":"-"}]
[null,null,"СовкомБанк",{"$f":"IF($D$3=Лист5!B81,\"СберБанк\",\"-\")","v":"-"},{"$f":"IF($E$3=Лист5!C81,\"в работе\",\"-\")","v":"-"},{"$f":"IF($F$3=Лист5!D81,\"в работе\",\"-\")","v":"-"}]
[null,null,"Киви банк",{"$f":"IF($D$3=Лист5!B82,\"СберБанк\",\"-\")","v":"-"},{"$f":"IF($E$3=Лист5!C82,\"в работе\",\"-\")","v":"-"},{"$f":"IF($F$3=Лист5!D82,\"в работе\",\"-\")","v":"-"}]

{"sheet":"Лист5","index":4,"n_rows":82,"n_cols":76,"rows_kept":82,"cut":false,"hidden":true,"merged":[]}
[]
[]
[null,"оператор ПК","Зайнетдинова Кристина ","14:00 - 19:00","14:00 - 19:00","14:00 - 19:00","14:00 - 19:00","14:00 - 19:00","14:00 - 19:00","14:00 - 19:00","14:00 - 19:00","14:00 - 19:00","14:00 - 19:00","14:00 - 19:00","14:00 - 19:00","14:00 - 19:00","14:00 - 19:00","14:00 - 19:00","14:00 - 19:00","14:00 - 19:00","14:00 - 19:00","14:00 - 19:00","14:00 - 19:00","14:00 - 19:00","14:00 - 19:00","14:00 - 19:00","14:00 - 19:00","14:00 - 19:00","08:00 - 19:00","08:00 - 19:00","08:00 - 19:00","08:00 - 19:00","08:00 - 19:00","08:00 - 19:00","08:00 - 19:00","08:00 - 19:00","14:00 - 19:00","нет","05:00 - 18:00","нет","нет","08:00 - 19:00","08:00 - 19:00","08:00 - 19:00","08:00 - 19:00","08:00 - 19:00","08:00 - 19:00","нет","08:00 - 19:00","нет","нет","нет","нет","нет","14:00 - 19:00","05:00 - 18:00","05:00 - 18:00","05:00 - 18:00","05:00 - 18:00","14:00 - 19:00","14:00 - 19:00","14:00 - 19:00","14:00 - 19:00","14:00 - 19:00","нет","08:00 - 19:00","14:00 - 19:00","нет","нет","нет","14:00 - 19:00","нет","нет","нет","нет","нет"]
[null,"оператор ПК","Попова Анастасия","05:00 - 13:59","05:00 - 13:59","05:00 - 13:59","05:00 - 13:59","05:00 - 13:59","05:00 - 13:59","05:00 - 13:59","05:00 - 13:59","05:00 - 13:59","05:00 - 13:59","05:00 - 13:59","05:00 - 13:59","05:00 - 13:59","05:00 - 13:59","05:00 - 13:59","05:00 - 13:59","05:00 - 13:59","05:00 - 13:59","05:00 - 13:59","05:00 - 13:59","05:00 - 13:59","05:00 - 13:59","05:00 - 13:59","05:00 - 13:59","05:00 - 13:59","нет","нет","нет","нет","нет","нет","нет","нет","05:00 - 13:59","нет","нет","05:00 - 18:00","05:00 - 18:00","нет","нет","нет","нет","нет","нет","нет","05:00 - 13:59","05:00 - 18:00","05:00 - 18:00","05:00 - 18:00","05:00 - 18:00","05:00 - 18:00","05:00 - 13:59","нет","нет","нет","нет","05:00 - 13:59","05:00 - 13:59","05:00 - 13:59","05:00 - 13:59","05:00 - 13:59","нет","нет","05:00 - 13:59","05:00 - 18:00","05:00 - 18:00","05:00 - 18:00","05:00 - 13:59","05:00 - 18:00","05:00 - 18:00","нет","нет","нет"]
[null,"оператор ПК","Алексей К.","нет","нет","нет","нет","нет","нет","нет","нет","нет","нет","нет","нет","нет","нет","нет","нет","нет","нет","нет","нет","нет","нет","нет","нет","нет","нет","нет","нет","нет","нет","нет","нет","нет","нет","нет","нет","нет","нет","нет","нет","нет","нет","нет","нет","09:00 - 18:00","нет","нет","нет","нет","нет","нет","нет","нет","нет","нет","нет","нет","нет","нет","нет","нет","08:00 - 18:00","нет","нет","нет","нет","нет","нет","нет","нет","08:00 - 19:00","08:00 - 19:00","08:00 - 19:00"]
[null,"оператор ПК","вакансия","нет","нет","нет","нет","нет","нет","нет","нет","нет","нет","нет","нет","нет","нет","нет","нет","нет","нет","нет","нет","нет","нет","нет","нет","нет","нет","нет","нет","нет","нет","нет","нет","нет","нет","нет","нет","нет","нет","нет","нет","нет","нет","нет","нет","нет","нет","нет","нет","нет","нет","нет","нет","нет","нет","нет","нет","нет","нет","нет","нет","нет","нет","нет","нет","нет","нет","нет","нет","нет","нет","нет","нет","нет"]
[]
[null,null,null,null,{"$f":"NOW()","v":44861.834303587966}]
[null,"Зайнетдинова Кристина ","Попова Анастасия","Алексей К.",{"$f":"TIME(HOUR(E8),MINUTE(E8),SECOND(E8))","v":"20:01:24"}]
[null,{"$f":"IF(AND($E$9>=--\"14:00:00\",$E$9<=--\"19:00:00\"),\"Зайнетдинова Кристина \",\"нет\")","v":"нет"},{"$f":"IF(AND($E$9>=--\"10:00:00\",$E$9<=--\"19:00:00\"),\"Попова Анастасия \",\"нет\")","v":"нет"},{"$f":"IF(AND($E$9>=--\"5:00:00\",$E$9<=--\"13:59:00\"),\"Алексей К.\",\"нет\")","v":"нет"}]
[null,"нет",{"$f":"IF(AND($E$9>=--\"5:00:00\",$E$9<=--\"13:59:00\"),\"Попова Анастасия \",\"нет\")","v":"нет"},{"$f":"IF(AND($E$9>=--\"5:00:00\",$E$9<=--\"13:59:00\"),\"нет\",\"нет\")","v":"нет"}]
[null,"нет","нет","нет"]
[null,"нет","нет","нет"]
[null,"нет","нет","нет"]
[null,"нет","нет","нет"]
[null,"нет","нет","нет"]
[null,"нет","нет","нет"]
[null,"нет","нет","нет"]
[null,"нет","нет","нет"]
[null,"нет","нет","нет"]
[null,"нет","нет","нет"]
[null,"нет","нет","нет"]
[null,"нет","нет","нет"]
[null,"нет","нет","нет"]
[null,"нет","нет","нет"]
[null,"нет","нет","нет"]
[null,"нет","нет","нет"]
[null,"нет","нет","нет"]
[null,"нет","нет","нет"]
[null,"нет","нет","нет"]
[null,"нет","нет","нет"]
[null,"нет","нет","нет"]
[null,"нет","нет","нет"]
[null,"нет","нет","нет"]
[null,{"$f":"IF(AND($E$9>=--\"8:00:00\",$E$9<=--\"19:00:00\"),\"Зайнетдинова Кристина \",\"нет\")","v":"нет"},{"$f":"IF(AND($E$9>=--\"5:00:00\",$E$9<=--\"13:59:00\"),\"нет\",\"нет\")","v":"нет"},"нет"]
[null,"нет","нет","нет"]
[null,"нет","нет","нет"]
[null,"нет","нет","нет"]
[null,"нет","нет","нет"]
[null,"нет","нет","нет"]
[null,"нет","нет","нет"]
[null,"нет","нет","нет"]
[null,{"$f":"IF(AND($E$9>=--\"14:00:00\",$E$9<=--\"19:00:00\"),\"Зайнетдинова Кристина \",\"нет\")","v":"нет"},{"$f":"IF(AND($E$9>=--\"5:00:00\",$E$9<=--\"13:59:00\"),\"Попова Анастасия \",\"нет\")","v":"нет"},"нет"]
[null,{"$f":"IF(AND($E$9>=--\"14:00:00\",$E$9<=--\"19:00:00\"),\"нет\",\"нет\")","v":"нет"},{"$f":"IF(AND($E$9>=--\"5:00:00\",$E$9<=--\"13:59:00\"),\"нет\",\"нет\")","v":"нет"},"нет"]
[null,{"$f":"IF(AND($E$9>=--\"5:00:00\",$E$9<=--\"18:00:00\"),\"Зайнетдинова Кристина \",\"нет\")","v":"нет"},{"$f":"IF(AND($E$9>=--\"5:00:00\",$E$9<=--\"13:59:00\"),\"нет\",\"нет\")","v":"нет"},"нет"]
[null,{"$f":"IF(AND($E$9>=--\"14:00:00\",$E$9<=--\"19:00:00\"),\"нет\",\"нет\")","v":"нет"},{"$f":"IF(AND($E$9>=--\"5:00:00\",$E$9<=--\"18:00:00\"),\"Попова Анастасия \",\"нет\")","v":"нет"},"нет"]
[null,{"$f":"IF(AND($E$9>=--\"14:00:00\",$E$9<=--\"19:00:00\"),\"нет\",\"нет\")","v":"нет"},{"$f":"IF(AND($E$9>=--\"5:00:00\",$E$9<=--\"18:00:00\"),\"Попова Анастасия \",\"нет\")","v":"нет"},"нет"]
[null,{"$f":"IF(AND($E$9>=--\"8:00:00\",$E$9<=--\"19:00:00\"),\"Зайнетдинова Кристина \",\"нет\")","v":"нет"},{"$f":"IF(AND($E$9>=--\"5:00:00\",$E$9<=--\"13:59:00\"),\"нет\",\"нет\")","v":"нет"},"нет"]
[null,"нет","нет","нет"]
[null,"нет","нет","нет"]
[null,"нет","нет","нет"]
[null,"нет","нет","нет"]
[null,"нет","нет","нет"]
[null,{"$f":"IF(AND($E$9>=--\"14:00:00\",$E$9<=--\"19:00:00\"),\"нет\",\"нет\")","v":"нет"},"нет",{"$f":"IF(AND($E$9>=--\"9:00:00\",$E$9<=--\"18:00:00\"),\"Алексей К.\",\"нет\")","v":"нет"}]
[null,{"$f":"IF(AND($E$9>=--\"8:00:00\",$E$9<=--\"19:00:00\"),\"Зайнетдинова Кристина \",\"нет\")","v":"нет"},{"$f":"IF(AND($E$9>=--\"5:00:00\",$E$9<=--\"13:59:00\"),\"Попова Анастасия \",\"нет\")","v":"нет"},{"$f":"IF(AND($E$9>=--\"5:00:00\",$E$9<=--\"13:59:00\"),\"нет\",\"нет\")","v":"нет"}]
[null,{"$f":"IF(AND($E$9>=--\"14:00:00\",$E$9<=--\"19:00:00\"),\"нет\",\"нет\")","v":"нет"},{"$f":"IF(AND($E$9>=--\"5:00:00\",$E$9<=--\"18:00:00\"),\"Попова Анастасия \",\"нет\")","v":"нет"},"нет"]
[null,{"$f":"IF(AND($E$9>=--\"14:00:00\",$E$9<=--\"19:00:00\"),\"нет\",\"нет\")","v":"нет"},{"$f":"IF(AND($E$9>=--\"5:00:00\",$E$9<=--\"18:00:00\"),\"Попова Анастасия \",\"нет\")","v":"нет"},"нет"]
[null,{"$f":"IF(AND($E$9>=--\"14:00:00\",$E$9<=--\"19:00:00\"),\"нет\",\"нет\")","v":"нет"},{"$f":"IF(AND($E$9>=--\"5:00:00\",$E$9<=--\"18:00:00\"),\"Попова Анастасия \",\"нет\")","v":"нет"},"нет"]
[null,{"$f":"IF(AND($E$9>=--\"14:00:00\",$E$9<=--\"19:00:00\"),\"нет\",\"нет\")","v":"нет"},{"$f":"IF(AND($E$9>=--\"5:00:00\",$E$9<=--\"18:00:00\"),\"Попова Анастасия \",\"нет\")","v":"нет"},"нет"]
[null,{"$f":"IF(AND($E$9>=--\"14:00:00\",$E$9<=--\"19:00:00\"),\"нет\",\"нет\")","v":"нет"},{"$f":"IF(AND($E$9>=--\"5:00:00\",$E$9<=--\"18:00:00\"),\"Попова Анастасия \",\"нет\")","v":"нет"},"нет"]
[null,{"$f":"IF(AND($E$9>=--\"14:00:00\",$E$9<=--\"19:00:00\"),\"Зайнетдинова Кристина \",\"нет\")","v":"нет"},{"$f":"IF(AND($E$9>=--\"5:00:00\",$E$9<=--\"13:59:00\"),\"Попова Анастасия \",\"нет\")","v":"нет"},"нет"]
[null,{"$f":"IF(AND($E$9>=--\"5:00:00\",$E$9<=--\"18:00:00\"),\"Зайнетдинова Кристина \",\"нет\")","v":"нет"},{"$f":"IF(AND($E$9>=--\"5:00:00\",$E$9<=--\"13:59:00\"),\"нет\",\"нет\")","v":"нет"},"нет"]
[null,{"$f":"IF(AND($E$9>=--\"5:00:00\",$E$9<=--\"18:00:00\"),\"Зайнетдинова Кристина \",\"нет\")","v":"нет"},{"$f":"IF(AND($E$9>=--\"5:00:00\",$E$9<=--\"13:59:00\"),\"нет\",\"нет\")","v":"нет"},"нет"]
[null,{"$f":"IF(AND($E$9>=--\"5:00:00\",$E$9<=--\"18:00:00\"),\"Зайнетдинова Кристина \",\"нет\")","v":"нет"},{"$f":"IF(AND($E$9>=--\"5:00:00\",$E$9<=--\"13:59:00\"),\"нет\",\"нет\")","v":"нет"},"нет"]
[null,{"$f":"IF(AND($E$9>=--\"5:00:00\",$E$9<=--\"18:00:00\"),\"Зайнетдинова Кристина \",\"нет\")","v":"нет"},{"$f":"IF(AND($E$9>=--\"5:00:00\",$E$9<=--\"13:59:00\"),\"нет\",\"нет\")","v":"нет"},"нет"]
[null,{"$f":"IF(AND($E$9>=--\"14:00:00\",$E$9<=--\"19:00:00\"),\"Зайнетдинова Кристина \",\"нет\")","v":"нет"},{"$f":"IF(AND($E$9>=--\"5:00:00\",$E$9<=--\"13:59:00\"),\"Попова Анастасия \",\"нет\")","v":"нет"},"нет"]
[null,{"$f":"IF(AND($E$9>=--\"14:00:00\",$E$9<=--\"19:00:00\"),\"Зайнетдинова Кристина \",\"нет\")","v":"нет"},{"$f":"IF(AND($E$9>=--\"5:00:00\",$E$9<=--\"13:59:00\"),\"Попова Анастасия \",\"нет\")","v":"нет"},"нет"]
[null,{"$f":"IF(AND($E$9>=--\"14:00:00\",$E$9<=--\"19:00:00\"),\"Зайнетдинова Кристина \",\"нет\")","v":"нет"},{"$f":"IF(AND($E$9>=--\"5:00:00\",$E$9<=--\"13:59:00\"),\"Попова Анастасия \",\"нет\")","v":"нет"},"нет"]
[null,{"$f":"IF(AND($E$9>=--\"14:00:00\",$E$9<=--\"19:00:00\"),\"Зайнетдинова Кристина \",\"нет\")","v":"нет"},{"$f":"IF(AND($E$9>=--\"5:00:00\",$E$9<=--\"13:59:00\"),\"Попова Анастасия \",\"нет\")","v":"нет"},"нет"]
[null,{"$f":"IF(AND($E$9>=--\"14:00:00\",$E$9<=--\"19:00:00\"),\"Зайнетдинова Кристина \",\"нет\")","v":"нет"},{"$f":"IF(AND($E$9>=--\"5:00:00\",$E$9<=--\"13:59:00\"),\"Попова Анастасия \",\"нет\")","v":"нет"},"нет"]
[null,{"$f":"IF(AND($E$9>=--\"14:00:00\",$E$9<=--\"19:00:00\"),\"нет\",\"нет\")","v":"нет"},{"$f":"IF(AND($E$9>=--\"5:00:00\",$E$9<=--\"13:59:00\"),\"нет\",\"нет\")","v":"нет"},{"$f":"IF(AND($E$9>=--\"8:00:00\",$E$9<=--\"18:00:00\"),\"Алексей К.\",\"нет\")","v":"нет"}]
[null,{"$f":"IF(AND($E$9>=--\"8:00:00\",$E$9<=--\"19:00:00\"),\"Зайнетдинова Кристина \",\"нет\")","v":"нет"},{"$f":"IF(AND($E$9>=--\"5:00:00\",$E$9<=--\"13:59:00\"),\"нет\",\"нет\")","v":"нет"},{"$f":"IF(AND($E$9>=--\"5:00:00\",$E$9<=--\"13:59:00\"),\"нет\",\"нет\")","v":"нет"}]
[null,{"$f":"IF(AND($E$9>=--\"14:00:00\",$E$9<=--\"19:00:00\"),\"Зайнетдинова Кристина \",\"нет\")","v":"нет"},{"$f":"IF(AND($E$9>=--\"5:00:00\",$E$9<=--\"13:59:00\"),\"Попова Анастасия \",\"нет\")","v":"нет"},"нет"]
[null,{"$f":"IF(AND($E$9>=--\"14:00:00\",$E$9<=--\"19:00:00\"),\"нет\",\"нет\")","v":"нет"},{"$f":"IF(AND($E$9>=--\"5:00:00\",$E$9<=--\"18:00:00\"),\"Попова Анастасия \",\"нет\")","v":"нет"},"нет"]
[null,{"$f":"IF(AND($E$9>=--\"14:00:00\",$E$9<=--\"19:00:00\"),\"нет\",\"нет\")","v":"нет"},{"$f":"IF(AND($E$9>=--\"5:00:00\",$E$9<=--\"18:00:00\"),\"Попова Анастасия \",\"нет\")","v":"нет"},"нет"]
[null,{"$f":"IF(AND($E$9>=--\"14:00:00\",$E$9<=--\"19:00:00\"),\"нет\",\"нет\")","v":"нет"},{"$f":"IF(AND($E$9>=--\"5:00:00\",$E$9<=--\"18:00:00\"),\"Попова Анастасия \",\"нет\")","v":"нет"},"нет"]
[null,{"$f":"IF(AND($E$9>=--\"14:00:00\",$E$9<=--\"19:00:00\"),\"Зайнетдинова Кристина \",\"нет\")","v":"нет"},{"$f":"IF(AND($E$9>=--\"5:00:00\",$E$9<=--\"13:59:00\"),\"Попова Анастасия \",\"нет\")","v":"нет"},"нет"]
[null,{"$f":"IF(AND($E$9>=--\"14:00:00\",$E$9<=--\"19:00:00\"),\"нет\",\"нет\")","v":"нет"},{"$f":"IF(AND($E$9>=--\"5:00:00\",$E$9<=--\"18:00:00\"),\"Попова Анастасия \",\"нет\")","v":"нет"},"нет"]
[null,{"$f":"IF(AND($E$9>=--\"14:00:00\",$E$9<=--\"19:00:00\"),\"нет\",\"нет\")","v":"нет"},{"$f":"IF(AND($E$9>=--\"5:00:00\",$E$9<=--\"13:59:00\"),\"Попова Анастасия \",\"нет\")","v":"нет"},"нет"]
[null,{"$f":"IF(AND($E$9>=--\"14:00:00\",$E$9<=--\"19:00:00\"),\"нет\",\"нет\")","v":"нет"},{"$f":"IF(AND($E$9>=--\"5:00:00\",$E$9<=--\"13:59:00\"),\"нет\",\"нет\")","v":"нет"},{"$f":"IF(AND($E$9>=--\"8:00:00\",$E$9<=--\"19:00:00\"),\"Алексей К.\",\"нет\")","v":"нет"}]
[null,{"$f":"IF(AND($E$9>=--\"14:00:00\",$E$9<=--\"19:00:00\"),\"нет\",\"нет\")","v":"нет"},{"$f":"IF(AND($E$9>=--\"5:00:00\",$E$9<=--\"13:59:00\"),\"нет\",\"нет\")","v":"нет"},{"$f":"IF(AND($E$9>=--\"8:00:00\",$E$9<=--\"19:00:00\"),\"Алексей К.\",\"нет\")","v":"нет"}]
[null,{"$f":"IF(AND($E$9>=--\"14:00:00\",$E$9<=--\"19:00:00\"),\"нет\",\"нет\")","v":"нет"},{"$f":"IF(AND($E$9>=--\"5:00:00\",$E$9<=--\"13:59:00\"),\"нет\",\"нет\")","v":"нет"},{"$f":"IF(AND($E$9>=--\"8:00:00\",$E$9<=--\"19:00:00\"),\"Алексей К.\",\"нет\")","v":"нет"}]

{"sheet":"Лист2","index":5,"n_rows":78,"n_cols":17,"rows_kept":78,"cut":false,"hidden":true,"merged":[]}
[null,null,null,null,null,null,{"$f":"'параметры заявки'!D3","v":44861.667636921302}]
[null,null,null,null,null,null,{"$f":"TIME(HOUR(G1),MINUTE(G1),SECOND(G1))","v":0.66763888888888889}]
[]
[]
[null,null,"Зайнетдинова Кристина ","Попова Анастасия","Алексей К.",null,null,null,null,{"$f":"TRANSPOSE('Исходные данные'!C49:BY56)","v":"Зайнетдинова Кристина (начало работы)"},"Зайнетдинова Кристина (конец работы)","Попова Анастасия (начало работы)","Попова Анастасия (конец работы)","Гаврикова Екатерина (начало работы)","Гаврикова Екатерина (конец работы)","вакансия (начало работы)","вакансия (конец работы)"]
[{"$f":"'Исходные данные'!$D$2","v":"СберБанк"},{"$f":"'Исходные данные'!$D$3","v":"СберБанк"},{"$f":"IFERROR(IF(AND($G$2>=--J6,$G$2<=--K6),B6,\"нет\"),\"нет\")","v":"нет"},{"$f":"IFERROR(IF(AND($G$2>=--L6,$G$2<=--M6),B6,\"нет\"),\"нет\")","v":"нет"},{"$f":"IFERROR(IF(AND($G$2>=--N6,$G$2<=--O6),B6,\"нет\"),\"нет\")","v":"СберБанк"},null,{"$f":"'Исходные данные'!$D$74","v":0},{"$f":"'Исходные данные'!$D$75","v":0},1,"10:00:00","14:59:00","05:00:00","09:59:00","15:00:00","20:00:00","нет","нет"]
[{"$f":"'Исходные данные'!$E$2","v":"СеверГазБанк"},{"$f":"'Исходные данные'!$E$3","v":"СеверГазБанк"},{"$f":"IFERROR(IF(AND($G$2>=--J7,$G$2<=--K7),B7,\"нет\"),\"нет\")","v":"нет"},{"$f":"IFERROR(IF(AND($G$2>=--L7,$G$2<=--M7),B7,\"нет\"),\"нет\")","v":"нет"},{"$f":"IFERROR(IF(AND($G$2>=--N7,$G$2<=--O7),B7,\"нет\"),\"нет\")","v":"СеверГазБанк"},null,{"$f":"'Исходные данные'!$E$74","v":0},{"$f":"'Исходные данные'!$E$75","v":0},2,"10:00:00","14:59:00","05:00:00","09:59:00","15:00:00","20:00:00","нет","нет"]
[{"$f":"'Исходные данные'!$F2","v":"ВБЦ"},{"$f":"'Исходные данные'!$F3","v":"ГазПромБанк"},"нет","нет","ГазПромБанк",null,{"$f":"'Исходные данные'!$F74","v":0},{"$f":"'Исходные данные'!$F75","v":0},3,"00:00:00","00:00:00","05:00:00","10:59:00","11:00:00","20:00:00","нет","нет"]
[{"$f":"'Исходные данные'!$G2","v":"ВБЦ"},{"$f":"'Исходные данные'!$G3","v":"МКБ Банк"},"нет","нет","МКБ Банк",null,{"$f":"'Исходные данные'!$G74","v":0},{"$f":"'Исходные данные'!$G75","v":0},4,"00:00:00","00:00:00","05:00:00","10:59:00","11:00:00","20:00:00","нет","нет"]
[{"$f":"'Исходные данные'!$H2","v":"ВБЦ"},{"$f":"'Исходные данные'!$H3","v":"СМП Банк"},"нет","нет","СМП Банк",null,{"$f":"'Исходные данные'!$H74","v":"ВБЦ"},{"$f":"'Исходные данные'!$H75","v":"СМП Банк"},5,"00:00:00","00:00:00","05:00:00","10:59:00","11:00:00","20:00:00","нет","нет"]
[{"$f":"'Исходные данные'!$I2","v":"ВБЦ"},{"$f":"'Исходные данные'!$I3","v":"АК Барс банк"},"нет","нет","АК Барс банк",null,{"$f":"'Исходные данные'!$I74","v":0},{"$f":"'Исходные данные'!$I75","v":0},6,"00:00:00","00:00:00","05:00:00","10:59:00","11:00:00","20:00:00","нет","нет"]
[{"$f":"'Исходные данные'!$J2","v":"ВБЦ"},{"$f":"'Исходные данные'!$J3","v":"Санкт-Петербург Банк"},"нет","нет","Санкт-Петербург Банк",null,{"$f":"'Исходные данные'!$J74","v":0},{"$f":"'Исходные данные'!$J75","v":0},7,"00:00:00","00:00:00","05:00:00","10:59:00","11:00:00","20:00:00","нет","нет"]
[{"$f":"'Исходные данные'!$K2","v":"ВБЦ"},{"$f":"'Исходные данные'!$K3","v":"УралсибБанк"},"нет","нет","УралсибБанк",null,{"$f":"'Исходные данные'!$K74","v":0},{"$f":"'Исходные данные'!$K75","v":0},8,"00:00:00","00:00:00","05:00:00","10:59:00","11:00:00","20:00:00","нет","нет"]
[{"$f":"'Исходные данные'!$L2","v":"ВБЦ"},{"$f":"'Исходные данные'!$L3","v":"МинБанк"},"нет","нет","МинБанк",null,{"$f":"'Исходные данные'!$L74","v":0},{"$f":"'Исходные данные'!$L75","v":0},9,"00:00:00","00:00:00","05:00:00","10:59:00","11:00:00","20:00:00","нет","нет"]
[{"$f":"'Исходные данные'!$M2","v":"ВБЦ"},{"$f":"'Исходные данные'!$M3","v":"РосБанк"},"нет","нет","РосБанк",null,{"$f":"'Исходные данные'!$M74","v":0},{"$f":"'Исходные данные'!$M75","v":0},10,"00:00:00","00:00:00","05:00:00","10:59:00","11:00:00","20:00:00","нет","нет"]
[{"$f":"'Исходные данные'!$N2","v":"ВБЦ"},{"$f":"'Исходные данные'!$N3","v":"МТС Банк"},"нет","нет","МТС Банк",null,{"$f":"'Исходные данные'!$N74","v":0},{"$f":"'Исходные данные'!$N75","v":0},11,"00:00:00","00:00:00","05:00:00","10:59:00","11:00:00","20:00:00","нет","нет"]
[{"$f":"'Исходные данные'!$O2","v":"ВБЦ"},{"$f":"'Исходные данные'!$O3","v":"Союз Банк"},"нет","нет","Союз Банк",null,{"$f":"'Исходные данные'!$O74","v":0},{"$f":"'Исходные данные'!$O75","v":0},12,"00:00:00","00:00:00","05:00:00","10:59:00","11:00:00","20:00:00","нет","нет"]
[{"$f":"'Исходные данные'!$P2","v":"ВБЦ"},{"$f":"'Исходные данные'!$P3","v":"Русский Стандарт"},"нет","нет","Русский Стандарт",null,{"$f":"'Исходные данные'!$P74","v":0},{"$f":"'Исходные данные'!$P75","v":0},13,"00:00:00","00:00:00","05:00:00","10:59:00","11:00:00","20:00:00","нет","нет"]
[{"$f":"'Исходные данные'!$Q2","v":"ВБЦ"},{"$f":"'Исходные данные'!$Q3","v":"Банк Зенит"},"нет","нет","Банк Зенит",null,{"$f":"'Исходные данные'!$Q74","v":"ВБЦ"},{"$f":"'Исходные данные'!$Q75","v":"Банк Зенит"},14,"00:00:00","00:00:00","05:00:00","10:59:00","11:00:00","20:00:00","нет","нет"]
[{"$f":"'Исходные данные'!$R2","v":"ВБЦ"},{"$f":"'Исходные данные'!$R3","v":"Инбанк"},"нет","нет","Инбанк",null,{"$f":"'Исходные данные'!$R74","v":0},{"$f":"'Исходные данные'!$R75","v":0},15,"00:00:00","00:00:00","05:00:00","10:59:00","11:00:00","20:00:00","нет","нет"]
[{"$f":"'Исходные данные'!$S2","v":"TenderHelp"},{"$f":"'Исходные данные'!$S3","v":"МСП Банк"},"МСП Банк","нет","нет",null,{"$f":"'Исходные данные'!$S74","v":0},{"$f":"'Исходные данные'!$S75","v":0},16,"11:00:00","17:59:00","05:00:00","10:59:00","18:00:00","20:00:00","нет","нет"]
[{"$f":"'Исходные данные'!$T2","v":"TenderHelp"},{"$f":"'Исходные данные'!$T3","v":"Банк Россия"},"Банк Россия","нет","нет",null,{"$f":"'Исходные данные'!$T74","v":0},{"$f":"'Исходные данные'!$T75","v":0},17,"11:00:00","17:59:00","05:00:00","10:59:00","18:00:00","20:00:00","нет","нет"]
[{"$f":"'Исходные данные'!$U2","v":"TenderHelp"},{"$f":"'Исходные данные'!$U3","v":"Киви банк"},"Киви банк","нет","нет",null,{"$f":"'Исходные данные'!$U74","v":0},{"$f":"'Исходные данные'!$U75","v":0},18,"11:00:00","17:59:00","05:00:00","10:59:00","18:00:00","20:00:00","нет","нет"]
[{"$f":"'Исходные данные'!$V2","v":"TenderHelp"},{"$f":"'Исходные данные'!$V3","v":"Инбанк"},"Инбанк","нет","нет",null,{"$f":"'Исходные данные'!$V74","v":0},{"$f":"'Исходные данные'!$V75","v":0},19,"11:00:00","17:59:00","05:00:00","10:59:00","18:00:00","20:00:00","нет","нет"]
[{"$f":"'Исходные данные'!$W2","v":"TenderHelp"},{"$f":"'Исходные данные'!$W3","v":"ПромСвязьБанк"},"ПромСвязьБанк","нет","нет",null,{"$f":"'Исходные данные'!$W74","v":0},{"$f":"'Исходные данные'!$W75","v":0},20,"11:00:00","17:59:00","05:00:00","10:59:00","18:00:00","20:00:00","нет","нет"]
[{"$f":"'Исходные данные'!$X2","v":"TenderHelp"},{"$f":"'Исходные данные'!$X3","v":"МеталлИнвестБанк"},"МеталлИнвестБанк","нет","нет",null,{"$f":"'Исходные данные'!$X74","v":"TenderHelp"},{"$f":"'Исходные данные'!$X75","v":"МеталлИнвестБанк"},21,"11:00:00","17:59:00","05:00:00","10:59:00","18:00:00","20:00:00","нет","нет"]
[{"$f":"'Исходные данные'!$Y2","v":"TenderHelp"},{"$f":"'Исходные данные'!$Y3","v":"Санкт-Петербург Банк"},"Санкт-Петербург Банк","нет","нет",null,{"$f":"'Исходные данные'!$Y74","v":0},{"$f":"'Исходные данные'!$Y75","v":0},22,"11:00:00","17:59:00","05:00:00","10:59:00","18:00:00","20:00:00","нет","нет"]
[{"$f":"'Исходные данные'!$Z2","v":"TenderHelp"},{"$f":"'Исходные данные'!$Z3","v":"Абсолют Банк"},"Абсолют Банк","нет","нет",null,{"$f":"'Исходные данные'!$Z74","v":"TenderHelp"},{"$f":"'Исходные данные'!$Z75","v":"Абсолют Банк"},23,"11:00:00","17:59:00","05:00:00","10:59:00","18:00:00","20:00:00","нет","нет"]
[{"$f":"'Исходные данные'!$AA2","v":"TenderHelp"},{"$f":"'Исходные данные'!$AA3","v":"Альфа-банк"},"Альфа-банк","нет","нет",null,{"$f":"'Исходные данные'!$AA74","v":0},{"$f":"'Исходные данные'!$AA75","v":0},24,"11:00:00","17:59:00","05:00:00","10:59:00","18:00:00","20:00:00","нет","нет"]
[{"$f":"'Исходные данные'!$AB2","v":"TenderHelp"},{"$f":"'Исходные данные'!$AB3","v":"СберБанк"},"СберБанк","нет","нет",null,{"$f":"'Исходные данные'!$AB74","v":0},{"$f":"'Исходные данные'!$AB75","v":0},25,"11:00:00","17:59:00","05:00:00","10:59:00","18:00:00","20:00:00","нет","нет"]
[{"$f":"'Исходные данные'!$AC2","v":"TenderHuв"},{"$f":"'Исходные данные'!$AC3","v":"МеталлИнвестБанк"},"нет","нет","нет",null,{"$f":"'Исходные данные'!$AC74","v":"TenderHuв"},{"$f":"'Исходные данные'!$AC75","v":"МеталлИнвестБанк"},26,"нет","нет","нет","нет","нет","нет","нет","нет"]
[{"$f":"'Исходные данные'!$AD2","v":"TenderHuв"},{"$f":"'Исходные данные'!$AD3","v":"SBI Банк"},"нет","нет","нет",null,{"$f":"'Исходные данные'!$AD74","v":0},{"$f":"'Исходные данные'!$AD75","v":0},27,"нет","нет","нет","нет","нет","нет","нет","нет"]
[{"$f":"'Исходные данные'!$AE2","v":"АТФИН"},{"$f":"'Исходные данные'!$AE3","v":"ЭкспоБанк"},"нет","нет","ЭкспоБанк",null,{"$f":"'Исходные данные'!$AE74","v":0},{"$f":"'Исходные данные'!$AE75","v":0},28,"08:00:00","13:59:00","нет","нет","14:00:00","20:00:00","нет","нет"]
[{"$f":"'Исходные данные'!$AF2","v":"АТФИН"},{"$f":"'Исходные данные'!$AF3","v":"Кредит Европа Банк"},"нет","нет","Кредит Европа Банк",null,{"$f":"'Исходные данные'!$AF74","v":0},{"$f":"'Исходные данные'!$AF75","v":0},29,"08:00:00","13:59:00","нет","нет","14:00:00","20:00:00","нет","нет"]
[{"$f":"'Исходные данные'!$AG2","v":"АТФИН"},{"$f":"'Исходные данные'!$AG3","v":"СДМ-Банк"},"нет","нет","СДМ-Банк",null,{"$f":"'Исходные данные'!$AG74","v":0},{"$f":"'Исходные данные'!$AG75","v":0},30,"08:00:00","13:59:00","нет","нет","14:00:00","20:00:00","нет","нет"]
[{"$f":"'Исходные данные'!$AH2","v":"АТФИН"},{"$f":"'Исходные данные'!$AH3","v":"Первоуральский Банк"},"нет","нет","Первоуральский Банк",null,{"$f":"'Исходные данные'!$AH74","v":0},{"$f":"'Исходные данные'!$AH75","v":0},31,"08:00:00","13:59:00","нет","нет","14:00:00","20:00:00","нет","нет"]
[{"$f":"'Исходные данные'!$AI2","v":"АТФИН"},{"$f":"'Исходные данные'!$AI3","v":"Кубань Кредит Банк"},"нет","нет","Кубань Кредит Банк",null,{"$f":"'Исходные данные'!$AI74","v":0},{"$f":"'Исходные данные'!$AI75","v":0},32,"08:00:00","13:59:00","нет","нет","14:00:00","20:00:00","нет","нет"]
[{"$f":"'Исходные данные'!$AJ2","v":"АТФИН"},{"$f":"'Исходные данные'!$AJ3","v":"Примсоцбанк"},"нет","нет","Примсоцбанк",null,{"$f":"'Исходные данные'!$AJ74","v":0},{"$f":"'Исходные данные'!$AJ75","v":0},33,"08:00:00","13:59:00","нет","нет","14:00:00","20:00:00","нет","нет"]
[{"$f":"'Исходные данные'!$AK2","v":"МоскомБанк"},{"$f":"'Исходные данные'!$AK3","v":"МоскомБанк"},"МоскомБанк","нет","нет",null,{"$f":"'Исходные данные'!$AK74","v":0},{"$f":"'Исходные данные'!$AK75","v":0},34,"15:00:00","20:00:00","05:00:00","14:59:00","нет","нет","нет","нет"]
[{"$f":"'Исходные данные'!$AL2","v":"ignetik"},{"$f":"'Исходные данные'!$AL3","v":"МТС Банк"},"МТС Банк","нет","нет",null,{"$f":"'Исходные данные'!$AL74","v":0},{"$f":"'Исходные данные'!$AL75","v":0},35,"08:00:00","20:00:00","нет","нет","нет","нет","нет","нет"]
[{"$f":"'Исходные данные'!$AM2","v":"ignetik"},{"$f":"'Исходные данные'!$AM3","v":"Санкт-Петербург Банк"},"нет","нет","нет",null,{"$f":"'Исходные данные'!$AM74","v":0},{"$f":"'Исходные данные'!$AM75","v":0},36,"нет","нет","нет","нет","нет","нет","нет","нет"]
[{"$f":"'Исходные данные'!$AN2","v":"МеталлИнвестБанк"},{"$f":"'Исходные данные'!$AN3","v":"МеталлИнвестБанк"},"нет","нет","МеталлИнвестБанк",null,{"$f":"'Исходные данные'!$AN74","v":"МеталлИнвестБанк"},{"$f":"'Исходные данные'!$AN75","v":"МеталлИнвестБанк"},37,"нет","нет","05:00:00","10:59:00","11:00:00","20:00:00","нет","нет"]
[{"$f":"'Исходные данные'!$AO2","v":"ЛокоБанк"},{"$f":"'Исходные данные'!$AO3","v":"ЛокоБанк"},"нет","нет","ЛокоБанк",null,{"$f":"'Исходные данные'!$AO74","v":0},{"$f":"'Исходные данные'!$AO75","v":0},38,"нет","нет","05:00:00","10:59:00","11:00:00","20:00:00","нет","нет"]
[{"$f":"'Исходные данные'!$AP2","v":"ТендерТех"},{"$f":"'Исходные данные'!$AP3","v":"РГС Банк"},"РГС Банк","нет","нет",null,{"$f":"'Исходные данные'!$AP74","v":0},{"$f":"'Исходные данные'!$AP75","v":0},39,"08:00:00","20:00:00","нет","нет","нет","нет","нет","нет"]
[{"$f":"'Исходные данные'!$AQ2","v":"ТендерТех"},{"$f":"'Исходные данные'!$AQ3","v":"Союз Банк"},"Союз Банк","нет","нет",null,{"$f":"'Исходные данные'!$AQ74","v":0},{"$f":"'Исходные данные'!$AQ75","v":0},40,"08:00:00","20:00:00","нет","нет","нет","нет","нет","нет"]
[{"$f":"'Исходные данные'!$AR2","v":"ТендерТех"},{"$f":"'Исходные данные'!$AR3","v":"УралсибБанк"},"УралсибБанк","нет","нет",null,{"$f":"'Исходные данные'!$AR74","v":0},{"$f":"'Исходные данные'!$AR75","v":0},41,"08:00:00","20:00:00","нет","нет","нет","нет","нет","нет"]
[{"$f":"'Исходные данные'!$AS2","v":"ТендерТех"},{"$f":"'Исходные данные'!$AS3","v":"ТКБ Банк"},"ТКБ Банк","нет","нет",null,{"$f":"'Исходные данные'!$AS74","v":0},{"$f":"'Исходные данные'!$AS75","v":0},42,"08:00:00","20:00:00","нет","нет","нет","нет","нет","нет"]
[{"$f":"'Исходные данные'!$AT2","v":"ТендерТех"},{"$f":"'Исходные данные'!$AT3","v":"Росбанк"},"Росбанк","нет","нет",null,{"$f":"'Исходные данные'!$AT74","v":0},{"$f":"'Исходные данные'!$AT75","v":0},43,"08:00:00","20:00:00","нет","нет","нет","нет","нет","нет"]
[{"$f":"'Исходные данные'!$AU2","v":"ТендерТех"},{"$f":"'Исходные данные'!$AU3","v":"Банк Зенит"},"Банк Зенит","нет","нет",null,{"$f":"'Исходные данные'!$AU74","v":"ТендерТех"},{"$f":"'Исходные данные'!$AU75","v":"Банк Зенит"},44,"08:00:00","20:00:00","нет","нет","нет","нет","нет","нет"]
[{"$f":"'Исходные данные'!$AV2","v":"Гособлако"},{"$f":"'Исходные данные'!$AV3","v":"ПромСвязьБанк"},"нет","нет","нет",null,{"$f":"'Исходные данные'!$AV74","v":0},{"$f":"'Исходные данные'!$AV75","v":0},45,"нет","нет","нет","нет","нет","нет","нет","нет"]
[{"$f":"'Исходные данные'!$AW2","v":"Альфа-банк"},{"$f":"'Исходные данные'!$AW3","v":"Альфа-банк"},"нет","Альфа-банк","нет",null,{"$f":"'Исходные данные'!$AW74","v":0},{"$f":"'Исходные данные'!$AW75","v":0},46,"нет","нет","07:00:00","20:00:00","нет","нет","нет","нет"]
[{"$f":"'Исходные данные'!$AX2","v":"Goodfin"},{"$f":"'Исходные данные'!$AX3","v":"ПочтаБанк"},"нет","нет","ПочтаБанк",null,{"$f":"'Исходные данные'!$AX74","v":0},{"$f":"'Исходные данные'!$AX75","v":0},47,"нет","нет","05:00:00","14:59:00","15:00:00","20:00:00","нет","нет"]
[{"$f":"'Исходные данные'!$AY2","v":"Goodfin"},{"$f":"'Исходные данные'!$AY3","v":"УралсибБанк"},"нет","нет","УралсибБанк",null,{"$f":"'Исходные данные'!$AY74","v":0},{"$f":"'Исходные данные'!$AY75","v":0},48,"нет","нет","05:00:00","14:59:00","15:00:00","20:00:00","нет","нет"]
[{"$f":"'Исходные данные'!$AZ2","v":"Goodfin"},{"$f":"'Исходные данные'!$AZ3","v":"МТС Банк"},"нет","нет","МТС Банк",null,{"$f":"'Исходные данные'!$AZ74","v":0},{"$f":"'Исходные данные'!$AZ75","v":0},49,"нет","нет","05:00:00","14:59:00","15:00:00","20:00:00","нет","нет"]
[{"$f":"'Исходные данные'!$BA2","v":"Goodfin"},{"$f":"'Исходные данные'!$BA3","v":"ПромСвязьБанк"},"нет","нет","ПромСвязьБанк",null,{"$f":"'Исходные данные'!$BA74","v":0},{"$f":"'Исходные данные'!$BA75","v":0},50,"нет","нет","05:00:00","14:59:00","15:00:00","20:00:00","нет","нет"]
[{"$f":"'Исходные данные'!$BB2","v":"Goodfin"},{"$f":"'Исходные данные'!$BB3","v":"РГС Банк"},"нет","нет","РГС Банк",null,{"$f":"'Исходные данные'!$BB74","v":0},{"$f":"'Исходные данные'!$BB75","v":0},51,"нет","нет","05:00:00","14:59:00","15:00:00","20:00:00","нет","нет"]
[{"$f":"'Исходные данные'!$BC2","v":"SBI Банк"},{"$f":"'Исходные данные'!$BC3","v":"SBI Банк"},"нет","нет","SBI Банк",null,{"$f":"'Исходные данные'!$BC74","v":0},{"$f":"'Исходные данные'!$BC75","v":0},52,"10:00:00","14:59:00","05:00:00","09:59:00","15:00:00","20:00:00","нет","нет"]
[{"$f":"'Исходные данные'!$BD2","v":"Elfin"},{"$f":"'Исходные данные'!$BD3","v":"ГазПромБанк"},"нет","нет","ГазПромБанк",null,{"$f":"'Исходные данные'!$BD74","v":0},{"$f":"'Исходные данные'!$BD75","v":0},53,"нет","нет","05:00:00","14:59:00","15:00:00","20:00:00","нет","нет"]
[{"$f":"'Исходные данные'!$BE2","v":"Elfin"},{"$f":"'Исходные данные'!$BE3","v":"МКБ Банк"},"нет","нет","МКБ Банк",null,{"$f":"'Исходные данные'!$BE74","v":0},{"$f":"'Исходные данные'!$BE75","v":0},54,"нет","нет","05:00:00","14:59:00","15:00:00","20:00:00","нет","нет"]
[{"$f":"'Исходные данные'!$BF2","v":"Elfin"},{"$f":"'Исходные данные'!$BF3","v":"Банк Зенит"},"нет","нет","Банк Зенит",null,{"$f":"'Исходные данные'!$BF74","v":"Elfin"},{"$f":"'Исходные данные'!$BF75","v":"Банк Зенит"},55,"нет","нет","05:00:00","14:59:00","15:00:00","20:00:00","нет","нет"]
[{"$f":"'Исходные данные'!$BG2","v":"Elfin"},{"$f":"'Исходные данные'!$BG3","v":"Санкт-Петербург Банк"},"нет","нет","Санкт-Петербург Банк",null,{"$f":"'Исходные данные'!$BG74","v":0},{"$f":"'Исходные данные'!$BG75","v":0},56,"нет","нет","05:00:00","14:59:00","15:00:00","20:00:00","нет","нет"]
[{"$f":"'Исходные данные'!$BH2","v":"А-План"},{"$f":"'Исходные данные'!$BH3","v":"АТБ Банк"},"АТБ Банк","нет","нет",null,{"$f":"'Исходные данные'!$BH74","v":0},{"$f":"'Исходные данные'!$BH75","v":0},57,"14:00:00","20:00:00","05:00:00","13:59:00","нет","нет","нет","нет"]
[{"$f":"'Исходные данные'!$BI2","v":"А-План"},{"$f":"'Исходные данные'!$BI3","v":"РГС Банк"},"РГС Банк","нет","нет",null,{"$f":"'Исходные данные'!$BI74","v":0},{"$f":"'Исходные данные'!$BI75","v":0},58,"14:00:00","20:00:00","05:00:00","13:59:00","нет","нет","нет","нет"]
[{"$f":"'Исходные данные'!$BJ2","v":"Yofin"},{"$f":"'Исходные данные'!$BJ3","v":"Кредит Европа Банк"},"Кредит Европа Банк","нет","нет",null,{"$f":"'Исходные данные'!$BJ74","v":0},{"$f":"'Исходные данные'!$BJ75","v":0},59,"14:00:00","20:00:00","05:00:00","13:59:00","нет","нет","нет","нет"]
[{"$f":"'Исходные данные'!$BK2","v":"Yofin"},{"$f":"'Исходные данные'!$BK3","v":"Кубань Кредит Банк"},"Кубань Кредит Банк","нет","нет",null,{"$f":"'Исходные данные'!$BK74","v":0},{"$f":"'Исходные данные'!$BK75","v":0},60,"14:00:00","20:00:00","05:00:00","13:59:00","нет","нет","нет","нет"]
[{"$f":"'Исходные данные'!$BL2","v":"Yofin"},{"$f":"'Исходные данные'!$BL3","v":"Банк Столичный Кредит"},"Банк Столичный Кредит","нет","нет",null,{"$f":"'Исходные данные'!$BL74","v":0},{"$f":"'Исходные данные'!$BL75","v":0},61,"14:00:00","20:00:00","05:00:00","13:59:00","нет","нет","нет","нет"]
[{"$f":"'Исходные данные'!$BN2","v":"МодульБанк"},{"$f":"'Исходные данные'!$BN3","v":"МодульБанк"},"МодульБанк","нет","нет",null,{"$f":"'Исходные данные'!$BN74","v":"МодульБанк"},{"$f":"'Исходные данные'!$BN75","v":"МодульБанк"},62,"14:00:00","20:00:00","05:00:00","13:59:00","нет","нет","нет","нет"]
[{"$f":"'Исходные данные'!$BO2","v":"МоскоммерцБанк"},{"$f":"'Исходные данные'!$BO3","v":"МоскоммерцБанк"},"нет","нет","МоскоммерцБанк",null,{"$f":"'Исходные данные'!$BO74","v":0},{"$f":"'Исходные данные'!$BO75","v":0},63,"нет","нет","нет","нет","07:00:00","20:00:00","нет","нет"]
[{"$f":"'Исходные данные'!$BP2","v":"Алеф-банк"},{"$f":"'Исходные данные'!$BP3","v":"Алеф-банк"},"Алеф-банк","нет","нет",null,{"$f":"'Исходные данные'!$BP74","v":"Алеф-банк"},{"$f":"'Исходные данные'!$BP75","v":"Алеф-банк"},64,"08:00:00","20:00:00","нет","нет","нет","нет","нет","нет"]
[{"$f":"'Исходные данные'!$BQ2","v":"Феникс"},{"$f":"'Исходные данные'!$BQ3","v":"МТС Банк"},"нет","нет","нет",null,{"$f":"'Исходные данные'!$BQ74","v":0},{"$f":"'Исходные данные'!$BQ75","v":0},65,"нет","нет","нет","нет","нет","нет","нет","нет"]
[{"$f":"'Исходные данные'!$BR2","v":"Феникс"},{"$f":"'Исходные данные'!$BR3","v":"АК Барс банк"},{"$f":"IFERROR(IF(AND($G$2>=--J71,$G$2<=--K71),B71,\"нет\"),\"нет\")","v":"нет"},{"$f":"IFERROR(IF(AND($G$2>=--L71,$G$2<=--M71),B71,\"нет\"),\"нет\")","v":"нет"},{"$f":"IFERROR(IF(AND($G$2>=--N71,$G$2<=--O71),B71,\"нет\"),\"нет\")","v":"АК Барс банк"},null,{"$f":"'Исходные данные'!$BR74","v":0},{"$f":"'Исходные данные'!$BR75","v":0},66,"нет","нет","05:00:00","14:59:00","15:00:00","20:00:00","нет","нет"]
[{"$f":"'Исходные данные'!$BS2","v":"Феникс"},{"$f":"'Исходные данные'!$BS3","v":"Абсолют Банк"},"нет","нет","Абсолют Банк",null,{"$f":"'Исходные данные'!$BS74","v":"Феникс"},{"$f":"'Исходные данные'!$BS75","v":"Абсолют Банк"},67,"нет","нет","05:00:00","14:59:00","15:00:00","20:00:00","нет","нет"]
[{"$f":"'Исходные данные'!$BT2","v":"Реалист Банк"},{"$f":"'Исходные данные'!$BT3","v":"Реалист Банк"},"нет","нет","Реалист Банк",null,{"$f":"'Исходные данные'!$BT74","v":0},{"$f":"'Исходные данные'!$BT75","v":0},68,"нет","нет","05:00:00","14:59:00","15:00:00","20:00:00","нет","нет"]
[{"$f":"'Исходные данные'!$BU2","v":"Банк Зенит"},{"$f":"'Исходные данные'!$BU3","v":"Банк Зенит"},"Банк Зенит","нет","нет",null,{"$f":"'Исходные данные'!$BU74","v":"Банк Зенит"},{"$f":"'Исходные данные'!$BU75","v":"Банк Зенит"},69,"14:00:00","20:00:00","05:00:00","13:59:00","нет","нет","нет","нет"]
[{"$f":"'Исходные данные'!$BV2","v":"МеткомБанк"},{"$f":"'Исходные данные'!$BV3","v":"МеткомБанк"},"нет","нет","МеткомБанк",null,{"$f":"'Исходные данные'!$BV74","v":0},{"$f":"'Исходные данные'!$BV75","v":0},70,"нет","нет","05:00:00","14:59:00","15:00:00","20:00:00","нет","нет"]
[{"$f":"'Исходные данные'!$BW2","v":"БизнесПоддержка"},{"$f":"'Исходные данные'!$BW3","v":"Инбанк"},"нет","нет","Инбанк",null,{"$f":"'Исходные данные'!$BW74","v":0},{"$f":"'Исходные данные'!$BW75","v":0},71,"нет","нет","05:00:00","14:59:00","15:00:00","20:00:00","нет","нет"]
[{"$f":"'Исходные данные'!$BX2","v":"СовкомБанк"},{"$f":"'Исходные данные'!$BX3","v":"СовкомБанк"},"нет","нет","нет",null,{"$f":"'Исходные данные'!$BX74","v":0},{"$f":"'Исходные данные'!$BX75","v":0},72,"нет","нет","нет","нет","нет","нет","нет","нет"]
[{"$f":"'Исходные данные'!$BY2","v":"БизнесПоддержка"},{"$f":"'Исходные данные'!$BY3","v":"Киви банк"},"нет","Киви банк","нет",null,{"$f":"'Исходные данные'!$BY74","v":0},{"$f":"'Исходные данные'!$BY75","v":0},73,"нет","нет","05:00:00","19:59:00","нет","нет","нет","нет"]

{"sheet":"Лист1","index":6,"n_rows":78,"n_cols":11,"rows_kept":78,"cut":false,"hidden":true,"merged":[]}
[]
[]
[]
[]
[null,"0","наименование банка","площадка","Зайнетдинова Кристина ","Попова Анастасия","Алексей К.",null,"Зайнетдинова Кристина ","Попова Анастасия","Алексей К."]
[{"$f":"Лист2!A6","v":"СберБанк"},{"$f":"Лист2!B6","v":"СберБанк"},{"$f":"Лист2!H6","v":0},{"$f":"IF(Лист2!G6=0,0,IF(Лист2!G6=Лист2!H6,0,Лист2!G6))","v":0},{"$f":"IF(Таблица1[[#This Row],[наименование банка]]=0,0,IF(Таблица1[[#This Row],[наименование банка]]=A6,Таблица5[[#This Row],[Зайнетдинова Кристина ]],0))","v":0},{"$f":"IF(Таблица1[[#This Row],[наименование банка]]=0,0,IF(Таблица1[[#This Row],[наименование банка]]=A6,Таблица5[[#This Row],[Попова Анастасия]],0))","v":0},{"$f":"IF(Таблица1[[#This Row],[наименование банка]]=0,0,IF(Таблица1[[#This Row],[наименование банка]]=A6,Таблица5[[#This Row],[Алексей К.]],0))","v":0},null,{"$f":"IF(Таблица5[[#This Row],[Зайнетдинова Кристина ]]=\"нет\",0,IF(Таблица1[[#This Row],[0]]=A6,0,Лист2!G6))","v":0},{"$f":"IF(Таблица5[[#This Row],[Попова Анастасия]]=\"нет\",0,IF(Таблица1[[#This Row],[0]]=A6,0,Лист2!G6))","v":0},{"$f":"IF(Таблица5[[#This Row],[Алексей К.]]=\"нет\",0,IF(Таблица1[[#This Row],[0]]=A6,0,Лист2!G6))","v":0}]
[{"$f":"Лист2!A7","v":"СеверГазБанк"},{"$f":"Лист2!B7","v":"СеверГазБанк"},{"$f":"Лист2!H7","v":0},{"$f":"IF(Лист2!G7=0,0,IF(Лист2!G7=Лист2!H7,0,Лист2!G7))","v":0},{"$f":"IF(Таблица1[[#This Row],[наименование банка]]=0,0,IF(Таблица1[[#This Row],[наименование банка]]=A7,Таблица5[[#This Row],[Зайнетдинова Кристина ]],0))","v":0},{"$f":"IF(Таблица1[[#This Row],[наименование банка]]=0,0,IF(Таблица1[[#This Row],[наименование банка]]=A7,Таблица5[[#This Row],[Попова Анастасия]],0))","v":0},{"$f":"IF(Таблица1[[#This Row],[наименование банка]]=0,0,IF(Таблица1[[#This Row],[наименование банка]]=A7,Таблица5[[#This Row],[Алексей К.]],0))","v":0},null,{"$f":"IF(Таблица5[[#This Row],[Зайнетдинова Кристина ]]=\"нет\",0,IF(Таблица1[[#This Row],[0]]=A7,0,Лист2!G7))","v":0},{"$f":"IF(Таблица5[[#This Row],[Попова Анастасия]]=\"нет\",0,IF(Таблица1[[#This Row],[0]]=A7,0,Лист2!G7))","v":0},{"$f":"IF(Таблица5[[#This Row],[Алексей К.]]=\"нет\",0,IF(Таблица1[[#This Row],[0]]=A7,0,Лист2!G7))","v":0}]
[{"$f":"Лист2!A8","v":"ВБЦ"},{"$f":"Лист2!B8","v":"ГазПромБанк"},{"$f":"Лист2!H8","v":0},{"$f":"IF(Лист2!G8=0,0,IF(Лист2!G8=Лист2!H8,0,Лист2!G8))","v":0},{"$f":"IF(Таблица1[[#This Row],[наименование банка]]=0,0,IF(Таблица1[[#This Row],[наименование банка]]=A8,Таблица5[[#This Row],[Зайнетдинова Кристина ]],0))","v":0},{"$f":"IF(Таблица1[[#This Row],[наименование банка]]=0,0,IF(Таблица1[[#This Row],[наименование банка]]=A8,Таблица5[[#This Row],[Попова Анастасия]],0))","v":0},{"$f":"IF(Таблица1[[#This Row],[наименование банка]]=0,0,IF(Таблица1[[#This Row],[наименование банка]]=A8,Таблица5[[#This Row],[Алексей К.]],0))","v":0},null,{"$f":"IF(Таблица5[[#This Row],[Зайнетдинова Кристина ]]=\"нет\",0,IF(Таблица1[[#This Row],[0]]=A8,0,Лист2!G8))","v":0},{"$f":"IF(Таблица5[[#This Row],[Попова Анастасия]]=\"нет\",0,IF(Таблица1[[#This Row],[0]]=A8,0,Лист2!G8))","v":0},{"$f":"IF(Таблица5[[#This Row],[Алексей К.]]=\"нет\",0,IF(Таблица1[[#This Row],[0]]=A8,0,Лист2!G8))","v":0}]
[{"$f":"Лист2!A9","v":"ВБЦ"},{"$f":"Лист2!B9","v":"МКБ Банк"},{"$f":"Лист2!H9","v":0},{"$f":"IF(Лист2!G9=0,0,IF(Лист2!G9=Лист2!H9,0,Лист2!G9))","v":0},{"$f":"IF(Таблица1[[#This Row],[наименование банка]]=0,0,IF(Таблица1[[#This Row],[наименование банка]]=A9,Таблица5[[#This Row],[Зайнетдинова Кристина ]],0))","v":0},{"$f":"IF(Таблица1[[#This Row],[наименование банка]]=0,0,IF(Таблица1[[#This Row],[наименование банка]]=A9,Таблица5[[#This Row],[Попова Анастасия]],0))","v":0},{"$f":"IF(Таблица1[[#This Row],[наименование банка]]=0,0,IF(Таблица1[[#This Row],[наименование банка]]=A9,Таблица5[[#This Row],[Алексей К.]],0))","v":0},null,{"$f":"IF(Таблица5[[#This Row],[Зайнетдинова Кристина ]]=\"нет\",0,IF(Таблица1[[#This Row],[0]]=A9,0,Лист2!G9))","v":0},{"$f":"IF(Таблица5[[#This Row],[Попова Анастасия]]=\"нет\",0,IF(Таблица1[[#This Row],[0]]=A9,0,Лист2!G9))","v":0},{"$f":"IF(Таблица5[[#This Row],[Алексей К.]]=\"нет\",0,IF(Таблица1[[#This Row],[0]]=A9,0,Лист2!G9))","v":0}]
[{"$f":"Лист2!A10","v":"ВБЦ"},{"$f":"Лист2!B10","v":"СМП Банк"},{"$f":"Лист2!H10","v":"СМП Банк"},{"$f":"IF(Лист2!G10=0,0,IF(Лист2!G10=Лист2!H10,0,Лист2!G10))","v":"ВБЦ"},{"$f":"IF(Таблица1[[#This Row],[наименование банка]]=0,0,IF(Таблица1[[#This Row],[наименование банка]]=A10,Таблица5[[#This Row],[Зайнетдинова Кристина ]],0))","v":0},{"$f":"IF(Таблица1[[#This Row],[наименование банка]]=0,0,IF(Таблица1[[#This Row],[наименование банка]]=A10,Таблица5[[#This Row],[Попова Анастасия]],0))","v":0},{"$f":"IF(Таблица1[[#This Row],[наименование банка]]=0,0,IF(Таблица1[[#This Row],[наименование банка]]=A10,Таблица5[[#This Row],[Алексей К.]],0))","v":0},null,{"$f":"IF(Таблица5[[#This Row],[Зайнетдинова Кристина ]]=\"нет\",0,IF(Таблица1[[#This Row],[0]]=A10,0,Лист2!G10))","v":0},{"$f":"IF(Таблица5[[#This Row],[Попова Анастасия]]=\"нет\",0,IF(Таблица1[[#This Row],[0]]=A10,0,Лист2!G10))","v":0},{"$f":"IF(Таблица5[[#This Row],[Алексей К.]]=\"нет\",0,IF(Таблица1[[#This Row],[0]]=A10,0,Лист2!G10))","v":"ВБЦ"}]
[{"$f":"Лист2!A11","v":"ВБЦ"},{"$f":"Лист2!B11","v":"АК Барс банк"},{"$f":"Лист2!H11","v":0},{"$f":"IF(Лист2!G11=0,0,IF(Лист2!G11=Лист2!H11,0,Лист2!G11))","v":0},{"$f":"IF(Таблица1[[#This Row],[наименование банка]]=0,0,IF(Таблица1[[#This Row],[наименование банка]]=A11,Таблица5[[#This Row],[Зайнетдинова Кристина ]],0))","v":0},{"$f":"IF(Таблица1[[#This Row],[наименование банка]]=0,0,IF(Таблица1[[#This Row],[наименование банка]]=A11,Таблица5[[#This Row],[Попова Анастасия]],0))","v":0},{"$f":"IF(Таблица1[[#This Row],[наименование банка]]=0,0,IF(Таблица1[[#This Row],[наименование банка]]=A11,Таблица5[[#This Row],[Алексей К.]],0))","v":0},null,{"$f":"IF(Таблица5[[#This Row],[Зайнетдинова Кристина ]]=\"нет\",0,IF(Таблица1[[#This Row],[0]]=A11,0,Лист2!G11))","v":0},{"$f":"IF(Таблица5[[#This Row],[Попова Анастасия]]=\"нет\",0,IF(Таблица1[[#This Row],[0]]=A11,0,Лист2!G11))","v":0},{"$f":"IF(Таблица5[[#This Row],[Алексей К.]]=\"нет\",0,IF(Таблица1[[#This Row],[0]]=A11,0,Лист2!G11))","v":0}]
[{"$f":"Лист2!A12","v":"ВБЦ"},{"$f":"Лист2!B12","v":"Санкт-Петербург Банк"},{"$f":"Лист2!H12","v":0},{"$f":"IF(Лист2!G12=0,0,IF(Лист2!G12=Лист2!H12,0,Лист2!G12))","v":0},{"$f":"IF(Таблица1[[#This Row],[наименование банка]]=0,0,IF(Таблица1[[#This Row],[наименование банка]]=A12,Таблица5[[#This Row],[Зайнетдинова Кристина ]],0))","v":0},{"$f":"IF(Таблица1[[#This Row],[наименование банка]]=0,0,IF(Таблица1[[#This Row],[наименование банка]]=A12,Таблица5[[#This Row],[Попова Анастасия]],0))","v":0},{"$f":"IF(Таблица1[[#This Row],[наименование банка]]=0,0,IF(Таблица1[[#This Row],[наименование банка]]=A12,Таблица5[[#This Row],[Алексей К.]],0))","v":0},null,{"$f":"IF(Таблица5[[#This Row],[Зайнетдинова Кристина ]]=\"нет\",0,IF(Таблица1[[#This Row],[0]]=A12,0,Лист2!G12))","v":0},{"$f":"IF(Таблица5[[#This Row],[Попова Анастасия]]=\"нет\",0,IF(Таблица1[[#This Row],[0]]=A12,0,Лист2!G12))","v":0},{"$f":"IF(Таблица5[[#This Row],[Алексей К.]]=\"нет\",0,IF(Таблица1[[#This Row],[0]]=A12,0,Лист2!G12))","v":0}]
[{"$f":"Лист2!A13","v":"ВБЦ"},{"$f":"Лист2!B13","v":"УралсибБанк"},{"$f":"Лист2!H13","v":0},{"$f":"IF(Лист2!G13=0,0,IF(Лист2!G13=Лист2!H13,0,Лист2!G13))","v":0},{"$f":"IF(Таблица1[[#This Row],[наименование банка]]=0,0,IF(Таблица1[[#This Row],[наименование банка]]=A13,Таблица5[[#This Row],[Зайнетдинова Кристина ]],0))","v":0},{"$f":"IF(Таблица1[[#This Row],[наименование банка]]=0,0,IF(Таблица1[[#This Row],[наименование банка]]=A13,Таблица5[[#This Row],[Попова Анастасия]],0))","v":0},{"$f":"IF(Таблица1[[#This Row],[наименование банка]]=0,0,IF(Таблица1[[#This Row],[наименование банка]]=A13,Таблица5[[#This Row],[Алексей К.]],0))","v":0},null,{"$f":"IF(Таблица5[[#This Row],[Зайнетдинова Кристина ]]=\"нет\",0,IF(Таблица1[[#This Row],[0]]=A13,0,Лист2!G13))","v":0},{"$f":"IF(Таблица5[[#This Row],[Попова Анастасия]]=\"нет\",0,IF(Таблица1[[#This Row],[0]]=A13,0,Лист2!G13))","v":0},{"$f":"IF(Таблица5[[#This Row],[Алексей К.]]=\"нет\",0,IF(Таблица1[[#This Row],[0]]=A13,0,Лист2!G13))","v":0}]
[{"$f":"Лист2!A14","v":"ВБЦ"},{"$f":"Лист2!B14","v":"МинБанк"},{"$f":"Лист2!H14","v":0},{"$f":"IF(Лист2!G14=0,0,IF(Лист2!G14=Лист2!H14,0,Лист2!G14))","v":0},{"$f":"IF(Таблица1[[#This Row],[наименование банка]]=0,0,IF(Таблица1[[#This Row],[наименование банка]]=A14,Таблица5[[#This Row],[Зайнетдинова Кристина ]],0))","v":0},{"$f":"IF(Таблица1[[#This Row],[наименование банка]]=0,0,IF(Таблица1[[#This Row],[наименование банка]]=A14,Таблица5[[#This Row],[Попова Анастасия]],0))","v":0},{"$f":"IF(Таблица1[[#This Row],[наименование банка]]=0,0,IF(Таблица1[[#This Row],[наименование банка]]=A14,Таблица5[[#This Row],[Алексей К.]],0))","v":0},null,{"$f":"IF(Таблица5[[#This Row],[Зайнетдинова Кристина ]]=\"нет\",0,IF(Таблица1[[#This Row],[0]]=A14,0,Лист2!G14))","v":0},{"$f":"IF(Таблица5[[#This Row],[Попова Анастасия]]=\"нет\",0,IF(Таблица1[[#This Row],[0]]=A14,0,Лист2!G14))","v":0},{"$f":"IF(Таблица5[[#This Row],[Алексей К.]]=\"нет\",0,IF(Таблица1[[#This Row],[0]]=A14,0,Лист2!G14))","v":0}]
[{"$f":"Лист2!A15","v":"ВБЦ"},{"$f":"Лист2!B15","v":"РосБанк"},{"$f":"Лист2!H15","v":0},{"$f":"IF(Лист2!G15=0,0,IF(Лист2!G15=Лист2!H15,0,Лист2!G15))","v":0},{"$f":"IF(Таблица1[[#This Row],[наименование банка]]=0,0,IF(Таблица1[[#This Row],[наименование банка]]=A15,Таблица5[[#This Row],[Зайнетдинова Кристина ]],0))","v":0},{"$f":"IF(Таблица1[[#This Row],[наименование банка]]=0,0,IF(Таблица1[[#This Row],[наименование банка]]=A15,Таблица5[[#This Row],[Попова Анастасия]],0))","v":0},{"$f":"IF(Таблица1[[#This Row],[наименование банка]]=0,0,IF(Таблица1[[#This Row],[наименование банка]]=A15,Таблица5[[#This Row],[Алексей К.]],0))","v":0},null,{"$f":"IF(Таблица5[[#This Row],[Зайнетдинова Кристина ]]=\"нет\",0,IF(Таблица1[[#This Row],[0]]=A15,0,Лист2!G15))","v":0},{"$f":"IF(Таблица5[[#This Row],[Попова Анастасия]]=\"нет\",0,IF(Таблица1[[#This Row],[0]]=A15,0,Лист2!G15))","v":0},{"$f":"IF(Таблица5[[#This Row],[Алексей К.]]=\"нет\",0,IF(Таблица1[[#This Row],[0]]=A15,0,Лист2!G15))","v":0}]
[{"$f":"Лист2!A16","v":"ВБЦ"},{"$f":"Лист2!B16","v":"МТС Банк"},{"$f":"Лист2!H16","v":0},{"$f":"IF(Лист2!G16=0,0,IF(Лист2!G16=Лист2!H16,0,Лист2!G16))","v":0},{"$f":"IF(Таблица1[[#This Row],[наименование банка]]=0,0,IF(Таблица1[[#This Row],[наименование банка]]=A16,Таблица5[[#This Row],[Зайнетдинова Кристина ]],0))","v":0},{"$f":"IF(Таблица1[[#This Row],[наименование банка]]=0,0,IF(Таблица1[[#This Row],[наименование банка]]=A16,Таблица5[[#This Row],[Попова Анастасия]],0))","v":0},{"$f":"IF(Таблица1[[#This Row],[наименование банка]]=0,0,IF(Таблица1[[#This Row],[наименование банка]]=A16,Таблица5[[#This Row],[Алексей К.]],0))","v":0},null,{"$f":"IF(Таблица5[[#This Row],[Зайнетдинова Кристина ]]=\"нет\",0,IF(Таблица1[[#This Row],[0]]=A16,0,Лист2!G16))","v":0},{"$f":"IF(Таблица5[[#This Row],[Попова Анастасия]]=\"нет\",0,IF(Таблица1[[#This Row],[0]]=A16,0,Лист2!G16))","v":0},{"$f":"IF(Таблица5[[#This Row],[Алексей К.]]=\"нет\",0,IF(Таблица1[[#This Row],[0]]=A16,0,Лист2!G16))","v":0}]
[{"$f":"Лист2!A17","v":"ВБЦ"},{"$f":"Лист2!B17","v":"Союз Банк"},{"$f":"Лист2!H17","v":0},{"$f":"IF(Лист2!G17=0,0,IF(Лист2!G17=Лист2!H17,0,Лист2!G17))","v":0},{"$f":"IF(Таблица1[[#This Row],[наименование банка]]=0,0,IF(Таблица1[[#This Row],[наименование банка]]=A17,Таблица5[[#This Row],[Зайнетдинова Кристина ]],0))","v":0},{"$f":"IF(Таблица1[[#This Row],[наименование банка]]=0,0,IF(Таблица1[[#This Row],[наименование банка]]=A17,Таблица5[[#This Row],[Попова Анастасия]],0))","v":0},{"$f":"IF(Таблица1[[#This Row],[наименование банка]]=0,0,IF(Таблица1[[#This Row],[наименование банка]]=A17,Таблица5[[#This Row],[Алексей К.]],0))","v":0},null,{"$f":"IF(Таблица5[[#This Row],[Зайнетдинова Кристина ]]=\"нет\",0,IF(Таблица1[[#This Row],[0]]=A17,0,Лист2!G17))","v":0},{"$f":"IF(Таблица5[[#This Row],[Попова Анастасия]]=\"нет\",0,IF(Таблица1[[#This Row],[0]]=A17,0,Лист2!G17))","v":0},{"$f":"IF(Таблица5[[#This Row],[Алексей К.]]=\"нет\",0,IF(Таблица1[[#This Row],[0]]=A17,0,Лист2!G17))","v":0}]
[{"$f":"Лист2!A18","v":"ВБЦ"},{"$f":"Лист2!B18","v":"Русский Стандарт"},{"$f":"Лист2!H18","v":0},{"$f":"IF(Лист2!G18=0,0,IF(Лист2!G18=Лист2!H18,0,Лист2!G18))","v":0},{"$f":"IF(Таблица1[[#This Row],[наименование банка]]=0,0,IF(Таблица1[[#This Row],[наименование банка]]=A18,Таблица5[[#This Row],[Зайнетдинова Кристина ]],0))","v":0},{"$f":"IF(Таблица1[[#This Row],[наименование банка]]=0,0,IF(Таблица1[[#This Row],[наименование банка]]=A18,Таблица5[[#This Row],[Попова Анастасия]],0))","v":0},{"$f":"IF(Таблица1[[#This Row],[наименование банка]]=0,0,IF(Таблица1[[#This Row],[наименование банка]]=A18,Таблица5[[#This Row],[Алексей К.]],0))","v":0},null,{"$f":"IF(Таблица5[[#This Row],[Зайнетдинова Кристина ]]=\"нет\",0,IF(Таблица1[[#This Row],[0]]=A18,0,Лист2!G18))","v":0},{"$f":"IF(Таблица5[[#This Row],[Попова Анастасия]]=\"нет\",0,IF(Таблица1[[#This Row],[0]]=A18,0,Лист2!G18))","v":0},{"$f":"IF(Таблица5[[#This Row],[Алексей К.]]=\"нет\",0,IF(Таблица1[[#This Row],[0]]=A18,0,Лист2!G18))","v":0}]
[{"$f":"Лист2!A19","v":"ВБЦ"},{"$f":"Лист2!B19","v":"Банк Зенит"},{"$f":"Лист2!H19","v":"Банк Зенит"},{"$f":"IF(Лист2!G19=0,0,IF(Лист2!G19=Лист2!H19,0,Лист2!G19))","v":"ВБЦ"},{"$f":"IF(Таблица1[[#This Row],[наименование банка]]=0,0,IF(Таблица1[[#This Row],[наименование банка]]=A19,Таблица5[[#This Row],[Зайнетдинова Кристина ]],0))","v":0},{"$f":"IF(Таблица1[[#This Row],[наименование банка]]=0,0,IF(Таблица1[[#This Row],[наименование банка]]=A19,Таблица5[[#This Row],[Попова Анастасия]],0))","v":0},{"$f":"IF(Таблица1[[#This Row],[наименование банка]]=0,0,IF(Таблица1[[#This Row],[наименование банка]]=A19,Таблица5[[#This Row],[Алексей К.]],0))","v":0},null,{"$f":"IF(Таблица5[[#This Row],[Зайнетдинова Кристина ]]=\"нет\",0,IF(Таблица1[[#This Row],[0]]=A19,0,Лист2!G19))","v":0},{"$f":"IF(Таблица5[[#This Row],[Попова Анастасия]]=\"нет\",0,IF(Таблица1[[#This Row],[0]]=A19,0,Лист2!G19))","v":0},{"$f":"IF(Таблица5[[#This Row],[Алексей К.]]=\"нет\",0,IF(Таблица1[[#This Row],[0]]=A19,0,Лист2!G19))","v":"ВБЦ"}]
[{"$f":"Лист2!A20","v":"ВБЦ"},{"$f":"Лист2!B20","v":"Инбанк"},{"$f":"Лист2!H20","v":0},{"$f":"IF(Лист2!G20=0,0,IF(Лист2!G20=Лист2!H20,0,Лист2!G20))","v":0},{"$f":"IF(Таблица1[[#This Row],[наименование банка]]=0,0,IF(Таблица1[[#This Row],[наименование банка]]=A20,Таблица5[[#This Row],[Зайнетдинова Кристина ]],0))","v":0},{"$f":"IF(Таблица1[[#This Row],[наименование банка]]=0,0,IF(Таблица1[[#This Row],[наименование банка]]=A20,Таблица5[[#This Row],[Попова Анастасия]],0))","v":0},{"$f":"IF(Таблица1[[#This Row],[наименование банка]]=0,0,IF(Таблица1[[#This Row],[наименование банка]]=A20,Таблица5[[#This Row],[Алексей К.]],0))","v":0},null,{"$f":"IF(Таблица5[[#This Row],[Зайнетдинова Кристина ]]=\"нет\",0,IF(Таблица1[[#This Row],[0]]=A20,0,Лист2!G20))","v":0},{"$f":"IF(Таблица5[[#This Row],[Попова Анастасия]]=\"нет\",0,IF(Таблица1[[#This Row],[0]]=A20,0,Лист2!G20))","v":0},{"$f":"IF(Таблица5[[#This Row],[Алексей К.]]=\"нет\",0,IF(Таблица1[[#This Row],[0]]=A20,0,Лист2!G20))","v":0}]
[{"$f":"Лист2!A21","v":"TenderHelp"},{"$f":"Лист2!B21","v":"МСП Банк"},{"$f":"Лист2!H21","v":0},{"$f":"IF(Лист2!G21=0,0,IF(Лист2!G21=Лист2!H21,0,Лист2!G21))","v":0},{"$f":"IF(Таблица1[[#This Row],[наименование банка]]=0,0,IF(Таблица1[[#This Row],[наименование банка]]=A21,Таблица5[[#This Row],[Зайнетдинова Кристина ]],0))","v":0},{"$f":"IF(Таблица1[[#This Row],[наименование банка]]=0,0,IF(Таблица1[[#This Row],[наименование банка]]=A21,Таблица5[[#This Row],[Попова Анастасия]],0))","v":0},{"$f":"IF(Таблица1[[#This Row],[наименование банка]]=0,0,IF(Таблица1[[#This Row],[наименование банка]]=A21,Таблица5[[#This Row],[Алексей К.]],0))","v":0},null,{"$f":"IF(Таблица5[[#This Row],[Зайнетдинова Кристина ]]=\"нет\",0,IF(Таблица1[[#This Row],[0]]=A21,0,Лист2!G21))","v":0},{"$f":"IF(Таблица5[[#This Row],[Попова Анастасия]]=\"нет\",0,IF(Таблица1[[#This Row],[0]]=A21,0,Лист2!G21))","v":0},{"$f":"IF(Таблица5[[#This Row],[Алексей К.]]=\"нет\",0,IF(Таблица1[[#This Row],[0]]=A21,0,Лист2!G21))","v":0}]
[{"$f":"Лист2!A22","v":"TenderHelp"},{"$f":"Лист2!B22","v":"Банк Россия"},{"$f":"Лист2!H22","v":0},{"$f":"IF(Лист2!G22=0,0,IF(Лист2!G22=Лист2!H22,0,Лист2!G22))","v":0},{"$f":"IF(Таблица1[[#This Row],[наименование банка]]=0,0,IF(Таблица1[[#This Row],[наименование банка]]=A22,Таблица5[[#This Row],[Зайнетдинова Кристина ]],0))","v":0},{"$f":"IF(Таблица1[[#This Row],[наименование банка]]=0,0,IF(Таблица1[[#This Row],[наименование банка]]=A22,Таблица5[[#This Row],[Попова Анастасия]],0))","v":0},{"$f":"IF(Таблица1[[#This Row],[наименование банка]]=0,0,IF(Таблица1[[#This Row],[наименование банка]]=A22,Таблица5[[#This Row],[Алексей К.]],0))","v":0},null,{"$f":"IF(Таблица5[[#This Row],[Зайнетдинова Кристина ]]=\"нет\",0,IF(Таблица1[[#This Row],[0]]=A22,0,Лист2!G22))","v":0},{"$f":"IF(Таблица5[[#This Row],[Попова Анастасия]]=\"нет\",0,IF(Таблица1[[#This Row],[0]]=A22,0,Лист2!G22))","v":0},{"$f":"IF(Таблица5[[#This Row],[Алексей К.]]=\"нет\",0,IF(Таблица1[[#This Row],[0]]=A22,0,Лист2!G22))","v":0}]
[{"$f":"Лист2!A23","v":"TenderHelp"},{"$f":"Лист2!B23","v":"Киви банк"},{"$f":"Лист2!H23","v":0},{"$f":"IF(Лист2!G23=0,0,IF(Лист2!G23=Лист2!H23,0,Лист2!G23))","v":0},{"$f":"IF(Таблица1[[#This Row],[наименование банка]]=0,0,IF(Таблица1[[#This Row],[наименование банка]]=A23,Таблица5[[#This Row],[Зайнетдинова Кристина ]],0))","v":0},{"$f":"IF(Таблица1[[#This Row],[наименование банка]]=0,0,IF(Таблица1[[#This Row],[наименование банка]]=A23,Таблица5[[#This Row],[Попова Анастасия]],0))","v":0},{"$f":"IF(Таблица1[[#This Row],[наименование банка]]=0,0,IF(Таблица1[[#This Row],[наименование банка]]=A23,Таблица5[[#This Row],[Алексей К.]],0))","v":0},null,{"$f":"IF(Таблица5[[#This Row],[Зайнетдинова Кристина ]]=\"нет\",0,IF(Таблица1[[#This Row],[0]]=A23,0,Лист2!G23))","v":0},{"$f":"IF(Таблица5[[#This Row],[Попова Анастасия]]=\"нет\",0,IF(Таблица1[[#This Row],[0]]=A23,0,Лист2!G23))","v":0},{"$f":"IF(Таблица5[[#This Row],[Алексей К.]]=\"нет\",0,IF(Таблица1[[#This Row],[0]]=A23,0,Лист2!G23))","v":0}]
[{"$f":"Лист2!A24","v":"TenderHelp"},{"$f":"Лист2!B24","v":"Инбанк"},{"$f":"Лист2!H24","v":0},{"$f":"IF(Лист2!G24=0,0,IF(Лист2!G24=Лист2!H24,0,Лист2!G24))","v":0},{"$f":"IF(Таблица1[[#This Row],[наименование банка]]=0,0,IF(Таблица1[[#This Row],[наименование банка]]=A24,Таблица5[[#This Row],[Зайнетдинова Кристина ]],0))","v":0},{"$f":"IF(Таблица1[[#This Row],[наименование банка]]=0,0,IF(Таблица1[[#This Row],[наименование банка]]=A24,Таблица5[[#This Row],[Попова Анастасия]],0))","v":0},{"$f":"IF(Таблица1[[#This Row],[наименование банка]]=0,0,IF(Таблица1[[#This Row],[наименование банка]]=A24,Таблица5[[#This Row],[Алексей К.]],0))","v":0},null,{"$f":"IF(Таблица5[[#This Row],[Зайнетдинова Кристина ]]=\"нет\",0,IF(Таблица1[[#This Row],[0]]=A24,0,Лист2!G24))","v":0},{"$f":"IF(Таблица5[[#This Row],[Попова Анастасия]]=\"нет\",0,IF(Таблица1[[#This Row],[0]]=A24,0,Лист2!G24))","v":0},{"$f":"IF(Таблица5[[#This Row],[Алексей К.]]=\"нет\",0,IF(Таблица1[[#This Row],[0]]=A24,0,Лист2!G24))","v":0}]
[{"$f":"Лист2!A25","v":"TenderHelp"},{"$f":"Лист2!B25","v":"ПромСвязьБанк"},{"$f":"Лист2!H25","v":0},{"$f":"IF(Лист2!G25=0,0,IF(Лист2!G25=Лист2!H25,0,Лист2!G25))","v":0},{"$f":"IF(Таблица1[[#This Row],[наименование банка]]=0,0,IF(Таблица1[[#This Row],[наименование банка]]=A25,Таблица5[[#This Row],[Зайнетдинова Кристина ]],0))","v":0},{"$f":"IF(Таблица1[[#This Row],[наименование банка]]=0,0,IF(Таблица1[[#This Row],[наименование банка]]=A25,Таблица5[[#This Row],[Попова Анастасия]],0))","v":0},{"$f":"IF(Таблица1[[#This Row],[наименование банка]]=0,0,IF(Таблица1[[#This Row],[наименование банка]]=A25,Таблица5[[#This Row],[Алексей К.]],0))","v":0},null,{"$f":"IF(Таблица5[[#This Row],[Зайнетдинова Кристина ]]=\"нет\",0,IF(Таблица1[[#This Row],[0]]=A25,0,Лист2!G25))","v":0},{"$f":"IF(Таблица5[[#This Row],[Попова Анастасия]]=\"нет\",0,IF(Таблица1[[#This Row],[0]]=A25,0,Лист2!G25))","v":0},{"$f":"IF(Таблица5[[#This Row],[Алексей К.]]=\"нет\",0,IF(Таблица1[[#This Row],[0]]=A25,0,Лист2!G25))","v":0}]
[{"$f":"Лист2!A26","v":"TenderHelp"},{"$f":"Лист2!B26","v":"МеталлИнвестБанк"},{"$f":"Лист2!H26","v":"МеталлИнвестБанк"},{"$f":"IF(Лист2!G26=0,0,IF(Лист2!G26=Лист2!H26,0,Лист2!G26))","v":"TenderHelp"},{"$f":"IF(Таблица1[[#This Row],[наименование банка]]=0,0,IF(Таблица1[[#This Row],[наименование банка]]=A26,Таблица5[[#This Row],[Зайнетдинова Кристина ]],0))","v":0},{"$f":"IF(Таблица1[[#This Row],[наименование банка]]=0,0,IF(Таблица1[[#This Row],[наименование банка]]=A26,Таблица5[[#This Row],[Попова Анастасия]],0))","v":0},{"$f":"IF(Таблица1[[#This Row],[наименование банка]]=0,0,IF(Таблица1[[#This Row],[наименование банка]]=A26,Таблица5[[#This Row],[Алексей К.]],0))","v":0},null,{"$f":"IF(Таблица5[[#This Row],[Зайнетдинова Кристина ]]=\"нет\",0,IF(Таблица1[[#This Row],[0]]=A26,0,Лист2!G26))","v":"TenderHelp"},{"$f":"IF(Таблица5[[#This Row],[Попова Анастасия]]=\"нет\",0,IF(Таблица1[[#This Row],[0]]=A26,0,Лист2!G26))","v":0},{"$f":"IF(Таблица5[[#This Row],[Алексей К.]]=\"нет\",0,IF(Таблица1[[#This Row],[0]]=A26,0,Лист2!G26))","v":0}]
[{"$f":"Лист2!A27","v":"TenderHelp"},{"$f":"Лист2!B27","v":"Санкт-Петербург Банк"},{"$f":"Лист2!H27","v":0},{"$f":"IF(Лист2!G27=0,0,IF(Лист2!G27=Лист2!H27,0,Лист2!G27))","v":0},{"$f":"IF(Таблица1[[#This Row],[наименование банка]]=0,0,IF(Таблица1[[#This Row],[наименование банка]]=A27,Таблица5[[#This Row],[Зайнетдинова Кристина ]],0))","v":0},{"$f":"IF(Таблица1[[#This Row],[наименование банка]]=0,0,IF(Таблица1[[#This Row],[наименование банка]]=A27,Таблица5[[#This Row],[Попова Анастасия]],0))","v":0},{"$f":"IF(Таблица1[[#This Row],[наименование банка]]=0,0,IF(Таблица1[[#This Row],[наименование банка]]=A27,Таблица5[[#This Row],[Алексей К.]],0))","v":0},null,{"$f":"IF(Таблица5[[#This Row],[Зайнетдинова Кристина ]]=\"нет\",0,IF(Таблица1[[#This Row],[0]]=A27,0,Лист2!G27))","v":0},{"$f":"IF(Таблица5[[#This Row],[Попова Анастасия]]=\"нет\",0,IF(Таблица1[[#This Row],[0]]=A27,0,Лист2!G27))","v":0},{"$f":"IF(Таблица5[[#This Row],[Алексей К.]]=\"нет\",0,IF(Таблица1[[#This Row],[0]]=A27,0,Лист2!G27))","v":0}]
[{"$f":"Лист2!A28","v":"TenderHelp"},{"$f":"Лист2!B28","v":"Абсолют Банк"},{"$f":"Лист2!H28","v":"Абсолют Банк"},{"$f":"IF(Лист2!G28=0,0,IF(Лист2!G28=Лист2!H28,0,Лист2!G28))","v":"TenderHelp"},{"$f":"IF(Таблица1[[#This Row],[наименование банка]]=0,0,IF(Таблица1[[#This Row],[наименование банка]]=A28,Таблица5[[#This Row],[Зайнетдинова Кристина ]],0))","v":0},{"$f":"IF(Таблица1[[#This Row],[наименование банка]]=0,0,IF(Таблица1[[#This Row],[наименование банка]]=A28,Таблица5[[#This Row],[Попова Анастасия]],0))","v":0},{"$f":"IF(Таблица1[[#This Row],[наименование банка]]=0,0,IF(Таблица1[[#This Row],[наименование банка]]=A28,Таблица5[[#This Row],[Алексей К.]],0))","v":0},null,{"$f":"IF(Таблица5[[#This Row],[Зайнетдинова Кристина ]]=\"нет\",0,IF(Таблица1[[#This Row],[0]]=A28,0,Лист2!G28))","v":"TenderHelp"},{"$f":"IF(Таблица5[[#This Row],[Попова Анастасия]]=\"нет\",0,IF(Таблица1[[#This Row],[0]]=A28,0,Лист2!G28))","v":0},{"$f":"IF(Таблица5[[#This Row],[Алексей К.]]=\"нет\",0,IF(Таблица1[[#This Row],[0]]=A28,0,Лист2!G28))","v":0}]
[{"$f":"Лист2!A29","v":"TenderHelp"},{"$f":"Лист2!B29","v":"Альфа-банк"},{"$f":"Лист2!H29","v":0},{"$f":"IF(Лист2!G29=0,0,IF(Лист2!G29=Лист2!H29,0,Лист2!G29))","v":0},{"$f":"IF(Таблица1[[#This Row],[наименование банка]]=0,0,IF(Таблица1[[#This Row],[наименование банка]]=A29,Таблица5[[#This Row],[Зайнетдинова Кристина ]],0))","v":0},{"$f":"IF(Таблица1[[#This Row],[наименование банка]]=0,0,IF(Таблица1[[#This Row],[наименование банка]]=A29,Таблица5[[#This Row],[Попова Анастасия]],0))","v":0},{"$f":"IF(Таблица1[[#This Row],[наименование банка]]=0,0,IF(Таблица1[[#This Row],[наименование банка]]=A29,Таблица5[[#This Row],[Алексей К.]],0))","v":0},null,{"$f":"IF(Таблица5[[#This Row],[Зайнетдинова Кристина ]]=\"нет\",0,IF(Таблица1[[#This Row],[0]]=A29,0,Лист2!G29))","v":0},{"$f":"IF(Таблица5[[#This Row],[Попова Анастасия]]=\"нет\",0,IF(Таблица1[[#This Row],[0]]=A29,0,Лист2!G29))","v":0},{"$f":"IF(Таблица5[[#This Row],[Алексей К.]]=\"нет\",0,IF(Таблица1[[#This Row],[0]]=A29,0,Лист2!G29))","v":0}]
[{"$f":"Лист2!A30","v":"TenderHelp"},{"$f":"Лист2!B30","v":"СберБанк"},{"$f":"Лист2!H30","v":0},{"$f":"IF(Лист2!G30=0,0,IF(Лист2!G30=Лист2!H30,0,Лист2!G30))","v":0},{"$f":"IF(Таблица1[[#This Row],[наименование банка]]=0,0,IF(Таблица1[[#This Row],[наименование банка]]=A30,Таблица5[[#This Row],[Зайнетдинова Кристина ]],0))","v":0},{"$f":"IF(Таблица1[[#This Row],[наименование банка]]=0,0,IF(Таблица1[[#This Row],[наименование банка]]=A30,Таблица5[[#This Row],[Попова Анастасия]],0))","v":0},{"$f":"IF(Таблица1[[#This Row],[наименование банка]]=0,0,IF(Таблица1[[#This Row],[наименование банка]]=A30,Таблица5[[#This Row],[Алексей К.]],0))","v":0},null,{"$f":"IF(Таблица5[[#This Row],[Зайнетдинова Кристина ]]=\"нет\",0,IF(Таблица1[[#This Row],[0]]=A30,0,Лист2!G30))","v":0},{"$f":"IF(Таблица5[[#This Row],[Попова Анастасия]]=\"нет\",0,IF(Таблица1[[#This Row],[0]]=A30,0,Лист2!G30))","v":0},{"$f":"IF(Таблица5[[#This Row],[Алексей К.]]=\"нет\",0,IF(Таблица1[[#This Row],[0]]=A30,0,Лист2!G30))","v":0}]
[{"$f":"Лист2!A31","v":"TenderHuв"},{"$f":"Лист2!B31","v":"МеталлИнвестБанк"},{"$f":"Лист2!H31","v":"МеталлИнвестБанк"},{"$f":"IF(Лист2!G31=0,0,IF(Лист2!G31=Лист2!H31,0,Лист2!G31))","v":"TenderHuв"},{"$f":"IF(Таблица1[[#This Row],[наименование банка]]=0,0,IF(Таблица1[[#This Row],[наименование банка]]=A31,Таблица5[[#This Row],[Зайнетдинова Кристина ]],0))","v":0},{"$f":"IF(Таблица1[[#This Row],[наименование банка]]=0,0,IF(Таблица1[[#This Row],[наименование банка]]=A31,Таблица5[[#This Row],[Попова Анастасия]],0))","v":0},{"$f":"IF(Таблица1[[#This Row],[наименование банка]]=0,0,IF(Таблица1[[#This Row],[наименование банка]]=A31,Таблица5[[#This Row],[Алексей К.]],0))","v":0},null,{"$f":"IF(Таблица5[[#This Row],[Зайнетдинова Кристина ]]=\"нет\",0,IF(Таблица1[[#This Row],[0]]=A31,0,Лист2!G31))","v":0},{"$f":"IF(Таблица5[[#This Row],[Попова Анастасия]]=\"нет\",0,IF(Таблица1[[#This Row],[0]]=A31,0,Лист2!G31))","v":0},{"$f":"IF(Таблица5[[#This Row],[Алексей К.]]=\"нет\",0,IF(Таблица1[[#This Row],[0]]=A31,0,Лист2!G31))","v":0}]
[{"$f":"Лист2!A32","v":"TenderHuв"},{"$f":"Лист2!B32","v":"SBI Банк"},{"$f":"Лист2!H32","v":0},{"$f":"IF(Лист2!G32=0,0,IF(Лист2!G32=Лист2!H32,0,Лист2!G32))","v":0},{"$f":"IF(Таблица1[[#This Row],[наименование банка]]=0,0,IF(Таблица1[[#This Row],[наименование банка]]=A32,Таблица5[[#This Row],[Зайнетдинова Кристина ]],0))","v":0},{"$f":"IF(Таблица1[[#This Row],[наименование банка]]=0,0,IF(Таблица1[[#This Row],[наименование банка]]=A32,Таблица5[[#This Row],[Попова Анастасия]],0))","v":0},{"$f":"IF(Таблица1[[#This Row],[наименование банка]]=0,0,IF(Таблица1[[#This Row],[наименование банка]]=A32,Таблица5[[#This Row],[Алексей К.]],0))","v":0},null,{"$f":"IF(Таблица5[[#This Row],[Зайнетдинова Кристина ]]=\"нет\",0,IF(Таблица1[[#This Row],[0]]=A32,0,Лист2!G32))","v":0},{"$f":"IF(Таблица5[[#This Row],[Попова Анастасия]]=\"нет\",0,IF(Таблица1[[#This Row],[0]]=A32,0,Лист2!G32))","v":0},{"$f":"IF(Таблица5[[#This Row],[Алексей К.]]=\"нет\",0,IF(Таблица1[[#This Row],[0]]=A32,0,Лист2!G32))","v":0}]
[{"$f":"Лист2!A33","v":"АТФИН"},{"$f":"Лист2!B33","v":"ЭкспоБанк"},{"$f":"Лист2!H33","v":0},{"$f":"IF(Лист2!G33=0,0,IF(Лист2!G33=Лист2!H33,0,Лист2!G33))","v":0},{"$f":"IF(Таблица1[[#This Row],[наименование банка]]=0,0,IF(Таблица1[[#This Row],[наименование банка]]=A33,Таблица5[[#This Row],[Зайнетдинова Кристина ]],0))","v":0},{"$f":"IF(Таблица1[[#This Row],[наименование банка]]=0,0,IF(Таблица1[[#This Row],[наименование банка]]=A33,Таблица5[[#This Row],[Попова Анастасия]],0))","v":0},{"$f":"IF(Таблица1[[#This Row],[наименование банка]]=0,0,IF(Таблица1[[#This Row],[наименование банка]]=A33,Таблица5[[#This Row],[Алексей К.]],0))","v":0},null,{"$f":"IF(Таблица5[[#This Row],[Зайнетдинова Кристина ]]=\"нет\",0,IF(Таблица1[[#This Row],[0]]=A33,0,Лист2!G33))","v":0},{"$f":"IF(Таблица5[[#This Row],[Попова Анастасия]]=\"нет\",0,IF(Таблица1[[#This Row],[0]]=A33,0,Лист2!G33))","v":0},{"$f":"IF(Таблица5[[#This Row],[Алексей К.]]=\"нет\",0,IF(Таблица1[[#This Row],[0]]=A33,0,Лист2!G33))","v":0}]
[{"$f":"Лист2!A34","v":"АТФИН"},{"$f":"Лист2!B34","v":"Кредит Европа Банк"},{"$f":"Лист2!H34","v":0},{"$f":"IF(Лист2!G34=0,0,IF(Лист2!G34=Лист2!H34,0,Лист2!G34))","v":0},{"$f":"IF(Таблица1[[#This Row],[наименование банка]]=0,0,IF(Таблица1[[#This Row],[наименование банка]]=A34,Таблица5[[#This Row],[Зайнетдинова Кристина ]],0))","v":0},{"$f":"IF(Таблица1[[#This Row],[наименование банка]]=0,0,IF(Таблица1[[#This Row],[наименование банка]]=A34,Таблица5[[#This Row],[Попова Анастасия]],0))","v":0},{"$f":"IF(Таблица1[[#This Row],[наименование банка]]=0,0,IF(Таблица1[[#This Row],[наименование банка]]=A34,Таблица5[[#This Row],[Алексей К.]],0))","v":0},null,{"$f":"IF(Таблица5[[#This Row],[Зайнетдинова Кристина ]]=\"нет\",0,IF(Таблица1[[#This Row],[0]]=A34,0,Лист2!G34))","v":0},{"$f":"IF(Таблица5[[#This Row],[Попова Анастасия]]=\"нет\",0,IF(Таблица1[[#This Row],[0]]=A34,0,Лист2!G34))","v":0},{"$f":"IF(Таблица5[[#This Row],[Алексей К.]]=\"нет\",0,IF(Таблица1[[#This Row],[0]]=A34,0,Лист2!G34))","v":0}]
[{"$f":"Лист2!A35","v":"АТФИН"},{"$f":"Лист2!B35","v":"СДМ-Банк"},{"$f":"Лист2!H35","v":0},{"$f":"IF(Лист2!G35=0,0,IF(Лист2!G35=Лист2!H35,0,Лист2!G35))","v":0},{"$f":"IF(Таблица1[[#This Row],[наименование банка]]=0,0,IF(Таблица1[[#This Row],[наименование банка]]=A35,Таблица5[[#This Row],[Зайнетдинова Кристина ]],0))","v":0},{"$f":"IF(Таблица1[[#This Row],[наименование банка]]=0,0,IF(Таблица1[[#This Row],[наименование банка]]=A35,Таблица5[[#This Row],[Попова Анастасия]],0))","v":0},{"$f":"IF(Таблица1[[#This Row],[наименование банка]]=0,0,IF(Таблица1[[#This Row],[наименование банка]]=A35,Таблица5[[#This Row],[Алексей К.]],0))","v":0},null,{"$f":"IF(Таблица5[[#This Row],[Зайнетдинова Кристина ]]=\"нет\",0,IF(Таблица1[[#This Row],[0]]=A35,0,Лист2!G35))","v":0},{"$f":"IF(Таблица5[[#This Row],[Попова Анастасия]]=\"нет\",0,IF(Таблица1[[#This Row],[0]]=A35,0,Лист2!G35))","v":0},{"$f":"IF(Таблица5[[#This Row],[Алексей К.]]=\"нет\",0,IF(Таблица1[[#This Row],[0]]=A35,0,Лист2!G35))","v":0}]
[{"$f":"Лист2!A36","v":"АТФИН"},{"$f":"Лист2!B36","v":"Первоуральский Банк"},{"$f":"Лист2!H36","v":0},{"$f":"IF(Лист2!G36=0,0,IF(Лист2!G36=Лист2!H36,0,Лист2!G36))","v":0},{"$f":"IF(Таблица1[[#This Row],[наименование банка]]=0,0,IF(Таблица1[[#This Row],[наименование банка]]=A36,Таблица5[[#This Row],[Зайнетдинова Кристина ]],0))","v":0},{"$f":"IF(Таблица1[[#This Row],[наименование банка]]=0,0,IF(Таблица1[[#This Row],[наименование банка]]=A36,Таблица5[[#This Row],[Попова Анастасия]],0))","v":0},{"$f":"IF(Таблица1[[#This Row],[наименование банка]]=0,0,IF(Таблица1[[#This Row],[наименование банка]]=A36,Таблица5[[#This Row],[Алексей К.]],0))","v":0},null,{"$f":"IF(Таблица5[[#This Row],[Зайнетдинова Кристина ]]=\"нет\",0,IF(Таблица1[[#This Row],[0]]=A36,0,Лист2!G36))","v":0},{"$f":"IF(Таблица5[[#This Row],[Попова Анастасия]]=\"нет\",0,IF(Таблица1[[#This Row],[0]]=A36,0,Лист2!G36))","v":0},{"$f":"IF(Таблица5[[#This Row],[Алексей К.]]=\"нет\",0,IF(Таблица1[[#This Row],[0]]=A36,0,Лист2!G36))","v":0}]
[{"$f":"Лист2!A37","v":"АТФИН"},{"$f":"Лист2!B37","v":"Кубань Кредит Банк"},{"$f":"Лист2!H37","v":0},{"$f":"IF(Лист2!G37=0,0,IF(Лист2!G37=Лист2!H37,0,Лист2!G37))","v":0},{"$f":"IF(Таблица1[[#This Row],[наименование банка]]=0,0,IF(Таблица1[[#This Row],[наименование банка]]=A37,Таблица5[[#This Row],[Зайнетдинова Кристина ]],0))","v":0},{"$f":"IF(Таблица1[[#This Row],[наименование банка]]=0,0,IF(Таблица1[[#This Row],[наименование банка]]=A37,Таблица5[[#This Row],[Попова Анастасия]],0))","v":0},{"$f":"IF(Таблица1[[#This Row],[наименование банка]]=0,0,IF(Таблица1[[#This Row],[наименование банка]]=A37,Таблица5[[#This Row],[Алексей К.]],0))","v":0},null,{"$f":"IF(Таблица5[[#This Row],[Зайнетдинова Кристина ]]=\"нет\",0,IF(Таблица1[[#This Row],[0]]=A37,0,Лист2!G37))","v":0},{"$f":"IF(Таблица5[[#This Row],[Попова Анастасия]]=\"нет\",0,IF(Таблица1[[#This Row],[0]]=A37,0,Лист2!G37))","v":0},{"$f":"IF(Таблица5[[#This Row],[Алексей К.]]=\"нет\",0,IF(Таблица1[[#This Row],[0]]=A37,0,Лист2!G37))","v":0}]
[{"$f":"Лист2!A38","v":"АТФИН"},{"$f":"Лист2!B38","v":"Примсоцбанк"},{"$f":"Лист2!H38","v":0},{"$f":"IF(Лист2!G38=0,0,IF(Лист2!G38=Лист2!H38,0,Лист2!G38))","v":0},{"$f":"IF(Таблица1[[#This Row],[наименование банка]]=0,0,IF(Таблица1[[#This Row],[наименование банка]]=A38,Таблица5[[#This Row],[Зайнетдинова Кристина ]],0))","v":0},{"$f":"IF(Таблица1[[#This Row],[наименование банка]]=0,0,IF(Таблица1[[#This Row],[наименование банка]]=A38,Таблица5[[#This Row],[Попова Анастасия]],0))","v":0},{"$f":"IF(Таблица1[[#This Row],[наименование банка]]=0,0,IF(Таблица1[[#This Row],[наименование банка]]=A38,Таблица5[[#This Row],[Алексей К.]],0))","v":0},null,{"$f":"IF(Таблица5[[#This Row],[Зайнетдинова Кристина ]]=\"нет\",0,IF(Таблица1[[#This Row],[0]]=A38,0,Лист2!G38))","v":0},{"$f":"IF(Таблица5[[#This Row],[Попова Анастасия]]=\"нет\",0,IF(Таблица1[[#This Row],[0]]=A38,0,Лист2!G38))","v":0},{"$f":"IF(Таблица5[[#This Row],[Алексей К.]]=\"нет\",0,IF(Таблица1[[#This Row],[0]]=A38,0,Лист2!G38))","v":0}]
[{"$f":"Лист2!A39","v":"МоскомБанк"},{"$f":"Лист2!B39","v":"МоскомБанк"},{"$f":"Лист2!H39","v":0},{"$f":"IF(Лист2!G39=0,0,IF(Лист2!G39=Лист2!H39,0,Лист2!G39))","v":0},{"$f":"IF(Таблица1[[#This Row],[наименование банка]]=0,0,IF(Таблица1[[#This Row],[наименование банка]]=A39,Таблица5[[#This Row],[Зайнетдинова Кристина ]],0))","v":0},{"$f":"IF(Таблица1[[#This Row],[наименование банка]]=0,0,IF(Таблица1[[#This Row],[наименование банка]]=A39,Таблица5[[#This Row],[Попова Анастасия]],0))","v":0},{"$f":"IF(Таблица1[[#This Row],[наименование банка]]=0,0,IF(Таблица1[[#This Row],[наименование банка]]=A39,Таблица5[[#This Row],[Алексей К.]],0))","v":0},null,{"$f":"IF(Таблица5[[#This Row],[Зайнетдинова Кристина ]]=\"нет\",0,IF(Таблица1[[#This Row],[0]]=A39,0,Лист2!G39))","v":0},{"$f":"IF(Таблица5[[#This Row],[Попова Анастасия]]=\"нет\",0,IF(Таблица1[[#This Row],[0]]=A39,0,Лист2!G39))","v":0},{"$f":"IF(Таблица5[[#This Row],[Алексей К.]]=\"нет\",0,IF(Таблица1[[#This Row],[0]]=A39,0,Лист2!G39))","v":0}]
[{"$f":"Лист2!A40","v":"ignetik"},{"$f":"Лист2!B40","v":"МТС Банк"},{"$f":"Лист2!H40","v":0},{"$f":"IF(Лист2!G40=0,0,IF(Лист2!G40=Лист2!H40,0,Лист2!G40))","v":0},{"$f":"IF(Таблица1[[#This Row],[наименование банка]]=0,0,IF(Таблица1[[#This Row],[наименование банка]]=A40,Таблица5[[#This Row],[Зайнетдинова Кристина ]],0))","v":0},{"$f":"IF(Таблица1[[#This Row],[наименование банка]]=0,0,IF(Таблица1[[#This Row],[наименование банка]]=A40,Таблица5[[#This Row],[Попова Анастасия]],0))","v":0},{"$f":"IF(Таблица1[[#This Row],[наименование банка]]=0,0,IF(Таблица1[[#This Row],[наименование банка]]=A40,Таблица5[[#This Row],[Алексей К.]],0))","v":0},null,{"$f":"IF(Таблица5[[#This Row],[Зайнетдинова Кристина ]]=\"нет\",0,IF(Таблица1[[#This Row],[0]]=A40,0,Лист2!G40))","v":0},{"$f":"IF(Таблица5[[#This Row],[Попова Анастасия]]=\"нет\",0,IF(Таблица1[[#This Row],[0]]=A40,0,Лист2!G40))","v":0},{"$f":"IF(Таблица5[[#This Row],[Алексей К.]]=\"нет\",0,IF(Таблица1[[#This Row],[0]]=A40,0,Лист2!G40))","v":0}]
[{"$f":"Лист2!A41","v":"ignetik"},{"$f":"Лист2!B41","v":"Санкт-Петербург Банк"},{"$f":"Лист2!H41","v":0},{"$f":"IF(Лист2!G41=0,0,IF(Лист2!G41=Лист2!H41,0,Лист2!G41))","v":0},{"$f":"IF(Таблица1[[#This Row],[наименование банка]]=0,0,IF(Таблица1[[#This Row],[наименование банка]]=A41,Таблица5[[#This Row],[Зайнетдинова Кристина ]],0))","v":0},{"$f":"IF(Таблица1[[#This Row],[наименование банка]]=0,0,IF(Таблица1[[#This Row],[наименование банка]]=A41,Таблица5[[#This Row],[Попова Анастасия]],0))","v":0},{"$f":"IF(Таблица1[[#This Row],[наименование банка]]=0,0,IF(Таблица1[[#This Row],[наименование банка]]=A41,Таблица5[[#This Row],[Алексей К.]],0))","v":0},null,{"$f":"IF(Таблица5[[#This Row],[Зайнетдинова Кристина ]]=\"нет\",0,IF(Таблица1[[#This Row],[0]]=A41,0,Лист2!G41))","v":0},{"$f":"IF(Таблица5[[#This Row],[Попова Анастасия]]=\"нет\",0,IF(Таблица1[[#This Row],[0]]=A41,0,Лист2!G41))","v":0},{"$f":"IF(Таблица5[[#This Row],[Алексей К.]]=\"нет\",0,IF(Таблица1[[#This Row],[0]]=A41,0,Лист2!G41))","v":0}]
[{"$f":"Лист2!A42","v":"МеталлИнвестБанк"},{"$f":"Лист2!B42","v":"МеталлИнвестБанк"},{"$f":"Лист2!H42","v":"МеталлИнвестБанк"},{"$f":"IF(Лист2!G42=0,0,IF(Лист2!G42=Лист2!H42,0,Лист2!G42))","v":0},{"$f":"IF(Таблица1[[#This Row],[наименование банка]]=0,0,IF(Таблица1[[#This Row],[наименование банка]]=A42,Таблица5[[#This Row],[Зайнетдинова Кристина ]],0))","v":"нет"},{"$f":"IF(Таблица1[[#This Row],[наименование банка]]=0,0,IF(Таблица1[[#This Row],[наименование банка]]=A42,Таблица5[[#This Row],[Попова Анастасия]],0))","v":"нет"},{"$f":"IF(Таблица1[[#This Row],[наименование банка]]=0,0,IF(Таблица1[[#This Row],[наименование банка]]=A42,Таблица5[[#This Row],[Алексей К.]],0))","v":"МеталлИнвестБанк"},null,{"$f":"IF(Таблица5[[#This Row],[Зайнетдинова Кристина ]]=\"нет\",0,IF(Таблица1[[#This Row],[0]]=A42,0,Лист2!G42))","v":0},{"$f":"IF(Таблица5[[#This Row],[Попова Анастасия]]=\"нет\",0,IF(Таблица1[[#This Row],[0]]=A42,0,Лист2!G42))","v":0},{"$f":"IF(Таблица5[[#This Row],[Алексей К.]]=\"нет\",0,IF(Таблица1[[#This Row],[0]]=A42,0,Лист2!G42))","v":0}]
[{"$f":"Лист2!A43","v":"ЛокоБанк"},{"$f":"Лист2!B43","v":"ЛокоБанк"},{"$f":"Лист2!H43","v":0},{"$f":"IF(Лист2!G43=0,0,IF(Лист2!G43=Лист2!H43,0,Лист2!G43))","v":0},{"$f":"IF(Таблица1[[#This Row],[наименование банка]]=0,0,IF(Таблица1[[#This Row],[наименование банка]]=A43,Таблица5[[#This Row],[Зайнетдинова Кристина ]],0))","v":0},{"$f":"IF(Таблица1[[#This Row],[наименование банка]]=0,0,IF(Таблица1[[#This Row],[наименование банка]]=A43,Таблица5[[#This Row],[Попова Анастасия]],0))","v":0},{"$f":"IF(Таблица1[[#This Row],[наименование банка]]=0,0,IF(Таблица1[[#This Row],[наименование банка]]=A43,Таблица5[[#This Row],[Алексей К.]],0))","v":0},null,{"$f":"IF(Таблица5[[#This Row],[Зайнетдинова Кристина ]]=\"нет\",0,IF(Таблица1[[#This Row],[0]]=A43,0,Лист2!G43))","v":0},{"$f":"IF(Таблица5[[#This Row],[Попова Анастасия]]=\"нет\",0,IF(Таблица1[[#This Row],[0]]=A43,0,Лист2!G43))","v":0},{"$f":"IF(Таблица5[[#This Row],[Алексей К.]]=\"нет\",0,IF(Таблица1[[#This Row],[0]]=A43,0,Лист2!G43))","v":0}]
[{"$f":"Лист2!A44","v":"ТендерТех"},{"$f":"Лист2!B44","v":"РГС Банк"},{"$f":"Лист2!H44","v":0},{"$f":"IF(Лист2!G44=0,0,IF(Лист2!G44=Лист2!H44,0,Лист2!G44))","v":0},{"$f":"IF(Таблица1[[#This Row],[наименование банка]]=0,0,IF(Таблица1[[#This Row],[наименование банка]]=A44,Таблица5[[#This Row],[Зайнетдинова Кристина ]],0))","v":0},{"$f":"IF(Таблица1[[#This Row],[наименование банка]]=0,0,IF(Таблица1[[#This Row],[наименование банка]]=A44,Таблица5[[#This Row],[Попова Анастасия]],0))","v":0},{"$f":"IF(Таблица1[[#This Row],[наименование банка]]=0,0,IF(Таблица1[[#This Row],[наименование банка]]=A44,Таблица5[[#This Row],[Алексей К.]],0))","v":0},null,{"$f":"IF(Таблица5[[#This Row],[Зайнетдинова Кристина ]]=\"нет\",0,IF(Таблица1[[#This Row],[0]]=A44,0,Лист2!G44))","v":0},{"$f":"IF(Таблица5[[#This Row],[Попова Анастасия]]=\"нет\",0,IF(Таблица1[[#This Row],[0]]=A44,0,Лист2!G44))","v":0},{"$f":"IF(Таблица5[[#This Row],[Алексей К.]]=\"нет\",0,IF(Таблица1[[#This Row],[0]]=A44,0,Лист2!G44))","v":0}]
[{"$f":"Лист2!A45","v":"ТендерТех"},{"$f":"Лист2!B45","v":"Союз Банк"},{"$f":"Лист2!H45","v":0},{"$f":"IF(Лист2!G45=0,0,IF(Лист2!G45=Лист2!H45,0,Лист2!G45))","v":0},{"$f":"IF(Таблица1[[#This Row],[наименование банка]]=0,0,IF(Таблица1[[#This Row],[наименование банка]]=A45,Таблица5[[#This Row],[Зайнетдинова Кристина ]],0))","v":0},{"$f":"IF(Таблица1[[#This Row],[наименование банка]]=0,0,IF(Таблица1[[#This Row],[наименование банка]]=A45,Таблица5[[#This Row],[Попова Анастасия]],0))","v":0},{"$f":"IF(Таблица1[[#This Row],[наименование банка]]=0,0,IF(Таблица1[[#This Row],[наименование банка]]=A45,Таблица5[[#This Row],[Алексей К.]],0))","v":0},null,{"$f":"IF(Таблица5[[#This Row],[Зайнетдинова Кристина ]]=\"нет\",0,IF(Таблица1[[#This Row],[0]]=A45,0,Лист2!G45))","v":0},{"$f":"IF(Таблица5[[#This Row],[Попова Анастасия]]=\"нет\",0,IF(Таблица1[[#This Row],[0]]=A45,0,Лист2!G45))","v":0},{"$f":"IF(Таблица5[[#This Row],[Алексей К.]]=\"нет\",0,IF(Таблица1[[#This Row],[0]]=A45,0,Лист2!G45))","v":0}]
[{"$f":"Лист2!A46","v":"ТендерТех"},{"$f":"Лист2!B46","v":"УралсибБанк"},{"$f":"Лист2!H46","v":0},{"$f":"IF(Лист2!G46=0,0,IF(Лист2!G46=Лист2!H46,0,Лист2!G46))","v":0},{"$f":"IF(Таблица1[[#This Row],[наименование банка]]=0,0,IF(Таблица1[[#This Row],[наименование банка]]=A46,Таблица5[[#This Row],[Зайнетдинова Кристина ]],0))","v":0},{"$f":"IF(Таблица1[[#This Row],[наименование банка]]=0,0,IF(Таблица1[[#This Row],[наименование банка]]=A46,Таблица5[[#This Row],[Попова Анастасия]],0))","v":0},{"$f":"IF(Таблица1[[#This Row],[наименование банка]]=0,0,IF(Таблица1[[#This Row],[наименование банка]]=A46,Таблица5[[#This Row],[Алексей К.]],0))","v":0},null,{"$f":"IF(Таблица5[[#This Row],[Зайнетдинова Кристина ]]=\"нет\",0,IF(Таблица1[[#This Row],[0]]=A46,0,Лист2!G46))","v":0},{"$f":"IF(Таблица5[[#This Row],[Попова Анастасия]]=\"нет\",0,IF(Таблица1[[#This Row],[0]]=A46,0,Лист2!G46))","v":0},{"$f":"IF(Таблица5[[#This Row],[Алексей К.]]=\"нет\",0,IF(Таблица1[[#This Row],[0]]=A46,0,Лист2!G46))","v":0}]
[{"$f":"Лист2!A47","v":"ТендерТех"},{"$f":"Лист2!B47","v":"ТКБ Банк"},{"$f":"Лист2!H47","v":0},{"$f":"IF(Лист2!G47=0,0,IF(Лист2!G47=Лист2!H47,0,Лист2!G47))","v":0},{"$f":"IF(Таблица1[[#This Row],[наименование банка]]=0,0,IF(Таблица1[[#This Row],[наименование банка]]=A47,Таблица5[[#This Row],[Зайнетдинова Кристина ]],0))","v":0},{"$f":"IF(Таблица1[[#This Row],[наименование банка]]=0,0,IF(Таблица1[[#This Row],[наименование банка]]=A47,Таблица5[[#This Row],[Попова Анастасия]],0))","v":0},{"$f":"IF(Таблица1[[#This Row],[наименование банка]]=0,0,IF(Таблица1[[#This Row],[наименование банка]]=A47,Таблица5[[#This Row],[Алексей К.]],0))","v":0},null,{"$f":"IF(Таблица5[[#This Row],[Зайнетдинова Кристина ]]=\"нет\",0,IF(Таблица1[[#This Row],[0]]=A47,0,Лист2!G47))","v":0},{"$f":"IF(Таблица5[[#This Row],[Попова Анастасия]]=\"нет\",0,IF(Таблица1[[#This Row],[0]]=A47,0,Лист2!G47))","v":0},{"$f":"IF(Таблица5[[#This Row],[Алексей К.]]=\"нет\",0,IF(Таблица1[[#This Row],[0]]=A47,0,Лист2!G47))","v":0}]
[{"$f":"Лист2!A48","v":"ТендерТех"},{"$f":"Лист2!B48","v":"Росбанк"},{"$f":"Лист2!H48","v":0},{"$f":"IF(Лист2!G48=0,0,IF(Лист2!G48=Лист2!H48,0,Лист2!G48))","v":0},{"$f":"IF(Таблица1[[#This Row],[наименование банка]]=0,0,IF(Таблица1[[#This Row],[наименование банка]]=A48,Таблица5[[#This Row],[Зайнетдинова Кристина ]],0))","v":0},{"$f":"IF(Таблица1[[#This Row],[наименование банка]]=0,0,IF(Таблица1[[#This Row],[наименование банка]]=A48,Таблица5[[#This Row],[Попова Анастасия]],0))","v":0},{"$f":"IF(Таблица1[[#This Row],[наименование банка]]=0,0,IF(Таблица1[[#This Row],[наименование банка]]=A48,Таблица5[[#This Row],[Алексей К.]],0))","v":0},null,{"$f":"IF(Таблица5[[#This Row],[Зайнетдинова Кристина ]]=\"нет\",0,IF(Таблица1[[#This Row],[0]]=A48,0,Лист2!G48))","v":0},{"$f":"IF(Таблица5[[#This Row],[Попова Анастасия]]=\"нет\",0,IF(Таблица1[[#This Row],[0]]=A48,0,Лист2!G48))","v":0},{"$f":"IF(Таблица5[[#This Row],[Алексей К.]]=\"нет\",0,IF(Таблица1[[#This Row],[0]]=A48,0,Лист2!G48))","v":0}]
[{"$f":"Лист2!A49","v":"ТендерТех"},{"$f":"Лист2!B49","v":"Банк Зенит"},{"$f":"Лист2!H49","v":"Банк Зенит"},{"$f":"IF(Лист2!G49=0,0,IF(Лист2!G49=Лист2!H49,0,Лист2!G49))","v":"ТендерТех"},{"$f":"IF(Таблица1[[#This Row],[наименование банка]]=0,0,IF(Таблица1[[#This Row],[наименование банка]]=A49,Таблица5[[#This Row],[Зайнетдинова Кристина ]],0))","v":0},{"$f":"IF(Таблица1[[#This Row],[наименование банка]]=0,0,IF(Таблица1[[#This Row],[наименование банка]]=A49,Таблица5[[#This Row],[Попова Анастасия]],0))","v":0},{"$f":"IF(Таблица1[[#This Row],[наименование банка]]=0,0,IF(Таблица1[[#This Row],[наименование банка]]=A49,Таблица5[[#This Row],[Алексей К.]],0))","v":0},null,{"$f":"IF(Таблица5[[#This Row],[Зайнетдинова Кристина ]]=\"нет\",0,IF(Таблица1[[#This Row],[0]]=A49,0,Лист2!G49))","v":"ТендерТех"},{"$f":"IF(Таблица5[[#This Row],[Попова Анастасия]]=\"нет\",0,IF(Таблица1[[#This Row],[0]]=A49,0,Лист2!G49))","v":0},{"$f":"IF(Таблица5[[#This Row],[Алексей К.]]=\"нет\",0,IF(Таблица1[[#This Row],[0]]=A49,0,Лист2!G49))","v":0}]
[{"$f":"Лист2!A50","v":"Гособлако"},{"$f":"Лист2!B50","v":"ПромСвязьБанк"},{"$f":"Лист2!H50","v":0},{"$f":"IF(Лист2!G50=0,0,IF(Лист2!G50=Лист2!H50,0,Лист2!G50))","v":0},{"$f":"IF(Таблица1[[#This Row],[наименование банка]]=0,0,IF(Таблица1[[#This Row],[наименование банка]]=A50,Таблица5[[#This Row],[Зайнетдинова Кристина ]],0))","v":0},{"$f":"IF(Таблица1[[#This Row],[наименование банка]]=0,0,IF(Таблица1[[#This Row],[наименование банка]]=A50,Таблица5[[#This Row],[Попова Анастасия]],0))","v":0},{"$f":"IF(Таблица1[[#This Row],[наименование банка]]=0,0,IF(Таблица1[[#This Row],[наименование банка]]=A50,Таблица5[[#This Row],[Алексей К.]],0))","v":0},null,{"$f":"IF(Таблица5[[#This Row],[Зайнетдинова Кристина ]]=\"нет\",0,IF(Таблица1[[#This Row],[0]]=A50,0,Лист2!G50))","v":0},{"$f":"IF(Таблица5[[#This Row],[Попова Анастасия]]=\"нет\",0,IF(Таблица1[[#This Row],[0]]=A50,0,Лист2!G50))","v":0},{"$f":"IF(Таблица5[[#This Row],[Алексей К.]]=\"нет\",0,IF(Таблица1[[#This Row],[0]]=A50,0,Лист2!G50))","v":0}]
[{"$f":"Лист2!A51","v":"Альфа-банк"},{"$f":"Лист2!B51","v":"Альфа-банк"},{"$f":"Лист2!H51","v":0},{"$f":"IF(Лист2!G51=0,0,IF(Лист2!G51=Лист2!H51,0,Лист2!G51))","v":0},{"$f":"IF(Таблица1[[#This Row],[наименование банка]]=0,0,IF(Таблица1[[#This Row],[наименование банка]]=A51,Таблица5[[#This Row],[Зайнетдинова Кристина ]],0))","v":0},{"$f":"IF(Таблица1[[#This Row],[наименование банка]]=0,0,IF(Таблица1[[#This Row],[наименование банка]]=A51,Таблица5[[#This Row],[Попова Анастасия]],0))","v":0},{"$f":"IF(Таблица1[[#This Row],[наименование банка]]=0,0,IF(Таблица1[[#This Row],[наименование банка]]=A51,Таблица5[[#This Row],[Алексей К.]],0))","v":0},null,{"$f":"IF(Таблица5[[#This Row],[Зайнетдинова Кристина ]]=\"нет\",0,IF(Таблица1[[#This Row],[0]]=A51,0,Лист2!G51))","v":0},{"$f":"IF(Таблица5[[#This Row],[Попова Анастасия]]=\"нет\",0,IF(Таблица1[[#This Row],[0]]=A51,0,Лист2!G51))","v":0},{"$f":"IF(Таблица5[[#This Row],[Алексей К.]]=\"нет\",0,IF(Таблица1[[#This Row],[0]]=A51,0,Лист2!G51))","v":0}]
[{"$f":"Лист2!A52","v":"Goodfin"},{"$f":"Лист2!B52","v":"ПочтаБанк"},{"$f":"Лист2!H52","v":0},{"$f":"IF(Лист2!G52=0,0,IF(Лист2!G52=Лист2!H52,0,Лист2!G52))","v":0},{"$f":"IF(Таблица1[[#This Row],[наименование банка]]=0,0,IF(Таблица1[[#This Row],[наименование банка]]=A52,Таблица5[[#This Row],[Зайнетдинова Кристина ]],0))","v":0},{"$f":"IF(Таблица1[[#This Row],[наименование банка]]=0,0,IF(Таблица1[[#This Row],[наименование банка]]=A52,Таблица5[[#This Row],[Попова Анастасия]],0))","v":0},{"$f":"IF(Таблица1[[#This Row],[наименование банка]]=0,0,IF(Таблица1[[#This Row],[наименование банка]]=A52,Таблица5[[#This Row],[Алексей К.]],0))","v":0},null,{"$f":"IF(Таблица5[[#This Row],[Зайнетдинова Кристина ]]=\"нет\",0,IF(Таблица1[[#This Row],[0]]=A52,0,Лист2!G52))","v":0},{"$f":"IF(Таблица5[[#This Row],[Попова Анастасия]]=\"нет\",0,IF(Таблица1[[#This Row],[0]]=A52,0,Лист2!G52))","v":0},{"$f":"IF(Таблица5[[#This Row],[Алексей К.]]=\"нет\",0,IF(Таблица1[[#This Row],[0]]=A52,0,Лист2!G52))","v":0}]
[{"$f":"Лист2!A53","v":"Goodfin"},{"$f":"Лист2!B53","v":"УралсибБанк"},{"$f":"Лист2!H53","v":0},{"$f":"IF(Лист2!G53=0,0,IF(Лист2!G53=Лист2!H53,0,Лист2!G53))","v":0},{"$f":"IF(Таблица1[[#This Row],[наименование банка]]=0,0,IF(Таблица1[[#This Row],[наименование банка]]=A53,Таблица5[[#This Row],[Зайнетдинова Кристина ]],0))","v":0},{"$f":"IF(Таблица1[[#This Row],[наименование банка]]=0,0,IF(Таблица1[[#This Row],[наименование банка]]=A53,Таблица5[[#This Row],[Попова Анастасия]],0))","v":0},{"$f":"IF(Таблица1[[#This Row],[наименование банка]]=0,0,IF(Таблица1[[#This Row],[наименование банка]]=A53,Таблица5[[#This Row],[Алексей К.]],0))","v":0},null,{"$f":"IF(Таблица5[[#This Row],[Зайнетдинова Кристина ]]=\"нет\",0,IF(Таблица1[[#This Row],[0]]=A53,0,Лист2!G53))","v":0},{"$f":"IF(Таблица5[[#This Row],[Попова Анастасия]]=\"нет\",0,IF(Таблица1[[#This Row],[0]]=A53,0,Лист2!G53))","v":0},{"$f":"IF(Таблица5[[#This Row],[Алексей К.]]=\"нет\",0,IF(Таблица1[[#This Row],[0]]=A53,0,Лист2!G53))","v":0}]
[{"$f":"Лист2!A54","v":"Goodfin"},{"$f":"Лист2!B54","v":"МТС Банк"},{"$f":"Лист2!H54","v":0},{"$f":"IF(Лист2!G54=0,0,IF(Лист2!G54=Лист2!H54,0,Лист2!G54))","v":0},{"$f":"IF(Таблица1[[#This Row],[наименование банка]]=0,0,IF(Таблица1[[#This Row],[наименование банка]]=A54,Таблица5[[#This Row],[Зайнетдинова Кристина ]],0))","v":0},{"$f":"IF(Таблица1[[#This Row],[наименование банка]]=0,0,IF(Таблица1[[#This Row],[наименование банка]]=A54,Таблица5[[#This Row],[Попова Анастасия]],0))","v":0},{"$f":"IF(Таблица1[[#This Row],[наименование банка]]=0,0,IF(Таблица1[[#This Row],[наименование банка]]=A54,Таблица5[[#This Row],[Алексей К.]],0))","v":0},null,{"$f":"IF(Таблица5[[#This Row],[Зайнетдинова Кристина ]]=\"нет\",0,IF(Таблица1[[#This Row],[0]]=A54,0,Лист2!G54))","v":0},{"$f":"IF(Таблица5[[#This Row],[Попова Анастасия]]=\"нет\",0,IF(Таблица1[[#This Row],[0]]=A54,0,Лист2!G54))","v":0},{"$f":"IF(Таблица5[[#This Row],[Алексей К.]]=\"нет\",0,IF(Таблица1[[#This Row],[0]]=A54,0,Лист2!G54))","v":0}]
[{"$f":"Лист2!A55","v":"Goodfin"},{"$f":"Лист2!B55","v":"ПромСвязьБанк"},{"$f":"Лист2!H55","v":0},{"$f":"IF(Лист2!G55=0,0,IF(Лист2!G55=Лист2!H55,0,Лист2!G55))","v":0},{"$f":"IF(Таблица1[[#This Row],[наименование банка]]=0,0,IF(Таблица1[[#This Row],[наименование банка]]=A55,Таблица5[[#This Row],[Зайнетдинова Кристина ]],0))","v":0},{"$f":"IF(Таблица1[[#This Row],[наименование банка]]=0,0,IF(Таблица1[[#This Row],[наименование банка]]=A55,Таблица5[[#This Row],[Попова Анастасия]],0))","v":0},{"$f":"IF(Таблица1[[#This Row],[наименование банка]]=0,0,IF(Таблица1[[#This Row],[наименование банка]]=A55,Таблица5[[#This Row],[Алексей К.]],0))","v":0},null,{"$f":"IF(Таблица5[[#This Row],[Зайнетдинова Кристина ]]=\"нет\",0,IF(Таблица1[[#This Row],[0]]=A55,0,Лист2!G55))","v":0},{"$f":"IF(Таблица5[[#This Row],[Попова Анастасия]]=\"нет\",0,IF(Таблица1[[#This Row],[0]]=A55,0,Лист2!G55))","v":0},{"$f":"IF(Таблица5[[#This Row],[Алексей К.]]=\"нет\",0,IF(Таблица1[[#This Row],[0]]=A55,0,Лист2!G55))","v":0}]
[{"$f":"Лист2!A56","v":"Goodfin"},{"$f":"Лист2!B56","v":"РГС Банк"},{"$f":"Лист2!H56","v":0},{"$f":"IF(Лист2!G56=0,0,IF(Лист2!G56=Лист2!H56,0,Лист2!G56))","v":0},{"$f":"IF(Таблица1[[#This Row],[наименование банка]]=0,0,IF(Таблица1[[#This Row],[наименование банка]]=A56,Таблица5[[#This Row],[Зайнетдинова Кристина ]],0))","v":0},{"$f":"IF(Таблица1[[#This Row],[наименование банка]]=0,0,IF(Таблица1[[#This Row],[наименование банка]]=A56,Таблица5[[#This Row],[Попова Анастасия]],0))","v":0},{"$f":"IF(Таблица1[[#This Row],[наименование банка]]=0,0,IF(Таблица1[[#This Row],[наименование банка]]=A56,Таблица5[[#This Row],[Алексей К.]],0))","v":0},null,{"$f":"IF(Таблица5[[#This Row],[Зайнетдинова Кристина ]]=\"нет\",0,IF(Таблица1[[#This Row],[0]]=A56,0,Лист2!G56))","v":0},{"$f":"IF(Таблица5[[#This Row],[Попова Анастасия]]=\"нет\",0,IF(Таблица1[[#This Row],[0]]=A56,0,Лист2!G56))","v":0},{"$f":"IF(Таблица5[[#This Row],[Алексей К.]]=\"нет\",0,IF(Таблица1[[#This Row],[0]]=A56,0,Лист2!G56))","v":0}]
[{"$f":"Лист2!A57","v":"SBI Банк"},{"$f":"Лист2!B57","v":"SBI Банк"},{"$f":"Лист2!H57","v":0},{"$f":"IF(Лист2!G57=0,0,IF(Лист2!G57=Лист2!H57,0,Лист2!G57))","v":0},{"$f":"IF(Таблица1[[#This Row],[наименование банка]]=0,0,IF(Таблица1[[#This Row],[наименование банка]]=A57,Таблица5[[#This Row],[Зайнетдинова Кристина ]],0))","v":0},{"$f":"IF(Таблица1[[#This Row],[наименование банка]]=0,0,IF(Таблица1[[#This Row],[наименование банка]]=A57,Таблица5[[#This Row],[Попова Анастасия]],0))","v":0},{"$f":"IF(Таблица1[[#This Row],[наименование банка]]=0,0,IF(Таблица1[[#This Row],[наименование банка]]=A57,Таблица5[[#This Row],[Алексей К.]],0))","v":0},null,{"$f":"IF(Таблица5[[#This Row],[Зайнетдинова Кристина ]]=\"нет\",0,IF(Таблица1[[#This Row],[0]]=A57,0,Лист2!G57))","v":0},{"$f":"IF(Таблица5[[#This Row],[Попова Анастасия]]=\"нет\",0,IF(Таблица1[[#This Row],[0]]=A57,0,Лист2!G57))","v":0},{"$f":"IF(Таблица5[[#This Row],[Алексей К.]]=\"нет\",0,IF(Таблица1[[#This Row],[0]]=A57,0,Лист2!G57))","v":0}]
[{"$f":"Лист2!A58","v":"Elfin"},{"$f":"Лист2!B58","v":"ГазПромБанк"},{"$f":"Лист2!H58","v":0},{"$f":"IF(Лист2!G58=0,0,IF(Лист2!G58=Лист2!H58,0,Лист2!G58))","v":0},{"$f":"IF(Таблица1[[#This Row],[наименование банка]]=0,0,IF(Таблица1[[#This Row],[наименование банка]]=A58,Таблица5[[#This Row],[Зайнетдинова Кристина ]],0))","v":0},{"$f":"IF(Таблица1[[#This Row],[наименование банка]]=0,0,IF(Таблица1[[#This Row],[наименование банка]]=A58,Таблица5[[#This Row],[Попова Анастасия]],0))","v":0},{"$f":"IF(Таблица1[[#This Row],[наименование банка]]=0,0,IF(Таблица1[[#This Row],[наименование банка]]=A58,Таблица5[[#This Row],[Алексей К.]],0))","v":0},null,{"$f":"IF(Таблица5[[#This Row],[Зайнетдинова Кристина ]]=\"нет\",0,IF(Таблица1[[#This Row],[0]]=A58,0,Лист2!G58))","v":0},{"$f":"IF(Таблица5[[#This Row],[Попова Анастасия]]=\"нет\",0,IF(Таблица1[[#This Row],[0]]=A58,0,Лист2!G58))","v":0},{"$f":"IF(Таблица5[[#This Row],[Алексей К.]]=\"нет\",0,IF(Таблица1[[#This Row],[0]]=A58,0,Лист2!G58))","v":0}]
[{"$f":"Лист2!A59","v":"Elfin"},{"$f":"Лист2!B59","v":"МКБ Банк"},{"$f":"Лист2!H59","v":0},{"$f":"IF(Лист2!G59=0,0,IF(Лист2!G59=Лист2!H59,0,Лист2!G59))","v":0},{"$f":"IF(Таблица1[[#This Row],[наименование банка]]=0,0,IF(Таблица1[[#This Row],[наименование банка]]=A59,Таблица5[[#This Row],[Зайнетдинова Кристина ]],0))","v":0},{"$f":"IF(Таблица1[[#This Row],[наименование банка]]=0,0,IF(Таблица1[[#This Row],[наименование банка]]=A59,Таблица5[[#This Row],[Попова Анастасия]],0))","v":0},{"$f":"IF(Таблица1[[#This Row],[наименование банка]]=0,0,IF(Таблица1[[#This Row],[наименование банка]]=A59,Таблица5[[#This Row],[Алексей К.]],0))","v":0},null,{"$f":"IF(Таблица5[[#This Row],[Зайнетдинова Кристина ]]=\"нет\",0,IF(Таблица1[[#This Row],[0]]=A59,0,Лист2!G59))","v":0},{"$f":"IF(Таблица5[[#This Row],[Попова Анастасия]]=\"нет\",0,IF(Таблица1[[#This Row],[0]]=A59,0,Лист2!G59))","v":0},{"$f":"IF(Таблица5[[#This Row],[Алексей К.]]=\"нет\",0,IF(Таблица1[[#This Row],[0]]=A59,0,Лист2!G59))","v":0}]
[{"$f":"Лист2!A60","v":"Elfin"},{"$f":"Лист2!B60","v":"Банк Зенит"},{"$f":"Лист2!H60","v":"Банк Зенит"},{"$f":"IF(Лист2!G60=0,0,IF(Лист2!G60=Лист2!H60,0,Лист2!G60))","v":"Elfin"},{"$f":"IF(Таблица1[[#This Row],[наименование банка]]=0,0,IF(Таблица1[[#This Row],[наименование банка]]=A60,Таблица5[[#This Row],[Зайнетдинова Кристина ]],0))","v":0},{"$f":"IF(Таблица1[[#This Row],[наименование банка]]=0,0,IF(Таблица1[[#This Row],[наименование банка]]=A60,Таблица5[[#This Row],[Попова Анастасия]],0))","v":0},{"$f":"IF(Таблица1[[#This Row],[наименование банка]]=0,0,IF(Таблица1[[#This Row],[наименование банка]]=A60,Таблица5[[#This Row],[Алексей К.]],0))","v":0},null,{"$f":"IF(Таблица5[[#This Row],[Зайнетдинова Кристина ]]=\"нет\",0,IF(Таблица1[[#This Row],[0]]=A60,0,Лист2!G60))","v":0},{"$f":"IF(Таблица5[[#This Row],[Попова Анастасия]]=\"нет\",0,IF(Таблица1[[#This Row],[0]]=A60,0,Лист2!G60))","v":0},{"$f":"IF(Таблица5[[#This Row],[Алексей К.]]=\"нет\",0,IF(Таблица1[[#This Row],[0]]=A60,0,Лист2!G60))","v":"Elfin"}]
[{"$f":"Лист2!A61","v":"Elfin"},{"$f":"Лист2!B61","v":"Санкт-Петербург Банк"},{"$f":"Лист2!H61","v":0},{"$f":"IF(Лист2!G61=0,0,IF(Лист2!G61=Лист2!H61,0,Лист2!G61))","v":0},{"$f":"IF(Таблица1[[#This Row],[наименование банка]]=0,0,IF(Таблица1[[#This Row],[наименование банка]]=A61,Таблица5[[#This Row],[Зайнетдинова Кристина ]],0))","v":0},{"$f":"IF(Таблица1[[#This Row],[наименование банка]]=0,0,IF(Таблица1[[#This Row],[наименование банка]]=A61,Таблица5[[#This Row],[Попова Анастасия]],0))","v":0},{"$f":"IF(Таблица1[[#This Row],[наименование банка]]=0,0,IF(Таблица1[[#This Row],[наименование банка]]=A61,Таблица5[[#This Row],[Алексей К.]],0))","v":0},null,{"$f":"IF(Таблица5[[#This Row],[Зайнетдинова Кристина ]]=\"нет\",0,IF(Таблица1[[#This Row],[0]]=A61,0,Лист2!G61))","v":0},{"$f":"IF(Таблица5[[#This Row],[Попова Анастасия]]=\"нет\",0,IF(Таблица1[[#This Row],[0]]=A61,0,Лист2!G61))","v":0},{"$f":"IF(Таблица5[[#This Row],[Алексей К.]]=\"нет\",0,IF(Таблица1[[#This Row],[0]]=A61,0,Лист2!G61))","v":0}]
[{"$f":"Лист2!A62","v":"А-План"},{"$f":"Лист2!B62","v":"АТБ Банк"},{"$f":"Лист2!H62","v":0},{"$f":"IF(Лист2!G62=0,0,IF(Лист2!G62=Лист2!H62,0,Лист2!G62))","v":0},{"$f":"IF(Таблица1[[#This Row],[наименование банка]]=0,0,IF(Таблица1[[#This Row],[наименование банка]]=A62,Таблица5[[#This Row],[Зайнетдинова Кристина ]],0))","v":0},{"$f":"IF(Таблица1[[#This Row],[наименование банка]]=0,0,IF(Таблица1[[#This Row],[наименование банка]]=A62,Таблица5[[#This Row],[Попова Анастасия]],0))","v":0},{"$f":"IF(Таблица1[[#This Row],[наименование банка]]=0,0,IF(Таблица1[[#This Row],[наименование банка]]=A62,Таблица5[[#This Row],[Алексей К.]],0))","v":0},null,{"$f":"IF(Таблица5[[#This Row],[Зайнетдинова Кристина ]]=\"нет\",0,IF(Таблица1[[#This Row],[0]]=A62,0,Лист2!G62))","v":0},{"$f":"IF(Таблица5[[#This Row],[Попова Анастасия]]=\"нет\",0,IF(Таблица1[[#This Row],[0]]=A62,0,Лист2!G62))","v":0},{"$f":"IF(Таблица5[[#This Row],[Алексей К.]]=\"нет\",0,IF(Таблица1[[#This Row],[0]]=A62,0,Лист2!G62))","v":0}]
[{"$f":"Лист2!A63","v":"А-План"},{"$f":"Лист2!B63","v":"РГС Банк"},{"$f":"Лист2!H63","v":0},{"$f":"IF(Лист2!G63=0,0,IF(Лист2!G63=Лист2!H63,0,Лист2!G63))","v":0},{"$f":"IF(Таблица1[[#This Row],[наименование банка]]=0,0,IF(Таблица1[[#This Row],[наименование банка]]=A63,Таблица5[[#This Row],[Зайнетдинова Кристина ]],0))","v":0},{"$f":"IF(Таблица1[[#This Row],[наименование банка]]=0,0,IF(Таблица1[[#This Row],[наименование банка]]=A63,Таблица5[[#This Row],[Попова Анастасия]],0))","v":0},{"$f":"IF(Таблица1[[#This Row],[наименование банка]]=0,0,IF(Таблица1[[#This Row],[наименование банка]]=A63,Таблица5[[#This Row],[Алексей К.]],0))","v":0},null,{"$f":"IF(Таблица5[[#This Row],[Зайнетдинова Кристина ]]=\"нет\",0,IF(Таблица1[[#This Row],[0]]=A63,0,Лист2!G63))","v":0},{"$f":"IF(Таблица5[[#This Row],[Попова Анастасия]]=\"нет\",0,IF(Таблица1[[#This Row],[0]]=A63,0,Лист2!G63))","v":0},{"$f":"IF(Таблица5[[#This Row],[Алексей К.]]=\"нет\",0,IF(Таблица1[[#This Row],[0]]=A63,0,Лист2!G63))","v":0}]
[{"$f":"Лист2!A64","v":"Yofin"},{"$f":"Лист2!B64","v":"Кредит Европа Банк"},{"$f":"Лист2!H64","v":0},{"$f":"IF(Лист2!G64=0,0,IF(Лист2!G64=Лист2!H64,0,Лист2!G64))","v":0},{"$f":"IF(Таблица1[[#This Row],[наименование банка]]=0,0,IF(Таблица1[[#This Row],[наименование банка]]=A64,Таблица5[[#This Row],[Зайнетдинова Кристина ]],0))","v":0},{"$f":"IF(Таблица1[[#This Row],[наименование банка]]=0,0,IF(Таблица1[[#This Row],[наименование банка]]=A64,Таблица5[[#This Row],[Попова Анастасия]],0))","v":0},{"$f":"IF(Таблица1[[#This Row],[наименование банка]]=0,0,IF(Таблица1[[#This Row],[наименование банка]]=A64,Таблица5[[#This Row],[Алексей К.]],0))","v":0},null,{"$f":"IF(Таблица5[[#This Row],[Зайнетдинова Кристина ]]=\"нет\",0,IF(Таблица1[[#This Row],[0]]=A64,0,Лист2!G64))","v":0},{"$f":"IF(Таблица5[[#This Row],[Попова Анастасия]]=\"нет\",0,IF(Таблица1[[#This Row],[0]]=A64,0,Лист2!G64))","v":0},{"$f":"IF(Таблица5[[#This Row],[Алексей К.]]=\"нет\",0,IF(Таблица1[[#This Row],[0]]=A64,0,Лист2!G64))","v":0}]
[{"$f":"Лист2!A65","v":"Yofin"},{"$f":"Лист2!B65","v":"Кубань Кредит Банк"},{"$f":"Лист2!H65","v":0},{"$f":"IF(Лист2!G65=0,0,IF(Лист2!G65=Лист2!H65,0,Лист2!G65))","v":0},{"$f":"IF(Таблица1[[#This Row],[наименование банка]]=0,0,IF(Таблица1[[#This Row],[наименование банка]]=A65,Таблица5[[#This Row],[Зайнетдинова Кристина ]],0))","v":0},{"$f":"IF(Таблица1[[#This Row],[наименование банка]]=0,0,IF(Таблица1[[#This Row],[наименование банка]]=A65,Таблица5[[#This Row],[Попова Анастасия]],0))","v":0},{"$f":"IF(Таблица1[[#This Row],[наименование банка]]=0,0,IF(Таблица1[[#This Row],[наименование банка]]=A65,Таблица5[[#This Row],[Алексей К.]],0))","v":0},null,{"$f":"IF(Таблица5[[#This Row],[Зайнетдинова Кристина ]]=\"нет\",0,IF(Таблица1[[#This Row],[0]]=A65,0,Лист2!G65))","v":0},{"$f":"IF(Таблица5[[#This Row],[Попова Анастасия]]=\"нет\",0,IF(Таблица1[[#This Row],[0]]=A65,0,Лист2!G65))","v":0},{"$f":"IF(Таблица5[[#This Row],[Алексей К.]]=\"нет\",0,IF(Таблица1[[#This Row],[0]]=A65,0,Лист2!G65))","v":0}]
[{"$f":"Лист2!A66","v":"Yofin"},{"$f":"Лист2!B66","v":"Банк Столичный Кредит"},{"$f":"Лист2!H66","v":0},{"$f":"IF(Лист2!G66=0,0,IF(Лист2!G66=Лист2!H66,0,Лист2!G66))","v":0},{"$f":"IF(Таблица1[[#This Row],[наименование банка]]=0,0,IF(Таблица1[[#This Row],[наименование банка]]=A66,Таблица5[[#This Row],[Зайнетдинова Кристина ]],0))","v":0},{"$f":"IF(Таблица1[[#This Row],[наименование банка]]=0,0,IF(Таблица1[[#This Row],[наименование банка]]=A66,Таблица5[[#This Row],[Попова Анастасия]],0))","v":0},{"$f":"IF(Таблица1[[#This Row],[наименование банка]]=0,0,IF(Таблица1[[#This Row],[наименование банка]]=A66,Таблица5[[#This Row],[Алексей К.]],0))","v":0},null,{"$f":"IF(Таблица5[[#This Row],[Зайнетдинова Кристина ]]=\"нет\",0,IF(Таблица1[[#This Row],[0]]=A66,0,Лист2!G66))","v":0},{"$f":"IF(Таблица5[[#This Row],[Попова Анастасия]]=\"нет\",0,IF(Таблица1[[#This Row],[0]]=A66,0,Лист2!G66))","v":0},{"$f":"IF(Таблица5[[#This Row],[Алексей К.]]=\"нет\",0,IF(Таблица1[[#This Row],[0]]=A66,0,Лист2!G66))","v":0}]
[{"$f":"Лист2!A67","v":"МодульБанк"},{"$f":"Лист2!B67","v":"МодульБанк"},{"$f":"Лист2!H67","v":"МодульБанк"},{"$f":"IF(Лист2!G67=0,0,IF(Лист2!G67=Лист2!H67,0,Лист2!G67))","v":0},{"$f":"IF(Таблица1[[#This Row],[наименование банка]]=0,0,IF(Таблица1[[#This Row],[наименование банка]]=A67,Таблица5[[#This Row],[Зайнетдинова Кристина ]],0))","v":"МодульБанк"},{"$f":"IF(Таблица1[[#This Row],[наименование банка]]=0,0,IF(Таблица1[[#This Row],[наименование банка]]=A67,Таблица5[[#This Row],[Попова Анастасия]],0))","v":"нет"},{"$f":"IF(Таблица1[[#This Row],[наименование банка]]=0,0,IF(Таблица1[[#This Row],[наименование банка]]=A67,Таблица5[[#This Row],[Алексей К.]],0))","v":"нет"},null,{"$f":"IF(Таблица5[[#This Row],[Зайнетдинова Кристина ]]=\"нет\",0,IF(Таблица1[[#This Row],[0]]=A67,0,Лист2!G67))","v":0},{"$f":"IF(Таблица5[[#This Row],[Попова Анастасия]]=\"нет\",0,IF(Таблица1[[#This Row],[0]]=A67,0,Лист2!G67))","v":0},{"$f":"IF(Таблица5[[#This Row],[Алексей К.]]=\"нет\",0,IF(Таблица1[[#This Row],[0]]=A67,0,Лист2!G67))","v":0}]
[{"$f":"Лист2!A68","v":"МоскоммерцБанк"},{"$f":"Лист2!B68","v":"МоскоммерцБанк"},{"$f":"Лист2!H68","v":0},{"$f":"IF(Лист2!G68=0,0,IF(Лист2!G68=Лист2!H68,0,Лист2!G68))","v":0},{"$f":"IF(Таблица1[[#This Row],[наименование банка]]=0,0,IF(Таблица1[[#This Row],[наименование банка]]=A68,Таблица5[[#This Row],[Зайнетдинова Кристина ]],0))","v":0},{"$f":"IF(Таблица1[[#This Row],[наименование банка]]=0,0,IF(Таблица1[[#This Row],[наименование банка]]=A68,Таблица5[[#This Row],[Попова Анастасия]],0))","v":0},{"$f":"IF(Таблица1[[#This Row],[наименование банка]]=0,0,IF(Таблица1[[#This Row],[наименование банка]]=A68,Таблица5[[#This Row],[Алексей К.]],0))","v":0},null,{"$f":"IF(Таблица5[[#This Row],[Зайнетдинова Кристина ]]=\"нет\",0,IF(Таблица1[[#This Row],[0]]=A68,0,Лист2!G68))","v":0},{"$f":"IF(Таблица5[[#This Row],[Попова Анастасия]]=\"нет\",0,IF(Таблица1[[#This Row],[0]]=A68,0,Лист2!G68))","v":0},{"$f":"IF(Таблица5[[#This Row],[Алексей К.]]=\"нет\",0,IF(Таблица1[[#This Row],[0]]=A68,0,Лист2!G68))","v":0}]
[{"$f":"Лист2!A69","v":"Алеф-банк"},{"$f":"Лист2!B69","v":"Алеф-банк"},{"$f":"Лист2!H69","v":"Алеф-банк"},{"$f":"IF(Лист2!G69=0,0,IF(Лист2!G69=Лист2!H69,0,Лист2!G69))","v":0},{"$f":"IF(Таблица1[[#This Row],[наименование банка]]=0,0,IF(Таблица1[[#This Row],[наименование банка]]=A69,Таблица5[[#This Row],[Зайнетдинова Кристина ]],0))","v":"Алеф-банк"},{"$f":"IF(Таблица1[[#This Row],[наименование банка]]=0,0,IF(Таблица1[[#This Row],[наименование банка]]=A69,Таблица5[[#This Row],[Попова Анастасия]],0))","v":"нет"},{"$f":"IF(Таблица1[[#This Row],[наименование банка]]=0,0,IF(Таблица1[[#This Row],[наименование банка]]=A69,Таблица5[[#This Row],[Алексей К.]],0))","v":"нет"},null,{"$f":"IF(Таблица5[[#This Row],[Зайнетдинова Кристина ]]=\"нет\",0,IF(Таблица1[[#This Row],[0]]=A69,0,Лист2!G69))","v":0},{"$f":"IF(Таблица5[[#This Row],[Попова Анастасия]]=\"нет\",0,IF(Таблица1[[#This Row],[0]]=A69,0,Лист2!G69))","v":0},{"$f":"IF(Таблица5[[#This Row],[Алексей К.]]=\"нет\",0,IF(Таблица1[[#This Row],[0]]=A69,0,Лист2!G69))","v":0}]
[{"$f":"Лист2!A70","v":"Феникс"},{"$f":"Лист2!B70","v":"МТС Банк"},{"$f":"Лист2!H70","v":0},{"$f":"IF(Лист2!G70=0,0,IF(Лист2!G70=Лист2!H70,0,Лист2!G70))","v":0},{"$f":"IF(Таблица1[[#This Row],[наименование банка]]=0,0,IF(Таблица1[[#This Row],[наименование банка]]=A70,Таблица5[[#This Row],[Зайнетдинова Кристина ]],0))","v":0},{"$f":"IF(Таблица1[[#This Row],[наименование банка]]=0,0,IF(Таблица1[[#This Row],[наименование банка]]=A70,Таблица5[[#This Row],[Попова Анастасия]],0))","v":0},{"$f":"IF(Таблица1[[#This Row],[наименование банка]]=0,0,IF(Таблица1[[#This Row],[наименование банка]]=A70,Таблица5[[#This Row],[Алексей К.]],0))","v":0},null,{"$f":"IF(Таблица5[[#This Row],[Зайнетдинова Кристина ]]=\"нет\",0,IF(Таблица1[[#This Row],[0]]=A70,0,Лист2!G70))","v":0},{"$f":"IF(Таблица5[[#This Row],[Попова Анастасия]]=\"нет\",0,IF(Таблица1[[#This Row],[0]]=A70,0,Лист2!G70))","v":0},{"$f":"IF(Таблица5[[#This Row],[Алексей К.]]=\"нет\",0,IF(Таблица1[[#This Row],[0]]=A70,0,Лист2!G70))","v":0}]
[{"$f":"Лист2!A71","v":"Феникс"},{"$f":"Лист2!B71","v":"АК Барс банк"},{"$f":"Лист2!H71","v":0},{"$f":"IF(Лист2!G71=0,0,IF(Лист2!G71=Лист2!H71,0,Лист2!G71))","v":0},{"$f":"IF(Таблица1[[#This Row],[наименование банка]]=0,0,IF(Таблица1[[#This Row],[наименование банка]]=A71,Таблица5[[#This Row],[Зайнетдинова Кристина ]],0))","v":0},{"$f":"IF(Таблица1[[#This Row],[наименование банка]]=0,0,IF(Таблица1[[#This Row],[наименование банка]]=A71,Таблица5[[#This Row],[Попова Анастасия]],0))","v":0},{"$f":"IF(Таблица1[[#This Row],[наименование банка]]=0,0,IF(Таблица1[[#This Row],[наименование банка]]=A71,Таблица5[[#This Row],[Алексей К.]],0))","v":0},null,{"$f":"IF(Таблица5[[#This Row],[Зайнетдинова Кристина ]]=\"нет\",0,IF(Таблица1[[#This Row],[0]]=A71,0,Лист2!G71))","v":0},{"$f":"IF(Таблица5[[#This Row],[Попова Анастасия]]=\"нет\",0,IF(Таблица1[[#This Row],[0]]=A71,0,Лист2!G71))","v":0},{"$f":"IF(Таблица5[[#This Row],[Алексей К.]]=\"нет\",0,IF(Таблица1[[#This Row],[0]]=A71,0,Лист2!G71))","v":0}]
[{"$f":"Лист2!A72","v":"Феникс"},{"$f":"Лист2!B72","v":"Абсолют Банк"},{"$f":"Лист2!H72","v":"Абсолют Банк"},{"$f":"IF(Лист2!G72=0,0,IF(Лист2!G72=Лист2!H72,0,Лист2!G72))","v":"Феникс"},{"$f":"IF(Таблица1[[#This Row],[наименование банка]]=0,0,IF(Таблица1[[#This Row],[наименование банка]]=A72,Таблица5[[#This Row],[Зайнетдинова Кристина ]],0))","v":0},{"$f":"IF(Таблица1[[#This Row],[наименование банка]]=0,0,IF(Таблица1[[#This Row],[наименование банка]]=A72,Таблица5[[#This Row],[Попова Анастасия]],0))","v":0},{"$f":"IF(Таблица1[[#This Row],[наименование банка]]=0,0,IF(Таблица1[[#This Row],[наименование банка]]=A72,Таблица5[[#This Row],[Алексей К.]],0))","v":0},null,{"$f":"IF(Таблица5[[#This Row],[Зайнетдинова Кристина ]]=\"нет\",0,IF(Таблица1[[#This Row],[0]]=A72,0,Лист2!G72))","v":0},{"$f":"IF(Таблица5[[#This Row],[Попова Анастасия]]=\"нет\",0,IF(Таблица1[[#This Row],[0]]=A72,0,Лист2!G72))","v":0},{"$f":"IF(Таблица5[[#This Row],[Алексей К.]]=\"нет\",0,IF(Таблица1[[#This Row],[0]]=A72,0,Лист2!G72))","v":"Феникс"}]
[{"$f":"Лист2!A73","v":"Реалист Банк"},{"$f":"Лист2!B73","v":"Реалист Банк"},{"$f":"Лист2!H73","v":0},{"$f":"IF(Лист2!G73=0,0,IF(Лист2!G73=Лист2!H73,0,Лист2!G73))","v":0},{"$f":"IF(Таблица1[[#This Row],[наименование банка]]=0,0,IF(Таблица1[[#This Row],[наименование банка]]=A73,Таблица5[[#This Row],[Зайнетдинова Кристина ]],0))","v":0},{"$f":"IF(Таблица1[[#This Row],[наименование банка]]=0,0,IF(Таблица1[[#This Row],[наименование банка]]=A73,Таблица5[[#This Row],[Попова Анастасия]],0))","v":0},{"$f":"IF(Таблица1[[#This Row],[наименование банка]]=0,0,IF(Таблица1[[#This Row],[наименование банка]]=A73,Таблица5[[#This Row],[Алексей К.]],0))","v":0},null,{"$f":"IF(Таблица5[[#This Row],[Зайнетдинова Кристина ]]=\"нет\",0,IF(Таблица1[[#This Row],[0]]=A73,0,Лист2!G73))","v":0},{"$f":"IF(Таблица5[[#This Row],[Попова Анастасия]]=\"нет\",0,IF(Таблица1[[#This Row],[0]]=A73,0,Лист2!G73))","v":0},{"$f":"IF(Таблица5[[#This Row],[Алексей К.]]=\"нет\",0,IF(Таблица1[[#This Row],[0]]=A73,0,Лист2!G73))","v":0}]
[{"$f":"Лист2!A74","v":"Банк Зенит"},{"$f":"Лист2!B74","v":"Банк Зенит"},{"$f":"Лист2!H74","v":"Банк Зенит"},{"$f":"IF(Лист2!G74=0,0,IF(Лист2!G74=Лист2!H74,0,Лист2!G74))","v":0},{"$f":"IF(Таблица1[[#This Row],[наименование банка]]=0,0,IF(Таблица1[[#This Row],[наименование банка]]=A74,Таблица5[[#This Row],[Зайнетдинова Кристина ]],0))","v":"Банк Зенит"},{"$f":"IF(Таблица1[[#This Row],[наименование банка]]=0,0,IF(Таблица1[[#This Row],[наименование банка]]=A74,Таблица5[[#This Row],[Попова Анастасия]],0))","v":"нет"},{"$f":"IF(Таблица1[[#This Row],[наименование банка]]=0,0,IF(Таблица1[[#This Row],[наименование банка]]=A74,Таблица5[[#This Row],[Алексей К.]],0))","v":"нет"},null,{"$f":"IF(Таблица5[[#This Row],[Зайнетдинова Кристина ]]=\"нет\",0,IF(Таблица1[[#This Row],[0]]=A74,0,Лист2!G74))","v":0},{"$f":"IF(Таблица5[[#This Row],[Попова Анастасия]]=\"нет\",0,IF(Таблица1[[#This Row],[0]]=A74,0,Лист2!G74))","v":0},{"$f":"IF(Таблица5[[#This Row],[Алексей К.]]=\"нет\",0,IF(Таблица1[[#This Row],[0]]=A74,0,Лист2!G74))","v":0}]
[{"$f":"Лист2!A75","v":"МеткомБанк"},{"$f":"Лист2!B75","v":"МеткомБанк"},{"$f":"Лист2!H75","v":0},{"$f":"IF(Лист2!G75=0,0,IF(Лист2!G75=Лист2!H75,0,Лист2!G75))","v":0},{"$f":"IF(Таблица1[[#This Row],[наименование банка]]=0,0,IF(Таблица1[[#This Row],[наименование банка]]=A75,Таблица5[[#This Row],[Зайнетдинова Кристина ]],0))","v":0},{"$f":"IF(Таблица1[[#This Row],[наименование банка]]=0,0,IF(Таблица1[[#This Row],[наименование банка]]=A75,Таблица5[[#This Row],[Попова Анастасия]],0))","v":0},{"$f":"IF(Таблица1[[#This Row],[наименование банка]]=0,0,IF(Таблица1[[#This Row],[наименование банка]]=A75,Таблица5[[#This Row],[Алексей К.]],0))","v":0},null,{"$f":"IF(Таблица5[[#This Row],[Зайнетдинова Кристина ]]=\"нет\",0,IF(Таблица1[[#This Row],[0]]=A75,0,Лист2!G75))","v":0},{"$f":"IF(Таблица5[[#This Row],[Попова Анастасия]]=\"нет\",0,IF(Таблица1[[#This Row],[0]]=A75,0,Лист2!G75))","v":0},{"$f":"IF(Таблица5[[#This Row],[Алексей К.]]=\"нет\",0,IF(Таблица1[[#This Row],[0]]=A75,0,Лист2!G75))","v":0}]
[{"$f":"Лист2!A76","v":"БизнесПоддержка"},{"$f":"Лист2!B76","v":"Инбанк"},{"$f":"Лист2!H76","v":0},{"$f":"IF(Лист2!G76=0,0,IF(Лист2!G76=Лист2!H76,0,Лист2!G76))","v":0},{"$f":"IF(Таблица1[[#This Row],[наименование банка]]=0,0,IF(Таблица1[[#This Row],[наименование банка]]=A76,Таблица5[[#This Row],[Зайнетдинова Кристина ]],0))","v":0},{"$f":"IF(Таблица1[[#This Row],[наименование банка]]=0,0,IF(Таблица1[[#This Row],[наименование банка]]=A76,Таблица5[[#This Row],[Попова Анастасия]],0))","v":0},{"$f":"IF(Таблица1[[#This Row],[наименование банка]]=0,0,IF(Таблица1[[#This Row],[наименование банка]]=A76,Таблица5[[#This Row],[Алексей К.]],0))","v":0},null,{"$f":"IF(Таблица5[[#This Row],[Зайнетдинова Кристина ]]=\"нет\",0,IF(Таблица1[[#This Row],[0]]=A76,0,Лист2!G76))","v":0},{"$f":"IF(Таблица5[[#This Row],[Попова Анастасия]]=\"нет\",0,IF(Таблица1[[#This Row],[0]]=A76,0,Лист2!G76))","v":0},{"$f":"IF(Таблица5[[#This Row],[Алексей К.]]=\"нет\",0,IF(Таблица1[[#This Row],[0]]=A76,0,Лист2!G76))","v":0}]
[{"$f":"Лист2!A77","v":"СовкомБанк"},{"$f":"Лист2!B77","v":"СовкомБанк"},{"$f":"Лист2!H77","v":0},{"$f":"IF(Лист2!G77=0,0,IF(Лист2!G77=Лист2!H77,0,Лист2!G77))","v":0},{"$f":"IF(Таблица1[[#This Row],[наименование банка]]=0,0,IF(Таблица1[[#This Row],[наименование банка]]=A77,Таблица5[[#This Row],[Зайнетдинова Кристина ]],0))","v":0},{"$f":"IF(Таблица1[[#This Row],[наименование банка]]=0,0,IF(Таблица1[[#This Row],[наименование банка]]=A77,Таблица5[[#This Row],[Попова Анастасия]],0))","v":0},{"$f":"IF(Таблица1[[#This Row],[наименование банка]]=0,0,IF(Таблица1[[#This Row],[наименование банка]]=A77,Таблица5[[#This Row],[Алексей К.]],0))","v":0},null,{"$f":"IF(Таблица5[[#This Row],[Зайнетдинова Кристина ]]=\"нет\",0,IF(Таблица1[[#This Row],[0]]=A77,0,Лист2!G77))","v":0},{"$f":"IF(Таблица5[[#This Row],[Попова Анастасия]]=\"нет\",0,IF(Таблица1[[#This Row],[0]]=A77,0,Лист2!G77))","v":0},{"$f":"IF(Таблица5[[#This Row],[Алексей К.]]=\"нет\",0,IF(Таблица1[[#This Row],[0]]=A77,0,Лист2!G77))","v":0}]
[{"$f":"Лист2!A78","v":"БизнесПоддержка"},{"$f":"Лист2!B78","v":"Киви банк"},{"$f":"Лист2!H78","v":0},{"$f":"IF(Лист2!G78=0,0,IF(Лист2!G78=Лист2!H78,0,Лист2!G78))","v":0},{"$f":"IF(Таблица1[[#This Row],[наименование банка]]=0,0,IF(Таблица1[[#This Row],[наименование банка]]=A78,Таблица5[[#This Row],[Зайнетдинова Кристина ]],0))","v":0},{"$f":"IF(Таблица1[[#This Row],[наименование банка]]=0,0,IF(Таблица1[[#This Row],[наименование банка]]=A78,Таблица5[[#This Row],[Попова Анастасия]],0))","v":0},{"$f":"IF(Таблица1[[#This Row],[наименование банка]]=0,0,IF(Таблица1[[#This Row],[наименование банка]]=A78,Таблица5[[#This Row],[Алексей К.]],0))","v":0},null,{"$f":"IF(Таблица5[[#This Row],[Зайнетдинова Кристина ]]=\"нет\",0,IF(Таблица1[[#This Row],[0]]=A78,0,Лист2!G78))","v":0},{"$f":"IF(Таблица5[[#This Row],[Попова Анастасия]]=\"нет\",0,IF(Таблица1[[#This Row],[0]]=A78,0,Лист2!G78))","v":0},{"$f":"IF(Таблица5[[#This Row],[Алексей К.]]=\"нет\",0,IF(Таблица1[[#This Row],[0]]=A78,0,Лист2!G78))","v":0}]

{"sheet":"Сводная","index":7,"n_rows":11,"n_cols":8,"rows_kept":11,"cut":false,"hidden":false,"merged":[[0,2,0,7],[1,0,2,0],[1,1,2,1],[1,2,1,3],[1,4,1,5],[1,6,1,7]]}
[1,2,"Ответственный оператор"]
["Банк подходящий по параметрам заявки","Площадка подходящяя по параметрам заявки","Зайнетдинова Кристина ",null,"Попова Анастасия",null,"Гаврикова Екатерина"]
[null,null,"Площадка","Банк","Площадка","Банк","Площадка","Банк"]
["Банк подходящий по параметрам заявки","Площадка подходящяя по параметрам заявки","Зайнетдинова Кристина ","Зайнетдинова Кристина ","Попова Анастасия","Попова Анастасия","Алексей К.","Алексей К."]
[0,0,0,0,0,0,0,0]
["Банк Зенит","ВБЦ","TenderHelp","Алеф-банк",null,"МодульБанк","ВБЦ","МеталлИнвестБанк"]
["МодульБанк","TenderHelp","ТендерТех",null,null,"Банк Зенит","Elfin"]
["СМП Банк","TenderHuв",null,null,null,null,"Феникс"]
["МеталлИнвестБанк","ТендерТех"]
["Абсолют Банк","Elfin"]
["Алеф-банк","Феникс"]

{"sheet":"по сотрудникам","index":8,"n_rows":27,"n_cols":3,"rows_kept":27,"cut":false,"hidden":false,"merged":[]}
["Зайнетдинова Кристина ","Попова Анастасия","Гаврикова Екатерина"]
["SBI Банк","Абсолют Банк","Инбанк"]
["Абсолют Банк","АК Барс банк","нет"]
["Алеф-банк","МТС Банк","ГазПромБанк"]
["Альфа-банк","нет","МКБ Банк"]
["АТБ Банк","ПочтаБанк","СМП Банк"]
["Банк Зенит","ПромСвязьБанк","АК Барс банк"]
["Банк Россия","РГС Банк","Санкт-Петербург Банк"]
["Банк Столичный Кредит","УралсибБанк","УралсибБанк"]
["Инбанк","ГазПромБанк","МинБанк"]
["Киви банк","МКБ Банк","РосБанк"]
["Кредит Европа Банк","Санкт-Петербург Банк","МТС Банк"]
["Кубань Кредит Банк","Банк Зенит","Союз Банк"]
["МеталлИнвестБанк","Инбанк","Русский Стандарт"]
["МСП Банк","Киви банк","Банк Зенит"]
["МТС Банк","Альфа-банк","МеталлИнвестБанк"]
["нет","МоскомБанк","ЭкспоБанк"]
["ПромСвязьБанк","Реалист Банк","Кредит Европа Банк"]
["РГС Банк","МеткомБанк","СДМ-Банк"]
["Росбанк",null,"Первоуральский Банк"]
["Санкт-Петербург Банк",null,"Кубань Кредит Банк"]
["СберБанк",null,"Примсоцбанк"]
["СеверГазБанк",null,"ЛокоБанк"]
["Союз Банк",null,"МоскоммерцБанк"]
["ТКБ Банк"]
["УралсибБанк"]
["МодульБанк"]