{"text_format":"1","workbook":"xlsx","n_sheets":4,"sheets":["Плитка","test","TileMatrix","Images"],"not_rendered":{"charts":0,"images":13,"macros":1,"external_links":0,"defined_names":2,"comments":0,"pivot_tables":0},"unopened":[],"bounds":{"document_bytes":16777216,"sheet_cells":100000,"rows_first":2000,"rows_last":500,"rows_between":2000,"halvings":0,"cell_chars":16384,"cell_head_chars":4096},"cells_cut":0,"cells_raw":0,"read":"whole","date_system":"1900"}

{"sheet":"Плитка","index":0,"n_rows":300,"n_cols":16,"rows_kept":300,"cut":false,"hidden":false,"merged":[]}
[]
[]
[]
[]
[]
[]
[]
[]
[]
[]
[]
["Артикул","Заголовок","Цена","Цена промо","Изображение Инфо","Морозостойкость","PEI","Штук в уп.","Упаковка","Габариты","Ссылка на товар","Основной цвет","Страна производства","Бренд","Вес брутто","ШтрихКод"]
[3776903,{"$f":"VLOOKUP(A13,TileMatrix!$A:$B,2,0)","v":"Керамическая плитка La Favola Орхидея темно-красная 40х40 см"},{"$f":"VLOOKUP(A13,TileMatrix!$A:$C,3,0)","v":574.4},null,{"$f":"VLOOKUP(A13,TileMatrix!$A:$D,4,0)","v":"moroz"},{"$f":"VLOOKUP(A13,TileMatrix!$A:$E,5,0)","v":4},{"$f":"VLOOKUP(A13,TileMatrix!$A:$F,6,0)","v":10},{"$f":"VLOOKUP(A13,TileMatrix!$A:$G,7,0)","v":1.6},{"$f":"VLOOKUP(A13,TileMatrix!$A:$H,8,0)","v":"40x40"},{"$f":"VLOOKUP(A13,TileMatrix!$A:$H,9,0)","v":{"$error":"#REF!"}},null,{"$f":"VLOOKUP(A13,TileMatrix!$A:$I,12,0)","v":{"$error":"#REF!"}},{"$f":"VLOOKUP(A13,TileMatrix!$A:$J,13,0)","v":{"$error":"#REF!"}},{"$f":"VLOOKUP(A13,TileMatrix!$A:$K,14,0)","v":{"$error":"#REF!"}},{"$f":"VLOOKUP(A13,TileMatrix!$A:$L,15,0)","v":{"$error":"#REF!"}}]
[null,{"$f":"VLOOKUP(A14,TileMatrix!$A:$B,2,0)","v":{"$error":"#N/A"}},{"$f":"VLOOKUP(A14,TileMatrix!$A:$C,3,0)","v":{"$error":"#N/A"}},null,{"$f":"VLOOKUP(A14,TileMatrix!$A:$D,4,0)","v":{"$error":"#N/A"}},{"$f":"VLOOKUP(A14,TileMatrix!$A:$E,5,0)","v":{"$error":"#N/A"}},{"$f":"VLOOKUP(A14,TileMatrix!$A:$F,6,0)","v":{"$error":"#N/A"}},{"$f":"VLOOKUP(A14,TileMatrix!$A:$G,7,0)","v":{"$error":"#N/A"}},{"$f":"VLOOKUP(A14,TileMatrix!$A:$H,8,0)","v":{"$error":"#N/A"}},{"$f":"VLOOKUP(A14,TileMatrix!$A:$H,9,0)","v":{"$error":"#N/A"}},null,{"$f":"VLOOKUP(A14,TileMatrix!$A:$I,12,0)","v":{"$error":"#N/A"}},{"$f":"VLOOKUP(A14,TileMatrix!$A:$J,13,0)","v":{"$error":"#N/A"}},{"$f":"VLOOKUP(A14,TileMatrix!$A:$K,14,0)","v":{"$error":"#N/A"}},{"$f":"VLOOKUP(A14,TileMatrix!$A:$L,15,0)","v":{"$error":"#N/A"}}]
[null,{"$f":"VLOOKUP(A15,TileMatrix!$A:$B,2,0)","v":{"$error":"#N/A"}},{"$f":"VLOOKUP(A15,TileMatrix!$A:$C,3,0)","v":{"$error":"#N/A"}},null,{"$f":"VLOOKUP(A15,TileMatrix!$A:$D,4,0)","v":{"$error":"#N/A"}},{"$f":"VLOOKUP(A15,TileMatrix!$A:$E,5,0)","v":{"$error":"#N/A"}},{"$f":"VLOOKUP(A15,TileMatrix!$A:$F,6,0)","v":{"$error":"#N/A"}},{"$f":"VLOOKUP(A15,TileMatrix!$A:$G,7,0)","v":{"$error":"#N/A"}},{"$f":"VLOOKUP(A15,TileMatrix!$A:$H,8,0)","v":{"$error":"#N/A"}},{"$f":"VLOOKUP(A15,TileMatrix!$A:$H,9,0)","v":{"$error":"#N/A"}},null,{"$f":"VLOOKUP(A15,TileMatrix!$A:$I,12,0)","v":{"$error":"#N/A"}},{"$f":"VLOOKUP(A15,TileMatrix!$A:$J,13,0)","v":{"$error":"#N/A"}},{"$f":"VLOOKUP(A15,TileMatrix!$A:$K,14,0)","v":{"$error":"#N/A"}},{"$f":"VLOOKUP(A15,TileMatrix!$A:$L,15,0)","v":{"$error":"#N/A"}}]
[null,{"$f":"VLOOKUP(A16,TileMatrix!$A:$B,2,0)","v":{"$error":"#N/A"}},{"$f":"VLOOKUP(A16,TileMatrix!$A:$C,3,0)","v":{"$error":"#N/A"}},null,{"$f":"VLOOKUP(A16,TileMatrix!$A:$D,4,0)","v":{"$error":"#N/A"}},{"$f":"VLOOKUP(A16,TileMatrix!$A:$E,5,0)","v":{"$error":"#N/A"}},{"$f":"VLOOKUP(A16,TileMatrix!$A:$F,6,0)","v":{"$error":"#N/A"}},{"$f":"VLOOKUP(A16,TileMatrix!$A:$G,7,0)","v":{"$error":"#N/A"}},{"$f":"VLOOKUP(A16,TileMatrix!$A:$H,8,0)","v":{"$error":"#N/A"}},{"$f":"VLOOKUP(A16,TileMatrix!$A:$H,9,0)","v":{"$error":"#N/A"}},null,{"$f":"VLOOKUP(A16,TileMatrix!$A:$I,12,0)","v":{"$error":"#N/A"}},{"$f":"VLOOKUP(A16,TileMatrix!$A:$J,13,0)","v":{"$error":"#N/A"}},{"$f":"VLOOKUP(A16,TileMatrix!$A:$K,14,0)","v":{"$error":"#N/A"}},{"$f":"VLOOKUP(A16,TileMatrix!$A:$L,15,0)","v":{"$error":"#N/A"}}]
[null,{"$f":"VLOOKUP(A17,TileMatrix!$A:$B,2,0)","v":{"$error":"#N/A"}},{"$f":"VLOOKUP(A17,TileMatrix!$A:$C,3,0)","v":{"$error":"#N/A"}},null,{"$f":"VLOOKUP(A17,TileMatrix!$A:$D,4,0)","v":{"$error":"#N/A"}},{"$f":"VLOOKUP(A17,TileMatrix!$A:$E,5,0)","v":{"$error":"#N/A"}},{"$f":"VLOOKUP(A17,TileMatrix!$A:$F,6,0)","v":{"$error":"#N/A"}},{"$f":"VLOOKUP(A17,TileMatrix!$A:$G,7,0)","v":{"$error":"#N/A"}},{"$f":"VLOOKUP(A17,TileMatrix!$A:$H,8,0)","v":{"$error":"#N/A"}},{"$f":"VLOOKUP(A17,TileMatrix!$A:$H,9,0)","v":{"$error":"#N/A"}},null,{"$f":"VLOOKUP(A17,TileMatrix!$A:$I,12,0)","v":{"$error":"#N/A"}},{"$f":"VLOOKUP(A17,TileMatrix!$A:$J,13,0)","v":{"$error":"#N/A"}},{"$f":"VLOOKUP(A17,TileMatrix!$A:$K,14,0)","v":{"$error":"#N/A"}},{"$f":"VLOOKUP(A17,TileMatrix!$A:$L,15,0)","v":{"$error":"#N/A"}}]
[null,{"$f":"VLOOKUP(A18,TileMatrix!$A:$B,2,0)","v":{"$error":"#N/A"}},{"$f":"VLOOKUP(A18,TileMatrix!$A:$C,3,0)","v":{"$error":"#N/A"}},null,{"$f":"VLOOKUP(A18,TileMatrix!$A:$D,4,0)","v":{"$error":"#N/A"}},{"$f":"VLOOKUP(A18,TileMatrix!$A:$E,5,0)","v":{"$error":"#N/A"}},{"$f":"VLOOKUP(A18,TileMatrix!$A:$F,6,0)","v":{"$error":"#N/A"}},{"$f":"VLOOKUP(A18,TileMatrix!$A:$G,7,0)","v":{"$error":"#N/A"}},{"$f":"VLOOKUP(A18,TileMatrix!$A:$H,8,0)","v":{"$error":"#N/A"}},{"$f":"VLOOKUP(A18,TileMatrix!$A:$H,9,0)","v":{"$error":"#N/A"}},null,{"$f":"VLOOKUP(A18,TileMatrix!$A:$I,12,0)","v":{"$error":"#N/A"}},{"$f":"VLOOKUP(A18,TileMatrix!$A:$J,13,0)","v":{"$error":"#N/A"}},{"$f":"VLOOKUP(A18,TileMatrix!$A:$K,14,0)","v":{"$error":"#N/A"}},{"$f":"VLOOKUP(A18,TileMatrix!$A:$L,15,0)","v":{"$error":"#N/A"}}]
[null,{"$f":"VLOOKUP(A19,TileMatrix!$A:$B,2,0)","v":{"$error":"#N/A"}},{"$f":"VLOOKUP(A19,TileMatrix!$A:$C,3,0)","v":{"$error":"#N/A"}},null,{"$f":"VLOOKUP(A19,TileMatrix!$A:$D,4,0)","v":{"$error":"#N/A"}},{"$f":"VLOOKUP(A19,TileMatrix!$A:$E,5,0)","v":{"$error":"#N/A"}},{"$f":"VLOOKUP(A19,TileMatrix!$A:$F,6,0)","v":{"$error":"#N/A"}},{"$f":"VLOOKUP(A19,TileMatrix!$A:$G,7,0)","v":{"$error":"#N/A"}},{"$f":"VLOOKUP(A19,TileMatrix!$A:$H,8,0)","v":{"$error":"#N/A"}},{"$f":"VLOOKUP(A19,TileMatrix!$A:$H,9,0)","v":{"$error":"#N/A"}},null,{"$f":"VLOOKUP(A19,TileMatrix!$A:$I,12,0)","v":{"$error":"#N/A"}},{"$f":"VLOOKUP(A19,TileMatrix!$A:$J,13,0)","v":{"$error":"#N/A"}},{"$f":"VLOOKUP(A19,TileMatrix!$A:$K,14,0)","v":{"$error":"#N/A"}},{"$f":"VLOOKUP(A19,TileMatrix!$A:$L,15,0)","v":{"$error":"#N/A"}}]
[null,{"$f":"VLOOKUP(A20,TileMatrix!$A:$B,2,0)","v":{"$error":"#N/A"}},{"$f":"VLOOKUP(A20,TileMatrix!$A:$C,3,0)","v":{"$error":"#N/A"}},null,{"$f":"VLOOKUP(A20,TileMatrix!$A:$D,4,0)","v":{"$error":"#N/A"}},{"$f":"VLOOKUP(A20,TileMatrix!$A:$E,5,0)","v":{"$error":"#N/A"}},{"$f":"VLOOKUP(A20,TileMatrix!$A:$F,6,0)","v":{"$error":"#N/A"}},{"$f":"VLOOKUP(A20,TileMatrix!$A:$G,7,0)","v":{"$error":"#N/A"}},{"$f":"VLOOKUP(A20,TileMatrix!$A:$H,8,0)","v":{"$error":"#N/A"}},{"$f":"VLOOKUP(A20,TileMatrix!$A:$H,9,0)","v":{"$error":"#N/A"}},null,{"$f":"VLOOKUP(A20,TileMatrix!$A:$I,12,0)","v":{"$error":"#N/A"}},{"$f":"VLOOKUP(A20,TileMatrix!$A:$J,13,0)","v":{"$error":"#N/A"}},{"$f":"VLOOKUP(A20,TileMatrix!$A:$K,14,0)","v":{"$error":"#N/A"}},{"$f":"VLOOKUP(A20,TileMatrix!$A:$L,15,0)","v":{"$error":"#N/A"}}]
[null,{"$f":"VLOOKUP(A21,TileMatrix!$A:$B,2,0)","v":{"$error":"#N/A"}},{"$f":"VLOOKUP(A21,TileMatrix!$A:$C,3,0)","v":{"$error":"#N/A"}},null,{"$f":"VLOOKUP(A21,TileMatrix!$A:$D,4,0)","v":{"$error":"#N/A"}},{"$f":"VLOOKUP(A21,TileMatrix!$A:$E,5,0)","v":{"$error":"#N/A"}},{"$f":"VLOOKUP(A21,TileMatrix!$A:$F,6,0)","v":{"$error":"#N/A"}},{"$f":"VLOOKUP(A21,TileMatrix!$A:$G,7,0)","v":{"$error":"#N/A"}},{"$f":"VLOOKUP(A21,TileMatrix!$A:$H,8,0)","v":{"$error":"#N/A"}},{"$f":"VLOOKUP(A21,TileMatrix!$A:$H,9,0)","v":{"$error":"#N/A"}},null,{"$f":"VLOOKUP(A21,TileMatrix!$A:$I,12,0)","v":{"$error":"#N/A"}},{"$f":"VLOOKUP(A21,TileMatrix!$A:$J,13,0)","v":{"$error":"#N/A"}},{"$f":"VLOOKUP(A21,TileMatrix!$A:$K,14,0)","v":{"$error":"#N/A"}},{"$f":"VLOOKUP(A21,TileMatrix!$A:$L,15,0)","v":{"$error":"#N/A"}}]
[null,{"$f":"VLOOKUP(A22,TileMatrix!$A:$B,2,0)","v":{"$error":"#N/A"}},{"$f":"VLOOKUP(A22,TileMatrix!$A:$C,3,0)","v":{"$error":"#N/A"}},null,{"$f":"VLOOKUP(A22,TileMatrix!$A:$D,4,0)","v":{"$error":"#N/A"}},{"$f":"VLOOKUP(A22,TileMatrix!$A:$E,5,0)","v":{"$error":"#N/A"}},{"$f":"VLOOKUP(A22,TileMatrix!$A:$F,6,0)","v":{"$error":"#N/A"}},{"$f":"VLOOKUP(A22,TileMatrix!$A:$G,7,0)","v":{"$error":"#N/A"}},{"$f":"VLOOKUP(A22,TileMatrix!$A:$H,8,0)","v":{"$error":"#N/A"}},{"$f":"VLOOKUP(A22,TileMatrix!$A:$H,9,0)","v":{"$error":"#N/A"}},null,{"$f":"VLOOKUP(A22,TileMatrix!$A:$I,12,0)","v":{"$error":"#N/A"}},{"$f":"VLOOKUP(A22,TileMatrix!$A:$J,13,0)","v":{"$error":"#N/A"}},{"$f":"VLOOKUP(A22,TileMatrix!$A:$K,14,0)","v":{"$error":"#N/A"}},{"$f":"VLOOKUP(A22,TileMatrix!$A:$L,15,0)","v":{"$error":"#N/A"}}]
[null,{"$f":"VLOOKUP(A23,TileMatrix!$A:$B,2,0)","v":{"$error":"#N/A"}},{"$f":"VLOOKUP(A23,TileMatrix!$A:$C,3,0)","v":{"$error":"#N/A"}},null,{"$f":"VLOOKUP(A23,TileMatrix!$A:$D,4,0)","v":{"$error":"#N/A"}},{"$f":"VLOOKUP(A23,TileMatrix!$A:$E,5,0)","v":{"$error":"#N/A"}},{"$f":"VLOOKUP(A23,TileMatrix!$A:$F,6,0)","v":{"$error":"#N/A"}},{"$f":"VLOOKUP(A23,TileMatrix!$A:$G,7,0)","v":{"$error":"#N/A"}},{"$f":"VLOOKUP(A23,TileMatrix!$A:$H,8,0)","v":{"$error":"#N/A"}},{"$f":"VLOOKUP(A23,TileMatrix!$A:$H,9,0)","v":{"$error":"#N/A"}},null,{"$f":"VLOOKUP(A23,TileMatrix!$A:$I,12,0)","v":{"$error":"#N/A"}},{"$f":"VLOOKUP(A23,TileMatrix!$A:$J,13,0)","v":{"$error":"#N/A"}},{"$f":"VLOOKUP(A23,TileMatrix!$A:$K,14,0)","v":{"$error":"#N/A"}},{"$f":"VLOOKUP(A23,TileMatrix!$A:$L,15,0)","v":{"$error":"#N/A"}}]
[null,{"$f":"VLOOKUP(A24,TileMatrix!$A:$B,2,0)","v":{"$error":"#N/A"}},{"$f":"VLOOKUP(A24,TileMatrix!$A:$C,3,0)","v":{"$error":"#N/A"}},null,{"$f":"VLOOKUP(A24,TileMatrix!$A:$D,4,0)","v":{"$error":"#N/A"}},{"$f":"VLOOKUP(A24,TileMatrix!$A:$E,5,0)","v":{"$error":"#N/A"}},{"$f":"VLOOKUP(A24,TileMatrix!$A:$F,6,0)","v":{"$error":"#N/A"}},{"$f":"VLOOKUP(A24,TileMatrix!$A:$G,7,0)","v":{"$error":"#N/A"}},{"$f":"VLOOKUP(A24,TileMatrix!$A:$H,8,0)","v":{"$error":"#N/A"}},{"$f":"VLOOKUP(A24,TileMatrix!$A:$H,9,0)","v":{"$error":"#N/A"}},null,{"$f":"VLOOKUP(A24,TileMatrix!$A:$I,12,0)","v":{"$error":"#N/A"}},{"$f":"VLOOKUP(A24,TileMatrix!$A:$J,13,0)","v":{"$error":"#N/A"}},{"$f":"VLOOKUP(A24,TileMatrix!$A:$K,14,0)","v":{"$error":"#N/A"}},{"$f":"VLOOKUP(A24,TileMatrix!$A:$L,15,0)","v":{"$error":"#N/A"}}]
[null,{"$f":"VLOOKUP(A25,TileMatrix!$A:$B,2,0)","v":{"$error":"#N/A"}},{"$f":"VLOOKUP(A25,TileMatrix!$A:$C,3,0)","v":{"$error":"#N/A"}},null,{"$f":"VLOOKUP(A25,TileMatrix!$A:$D,4,0)","v":{"$error":"#N/A"}},{"$f":"VLOOKUP(A25,TileMatrix!$A:$E,5,0)","v":{"$error":"#N/A"}},{"$f":"VLOOKUP(A25,TileMatrix!$A:$F,6,0)","v":{"$error":"#N/A"}},{"$f":"VLOOKUP(A25,TileMatrix!$A:$G,7,0)","v":{"$error":"#N/A"}},{"$f":"VLOOKUP(A25,TileMatrix!$A:$H,8,0)","v":{"$error":"#N/A"}},{"$f":"VLOOKUP(A25,TileMatrix!$A:$H,9,0)","v":{"$error":"#N/A"}},null,{"$f":"VLOOKUP(A25,TileMatrix!$A:$I,12,0)","v":{"$error":"#N/A"}},{"$f":"VLOOKUP(A25,TileMatrix!$A:$J,13,0)","v":{"$error":"#N/A"}},{"$f":"VLOOKUP(A25,TileMatrix!$A:$K,14,0)","v":{"$error":"#N/A"}},{"$f":"VLOOKUP(A25,TileMatrix!$A:$L,15,0)","v":{"$error":"#N/A"}}]
[null,{"$f":"VLOOKUP(A26,TileMatrix!$A:$B,2,0)","v":{"$error":"#N/A"}},{"$f":"VLOOKUP(A26,TileMatrix!$A:$C,3,0)","v":{"$error":"#N/A"}},null,{"$f":"VLOOKUP(A26,TileMatrix!$A:$D,4,0)","v":{"$error":"#N/A"}},{"$f":"VLOOKUP(A26,TileMatrix!$A:$E,5,0)","v":{"$error":"#N/A"}},{"$f":"VLOOKUP(A26,TileMatrix!$A:$F,6,0)","v":{"$error":"#N/A"}},{"$f":"VLOOKUP(A26,TileMatrix!$A:$G,7,0)","v":{"$error":"#N/A"}},{"$f":"VLOOKUP(A26,TileMatrix!$A:$H,8,0)","v":{"$error":"#N/A"}},{"$f":"VLOOKUP(A26,TileMatrix!$A:$H,9,0)","v":{"$error":"#N/A"}},null,{"$f":"VLOOKUP(A26,TileMatrix!$A:$I,12,0)","v":{"$error":"#N/A"}},{"$f":"VLOOKUP(A26,TileMatrix!$A:$J,13,0)","v":{"$error":"#N/A"}},{"$f":"VLOOKUP(A26,TileMatrix!$A:$K,14,0)","v":{"$error":"#N/A"}},{"$f":"VLOOKUP(A26,TileMatrix!$A:$L,15,0)","v":{"$error":"#N/A"}}]
[null,{"$f":"VLOOKUP(A27,TileMatrix!$A:$B,2,0)","v":{"$error":"#N/A"}},{"$f":"VLOOKUP(A27,TileMatrix!$A:$C,3,0)","v":{"$error":"#N/A"}},null,{"$f":"VLOOKUP(A27,TileMatrix!$A:$D,4,0)","v":{"$error":"#N/A"}},{"$f":"VLOOKUP(A27,TileMatrix!$A:$E,5,0)","v":{"$error":"#N/A"}},{"$f":"VLOOKUP(A27,TileMatrix!$A:$F,6,0)","v":{"$error":"#N/A"}},{"$f":"VLOOKUP(A27,TileMatrix!$A:$G,7,0)","v":{"$error":"#N/A"}},{"$f":"VLOOKUP(A27,TileMatrix!$A:$H,8,0)","v":{"$error":"#N/A"}},{"$f":"VLOOKUP(A27,TileMatrix!$A:$H,9,0)","v":{"$error":"#N/A"}},null,{"$f":"VLOOKUP(A27,TileMatrix!$A:$I,12,0)","v":{"$error":"#N/A"}},{"$f":"VLOOKUP(A27,TileMatrix!$A:$J,13,0)","v":{"$error":"#N/A"}},{"$f":"VLOOKUP(A27,TileMatrix!$A:$K,14,0)","v":{"$error":"#N/A"}},{"$f":"VLOOKUP(A27,TileMatrix!$A:$L,15,0)","v":{"$error":"#N/A"}}]
[null,{"$f":"VLOOKUP(A28,TileMatrix!$A:$B,2,0)","v":{"$error":"#N/A"}},{"$f":"VLOOKUP(A28,TileMatrix!$A:$C,3,0)","v":{"$error":"#N/A"}},null,{"$f":"VLOOKUP(A28,TileMatrix!$A:$D,4,0)","v":{"$error":"#N/A"}},{"$f":"VLOOKUP(A28,TileMatrix!$A:$E,5,0)","v":{"$error":"#N/A"}},{"$f":"VLOOKUP(A28,TileMatrix!$A:$F,6,0)","v":{"$error":"#N/A"}},{"$f":"VLOOKUP(A28,TileMatrix!$A:$G,7,0)","v":{"$error":"#N/A"}},{"$f":"VLOOKUP(A28,TileMatrix!$A:$H,8,0)","v":{"$error":"#N/A"}},{"$f":"VLOOKUP(A28,TileMatrix!$A:$H,9,0)","v":{"$error":"#N/A"}},null,{"$f":"VLOOKUP(A28,TileMatrix!$A:$I,12,0)","v":{"$error":"#N/A"}},{"$f":"VLOOKUP(A28,TileMatrix!$A:$J,13,0)","v":{"$error":"#N/A"}},{"$f":"VLOOKUP(A28,TileMatrix!$A:$K,14,0)","v":{"$error":"#N/A"}},{"$f":"VLOOKUP(A28,TileMatrix!$A:$L,15,0)","v":{"$error":"#N/A"}}]
[null,{"$f":"VLOOKUP(A29,TileMatrix!$A:$B,2,0)","v":{"$error":"#N/A"}},{"$f":"VLOOKUP(A29,TileMatrix!$A:$C,3,0)","v":{"$error":"#N/A"}},null,{"$f":"VLOOKUP(A29,TileMatrix!$A:$D,4,0)","v":{"$error":"#N/A"}},{"$f":"VLOOKUP(A29,TileMatrix!$A:$E,5,0)","v":{"$error":"#N/A"}},{"$f":"VLOOKUP(A29,TileMatrix!$A:$F,6,0)","v":{"$error":"#N/A"}},{"$f":"VLOOKUP(A29,TileMatrix!$A:$G,7,0)","v":{"$error":"#N/A"}},{"$f":"VLOOKUP(A29,TileMatrix!$A:$H,8,0)","v":{"$error":"#N/A"}},{"$f":"VLOOKUP(A29,TileMatrix!$A:$H,9,0)","v":{"$error":"#N/A"}},null,{"$f":"VLOOKUP(A29,TileMatrix!$A:$I,12,0)","v":{"$error":"#N/A"}},{"$f":"VLOOKUP(A29,TileMatrix!$A:$J,13,0)","v":{"$error":"#N/A"}},{"$f":"VLOOKUP(A29,TileMatrix!$A:$K,14,0)","v":{"$error":"#N/A"}},{"$f":"VLOOKUP(A29,TileMatrix!$A:$L,15,0)","v":{"$error":"#N/A"}}]
[null,{"$f":"VLOOKUP(A30,TileMatrix!$A:$B,2,0)","v":{"$error":"#N/A"}},{"$f":"VLOOKUP(A30,TileMatrix!$A:$C,3,0)","v":{"$error":"#N/A"}},null,{"$f":"VLOOKUP(A30,TileMatrix!$A:$D,4,0)","v":{"$error":"#N/A"}},{"$f":"VLOOKUP(A30,TileMatrix!$A:$E,5,0)","v":{"$error":"#N/A"}},{"$f":"VLOOKUP(A30,TileMatrix!$A:$F,6,0)","v":{"$error":"#N/A"}},{"$f":"VLOOKUP(A30,TileMatrix!$A:$G,7,0)","v":{"$error":"#N/A"}},{"$f":"VLOOKUP(A30,TileMatrix!$A:$H,8,0)","v":{"$error":"#N/A"}},{"$f":"VLOOKUP(A30,TileMatrix!$A:$H,9,0)","v":{"$error":"#N/A"}},null,{"$f":"VLOOKUP(A30,TileMatrix!$A:$I,12,0)","v":{"$error":"#N/A"}},{"$f":"VLOOKUP(A30,TileMatrix!$A:$J,13,0)","v":{"$error":"#N/A"}},{"$f":"VLOOKUP(A30,TileMatrix!$A:$K,14,0)","v":{"$error":"#N/A"}},{"$f":"VLOOKUP(A30,TileMatrix!$A:$L,15,0)","v":{"$error":"#N/A"}}]
{"$rows_left_out":271}
{"sheet":"test","index":1,"n_rows":61,"n_cols":12,"rows_kept":61,"cut":false,"hidden":false,"merged":[[28,1,29,2],[20,1,21,3],[22,1,23,3],[24,1,25,3],[60,11,61,11],[22,6,23,7],[24,6,25,6],[24,7,25,7],[20,6,21,7],[35,2,52,10],[60,9,61,10],[60,1,61,2],[57,2,58,3],[57,4,58,5],[57,6,58,7],[57,9,58,11],[1,9,2,11],[4,1,13,11],[16,1,17,3],[16,10,19,10],[16,11,19,11],[18,1,19,3],[16,6,17,6],[16,7,17,7],[18,6,19,6],[18,7,19,7]]}
[]
[null,null,null,null,null,null,null,null,null,{"$f":"Плитка!$N$13","v":{"$error":"#REF!"}}]
[]
[]
[null,{"$f":"Плитка!$B$13","v":"Керамическая плитка La Favola Орхидея темно-красная 40х40 см"}]
[]
[]
[]
[]
[]
[]
[]
[]
[]
[]
[]
[null,"Размер:",null,null,null,null,{"$f":"Плитка!$J$13","v":{"$error":"#REF!"}},"СМ",null,null,{"$f":"Плитка!$F$13","v":4},{"$f":"Плитка!$G$13","v":10}]
[]
[null,"Вес упаковки:",null,null,null,null,{"$f":"Плитка!$O$13","v":{"$error":"#REF!"}},"КГ"]
[]
[null,"Основной цвет:",null,null,null,null,{"$f":"Плитка!$L$13","v":{"$error":"#REF!"}}]
[]
[null,"Страна:",null,null,null,null,{"$f":"Плитка!$M$13","v":{"$error":"#REF!"}}]
[]
[null,"В упаковке:",null,null,null,null,{"$f":"Плитка!$H$13","v":1.6},"ШТ"]
[]
[]
[]
[null,"За 1 кв.м"]
[]
{"$rows_left_out":32}
{"sheet":"TileMatrix","index":2,"n_rows":2163,"n_cols":12,"rows_kept":2163,"cut":false,"hidden":false,"merged":[]}
["Артикул","Заголовок","Цена","Морозостойкость","PEI","Штук в упаковке","Упаковка","Габариты","Основной цвет","Страна производства","Бренд","Вес брутто"]
[4870515,"Бордюр Cersanit Metallic золотистый 0,5x75 см",659,null,3,1,null,"0,5x75","Золотистый","Россия","Cersanit","0.08"]
[4353124,"Керамогранит OUTI GRIS дерево серый 100х25 см",3298.5,"moroz",4,null,1.5,"100x25","Серый","Испания","Prissmacer","28.556"]
[4035788,"Керамическое панно Керамин Таиланд бирюзовое 100х60 см",5499,null,3,1,null,"100x60","Синий","Россия","Керамин","2.95"]
[4318770,"Керамическое панно Керамин Элегия черный 100х60 см",4709,null,3,1,null,"100x60","Черный","Белоруссия","Керамин","1.52"]
[4563870,"Декор BRAM'S Домус песочный 100х75 см",780,null,3,1,null,"100x75","Желтый","Белоруссия","BRAM'S","14.3"]
[4807251,"Бетонная плитка White Hills Тоскана бежевая 10x10 см",1099,"moroz",4,70,0.85,"10x10","Бежевый","Россия","White Hills","13.4"]
[4561841,"Керамическая плитка Golden Tile Metrotiles кобальт 10х20 см",383,null,3,44,0.88,"10x20","Синий","Украина","Golden Tile","10.95"]
[4561866,"Керамическая плитка Golden Tile Metrotiles голубая 10х20 см",383,null,3,44,0.88,"10x20","Голубой","Украина","Golden Tile","10.95"]
[4561833,"Керамическая плитка Golden Tile Metrotiles светло-серая 10х20 см",383,null,3,44,0.88,"10x20","Серый","Украина","Golden Tile","10.95"]
[4561874,"Керамическая плитка Golden Tile Metrotiles белая 10х20 см",470,null,3,44,0.88,"10x20","Белый","Украина","Golden Tile","10.95"]
[4561858,"Керамическая плитка Golden Tile Metrotiles мятная 10х20 см",383,null,3,44,0.88,"10x20","Зеленый","Украина","Golden Tile","10.95"]
[4052411,"Плитка из травертина Stone4Home Provance серая 10х10 см",944,null,3,4,0.04,"10х10","Серый","Турция","Stone4Home",1]
[4052403,"Плитка из травертина Stone4Home Provance бежевая 10х10 см",412,null,3,4,0.04,"10х10","Бежевый","Турция","Stone4Home","2.25"]
[4623013,"Плитка вибропресованная коричневая 10х20,2х6 см",28,null,null,1,null,"10х20,2","Коричневый","Россия","Без бренда","2.6"]
[4623039,"Плитка вибропресованная серая 10х20,2х6 см",21,null,null,1,null,"10х20,2","Серый","Россия","Без бренда","2.6"]
[4623021,"Плитка вибропресованная красная 10х20,2х6 см",26,null,null,1,null,"10х20,2","Красный","Россия","Без бренда","2.6"]
[4931960,"Керамогранит Unitile Life OAK BEIGE 12,5x50 см",629.12,"moroz",4,14,0.875,"12,5x50","Бежевый","Россия","Unitile Life","15.3"]
[4931945,"Керамогранит Unitile Life NUT BEIGE 12,5x50 см",629.12,"moroz",4,14,0.875,"12,5x50","Бежевый","Россия","Unitile Life","15.3"]
[4931952,"Керамогранит Unitile Life NUT BROWN 12,5x50 см",629.12,"moroz",4,14,0.875,"12,5х50","Коричневый","Россия","Unitile Life","15.3"]
[5055410,"Керамогранит Gracia Ceramica OSLO бежевый 12,5х50 см",791.12,"moroz",4,14,0.875,"12,5х50","Бежевый","Россия","Gracia Ceramica","15.3"]
[4931978,"Керамогранит Unitile Life OAK GREY 12,5x50 см",629.12,"moroz",4,14,0.875,"12,5х50","Серый","Россия","Unitile Life","15.3"]
[3718566,"Керамогранит LB ceramics 1200x800 мм",296.77999999999997,"moroz",4,1,null,"1200x800","Бесцветный","Россия","LB CERAMICS","28.46"]
[5055442,"Керамогранит Elegant Armani Gold коричневый 120x60 см",2879,"moroz",4,2,1.44,"120x60","Коричневый","Индия","Laparet",29]
[4314522,"Керамогранит KERAMA MARAZZI Колор вуд дерево белый 13х80 см",637,"moroz",4,12,1.25,"13x80","Белый","Россия","KERAMA MARAZZI",30]
[4037420,"Керамогранит KERAMA MARAZZI Меранти дерево бежевый 13х80 см",1720.99,"moroz",4,12,1.25,"13x80","Бежевый","Россия","KERAMA MARAZZI",30]
[4037412,"Керамогранит KERAMA MARAZZI Меранти дерево белый 13х80 см",1721,"moroz",4,12,1.25,"13x80","Белый","Россия","KERAMA MARAZZI",30]
[4036547,"Керамогранит Beryoza Ceramica Вяз дерево коричневый 15,1х60 см",1073.04,"moroz",4,15,1.36,"15,1х60","Коричневый","Белоруссия","Beryoza Ceramica",27]
[4353355,"Керамическая плитка настенная АТЕМ Sandra черная 15,2x7,6 см",1429,null,3,95,1.1000000000000001,"15,2х7,6","Черный","Украина","АТЕМ","15.75"]
[4353348,"Керамическая плитка АТЕМ Sandra серая 15,2x7,6 см",1429,null,3,95,1.1000000000000001,"15,2х7,6","Серый","Украина","АТЕМ","15.75"]
{"$rows_left_out":2134}
{"sheet":"Images","index":3,"n_rows":14,"n_cols":4,"rows_kept":14,"cut":false,"hidden":false,"merged":[]}
["№№","Название","ИД","Картинка"]
[1,31,31]
[2,32,32]
[3,33,33]
[4,34,34]
[5,"f","f"]
[6,12,12]
[7,10,10]
[8,8,8]
[9,6,6]
[10,"moroz","moroz"]
[11,4,4]
[12,3,3]
[13,0,0]