{"text_format":"1","workbook":"xlsx","n_sheets":11,"sheets":["MB","Soliq","DB","PI","PVB","Moliyaviy boshqaruv","Korporativ moliya","Statistika","Mikroiqtisodiyot","Audit","SEMESTR QAYDNOMASI"],"not_rendered":{"charts":0,"images":0,"macros":1,"external_links":0,"defined_names":12,"comments":0,"pivot_tables":0},"unopened":[],"bounds":{"document_bytes":16777216,"sheet_cells":100000,"rows_first":2000,"rows_last":500,"rows_between":2000,"halvings":0,"cell_chars":16384,"cell_head_chars":4096},"cells_cut":0,"cells_raw":0,"read":"whole","date_system":"1900"}

{"sheet":"MB","index":0,"n_rows":148,"n_cols":6,"rows_kept":148,"cut":false,"hidden":false,"merged":[[1,0,1,4],[2,0,2,4],[3,0,3,4],[4,0,4,4],[5,0,5,4],[6,0,6,1],[7,0,7,4],[8,0,8,1],[41,0,41,2],[42,0,42,1],[48,1,48,2],[48,3,48,4],[50,0,50,4],[50,10,51,10],[51,0,51,4],[52,0,52,4],[52,10,53,10],[53,0,53,4],[54,0,54,4],[54,10,55,10],[55,0,55,2],[55,3,55,4],[56,0,56,4],[57,0,57,1],[57,3,57,4],[90,0,90,2],[91,0,91,1],[97,1,97,2],[97,3,97,4],[99,0,99,4],[100,0,100,4],[101,0,101,4],[102,0,102,4],[103,0,103,4],[104,0,104,2],[104,3,104,4],[105,0,105,4],[149,1,149,2],[149,3,149,4],[106,0,106,1],[106,3,106,4],[139,0,139,2],[147,1,147,2],[147,3,147,4],[148,3,148,4]]}
[null,null,null,null,"8-shakl"]
["OʻZBEKISTON RESPUBLIKASI OLIY TAʻLIM, FAN VA INNOVATSIYALAR VAZIRLIGI"]
["TERMIZ DAVLAT UNIVERSITETI"]
["BAHOLASH QAYDNOMASI №___"]
["IQTISODIYOT VA TURIZM FAKULTETI IQTISODIYOT TAʻLIM YOʻNALISHI 1-KURS 1-SEMESTR 101-GURUH"]
["Moliya bozori"]
["Maʻruza oʻqituvchisi: ",null,null,"Amaliyot oʻqituvchisi: "]
["YaN oʻtkazuvchi komissiya: "]
["Semestrda fanga ajratilgan umumiy soatlar:",null,null,"YaN oʻtkazilgan sana: "]
[]
["№","Talabaning familiyasi, ismi, sharifi","Reyting daftarchasining raqami","YaN","YaN oʻtkazuvchining imzosi","YaN"]
[1,"Abdullaeva Dilfuza Bahodir qizi",null,{"$f":"IF(F12=5,\"5 (a'lo)\",IF(AND(F12=4),\"4 (yaxshi)\",IF(AND(F12=3),\"3 (qoniqarli)\",IF(AND(F12=2),\"2 (qoniqarsiz)\",IF(AND(F12=1),\"kelmagan\",IF(AND(F12=\"\"),\"\",))))))","v":"3 (qoniqarli)"},null,3]
[2,"Abduraimov Asilbek Eralievich",null,{"$f":"IF(F13=5,\"5 (a'lo)\",IF(AND(F13=4),\"4 (yaxshi)\",IF(AND(F13=3),\"3 (qoniqarli)\",IF(AND(F13=2),\"2 (qoniqarsiz)\",IF(AND(F13=1),\"kelmagan\",IF(AND(F13=\"\"),\"\",))))))","v":"4 (yaxshi)"},null,4]
[3,"Abdurashidova Elnora Yoʻlchi qizi",null,"5 (a'lo)",null,5]
[4,"Abdusattorov Baxtiyor Ibragim oʻgʻli",null,"3 (qoniqarli)",null,3]
[5,"Avazov Mirzohid Akmal oʻgʻli",null,"3 (qoniqarli)",null,3]
[6,"Adinaev Javohirbek Bahodir oʻgʻli",null,"4 (yaxshi)",null,4]
[7,"Allamurodov Bexruz Allamurod oʻgʻli",null,"5 (a'lo)",null,5]
[8,"Axmedov Alisher Oʻktamboevich",null,"2 (qoniqarsiz)",null,2]
[9,"Jamolov Bejan Xurshidovich",null,"5 (a'lo)",null,5]
[10,"Jumaeva Nigina Baxtiyor qizi",null,"4 (yaxshi)",null,4]
[11,"Joʻraev Farrux Sobirovich",null,"kelmagan",null,1]
[12,"Joʻraqulov Tolibjon Oʻktamovich",null,"3 (qoniqarli)",null,3]
[13,"Ibragimov Abbos Avaz oʻgʻli",null,"3 (qoniqarli)",null,3]
[14,"Karajanov Nurmuxammed Abdireiimovich",null,"3 (qoniqarli)",null,3]
[15,"Karimov Bozor Abdugʻapparovich",null,"kelmagan",null,1]
[16,"Karimova Maftuna Komiljon qizi",null,"3 (qoniqarli)",null,3]
[17,"Qodirov Jahongir Turgʻun oʻgʻli",null,"3 (qoniqarli)",null,3]
[18,"Qurbonov Azizbek Yoʻldosh oʻgʻli",null,"3 (qoniqarli)",null,3]
[19,"Qurbonov Shahriyor Uralovich",null,"3 (qoniqarli)",null,3]
[20,"Mamatqulova Muyassarxon Ashurmuhammadovna",null,"3 (qoniqarli)",null,3]
[21,"Mamatqulova Sevara Faxriddin qizi",null,"2 (qoniqarsiz)",null,2]
[22,"Mardonov Sirojiddin Abdivoxidovich",null,"3 (qoniqarli)",null,3]
[23,"Mengliev Bekzod Hasan oʻgʻli",null,"3 (qoniqarli)",null,3]
[24,"Muxamadiev Raximjon Farxodjon oʻgʻli",null,"3 (qoniqarli)",null,3]
[25,"Normurodov Maxsudbek Yunusovich",null,"3 (qoniqarli)",null,3]
[26,"Nurova Farogʻat Salohiddin qizi",null,"kelmagan",null,1]
[27,"Pardaev Shuhratjon Jahongirovich",null,"3 (qoniqarli)",null,3]
[28,"Ravshanova Munisa Hasan qizi",null,"3 (qoniqarli)",null,3]
[29,"Raximov Asliddin Raxmiddin oʻgʻli",null,"3 (qoniqarli)",null,3]
[30,"Roʻziboev Elbek Abdufattoh oʻgʻli",null,"3 (qoniqarli)",null,3]
["JN va ON oʻtkazgan professor-oʻqituvchi imzosi"]
["Jami talabalar soni:",null,{"$f":"COUNTIF(B11:B41,\"?*\")-1","v":30},"5 (aʻlo)",{"$f":"COUNTIF(D11:D41,\"5*\")","v":3}]
[null,null," ","4 (yaxshi)",{"$f":"COUNTIF(D11:D41,\"4*\")","v":3}]
[null,null,null,"3 (qoniqarli)",{"$f":"COUNTIF(D11:D41,\"3*\")","v":19}]
[null,null,null,"oʻzlashtira olmagan",{"$f":"COUNTIF(D11:D41,\"2*\")","v":2}]
[null,null,null,"kelmagan",{"$f":"COUNTIF(D11:D41,\"k*\")","v":3}]
[null,"Fakultet dekani ____________ A.Absamatov",null,"Kafedra mudiri:__________________"]
[null,"        M.Oʻ.            Imzo                    F.I.SH.",null,"         Imzo                    F.I.SH."]
[null,null,null,null,"8a-shakl"]
[{"$f":"A2","v":"OʻZBEKISTON RESPUBLIKASI OLIY TAʻLIM, FAN VA INNOVATSIYALAR VAZIRLIGI"}]
["TERMIZ DAVLAT UNIVERSITETI"]
["BAHOLASH QAYDNOMASI №___"]
["IQTISODIYOT VA TURIZM FAKULTETI IQTISODIYOT TAʻLIM YOʻNALISHI 1-KURS 1-SEMESTR 101-GURUH"]
["Moliya bozori"]
["Maʻruza oʻqituvchisi: ",null,null,{"$f":"+D7","v":"Amaliyot oʻqituvchisi: "}]
["YaN oʻtkazuvchi komissiya: "]
[{"$f":"A9","v":"Semestrda fanga ajratilgan umumiy soatlar:"},null,null,{"$f":"+D9","v":"YaN oʻtkazilgan sana: "}]
[]
[{"$f":"A11","v":"№"},{"$f":"B11","v":"Talabaning familiyasi, ismi, sharifi"},{"$f":"C11","v":"Reyting daftarchasining raqami"},{"$f":"D11","v":"YaN"},{"$f":"E11","v":"YaN oʻtkazuvchining imzosi"},"YaN"]
[{"$f":"SUBTOTAL(103,B61)*(B61<>\"\")*(MAX(A$60:A60)+1)","v":0},{"$f":"IF(D12<=\"2 (qoniqarsiz)\",B12,IF(D12=\"kelmagan\",B12,\"\"))","v":""},{"$f":"C12","v":0},{"$f":"IF(F61=5,\"5 (a'lo)\",IF(AND(F61=4),\"4 (yaxshi)\",IF(AND(F61=3),\"3 (qoniqarli)\",IF(AND(F61=2),\"2 (qoniqarsiz)\",IF(AND(F61=1),\"kelmagan\",IF(AND(F61=\"\"),\"\",))))))","v":""}]
[{"$f":"SUBTOTAL(103,B62)*(B62<>\"\")*(MAX(A$60:A61)+1)","v":0},"",0,""]
[{"$f":"SUBTOTAL(103,B63)*(B63<>\"\")*(MAX(A$60:A62)+1)","v":0},"",0,""]
[{"$f":"SUBTOTAL(103,B64)*(B64<>\"\")*(MAX(A$60:A63)+1)","v":0},"",0,""]
[{"$f":"SUBTOTAL(103,B65)*(B65<>\"\")*(MAX(A$60:A64)+1)","v":0},"",0,""]
[{"$f":"SUBTOTAL(103,B66)*(B66<>\"\")*(MAX(A$60:A65)+1)","v":0},"",0,""]
[{"$f":"SUBTOTAL(103,B67)*(B67<>\"\")*(MAX(A$60:A66)+1)","v":0},"",0,""]
[{"$f":"SUBTOTAL(103,B68)*(B68<>\"\")*(MAX(A$60:A67)+1)","v":1},"Axmedov Alisher Oʻktamboevich",0,"2 (qoniqarsiz)",null,2]
[{"$f":"SUBTOTAL(103,B69)*(B69<>\"\")*(MAX(A$60:A68)+1)","v":0},"",0,""]
[{"$f":"SUBTOTAL(103,B70)*(B70<>\"\")*(MAX(A$60:A69)+1)","v":0},"",0,""]
[{"$f":"SUBTOTAL(103,B71)*(B71<>\"\")*(MAX(A$60:A70)+1)","v":2},"Joʻraev Farrux Sobirovich",0,"3 (qoniqarli)",null,3]
[{"$f":"SUBTOTAL(103,B72)*(B72<>\"\")*(MAX(A$60:A71)+1)","v":0},"",0,""]
[{"$f":"SUBTOTAL(103,B73)*(B73<>\"\")*(MAX(A$60:A72)+1)","v":0},"",0,""]
[{"$f":"SUBTOTAL(103,B74)*(B74<>\"\")*(MAX(A$60:A73)+1)","v":0},"",0,""]
[{"$f":"SUBTOTAL(103,B75)*(B75<>\"\")*(MAX(A$60:A74)+1)","v":3},"Karimov Bozor Abdugʻapparovich",0,"2 (qoniqarsiz)",null,2]
[{"$f":"SUBTOTAL(103,B76)*(B76<>\"\")*(MAX(A$60:A75)+1)","v":0},"",0,""]
[{"$f":"SUBTOTAL(103,B77)*(B77<>\"\")*(MAX(A$60:A76)+1)","v":0},"",0,""]
[{"$f":"SUBTOTAL(103,B78)*(B78<>\"\")*(MAX(A$60:A77)+1)","v":0},"",0,""]
[{"$f":"SUBTOTAL(103,B79)*(B79<>\"\")*(MAX(A$60:A78)+1)","v":0},"",0,""]
[{"$f":"SUBTOTAL(103,B80)*(B80<>\"\")*(MAX(A$60:A79)+1)","v":0},"",0,""]
[{"$f":"SUBTOTAL(103,B81)*(B81<>\"\")*(MAX(A$60:A80)+1)","v":4},"Mamatqulova Sevara Faxriddin qizi",0,"3 (qoniqarli)",null,3]
[{"$f":"SUBTOTAL(103,B82)*(B82<>\"\")*(MAX(A$60:A81)+1)","v":0},"",0,""]
[{"$f":"SUBTOTAL(103,B83)*(B83<>\"\")*(MAX(A$60:A82)+1)","v":0},"",0,""]
[{"$f":"SUBTOTAL(103,B84)*(B84<>\"\")*(MAX(A$60:A83)+1)","v":0},"",0,""]
[{"$f":"SUBTOTAL(103,B85)*(B85<>\"\")*(MAX(A$60:A84)+1)","v":0},"",0,""]
[{"$f":"SUBTOTAL(103,B86)*(B86<>\"\")*(MAX(A$60:A85)+1)","v":5},"Nurova Farogʻat Salohiddin qizi",0,"kelmagan",null,1]
[{"$f":"SUBTOTAL(103,B87)*(B87<>\"\")*(MAX(A$60:A86)+1)","v":0},"",0,""]
[{"$f":"SUBTOTAL(103,B88)*(B88<>\"\")*(MAX(A$60:A87)+1)","v":0},"",0,""]
[{"$f":"SUBTOTAL(103,B89)*(B89<>\"\")*(MAX(A$60:A88)+1)","v":0},"",0,""]
[{"$f":"SUBTOTAL(103,B90)*(B90<>\"\")*(MAX(A$60:A89)+1)","v":0},"",0,""]
[{"$f":"A42","v":"JN va ON oʻtkazgan professor-oʻqituvchi imzosi"}]
["Jami talabalar soni:",null,{"$f":"COUNTIF(B60:B90,\"?*\")-1","v":5},"5 (aʻlo)",{"$f":"COUNTIF(D60:D90,\"5*\")","v":0}]
[null,null," ","4 (yaxshi)",{"$f":"COUNTIF(D60:D90,\"4*\")","v":0}]
[null,null,null,"3 (qoniqarli)",{"$f":"COUNTIF(D60:D90,\"3*\")","v":2}]
[null,null,null,"oʻzlashtira olmagan",{"$f":"COUNTIF(D60:D90,\"2*\")","v":2}]
[null,null,null,"kelmagan",{"$f":"COUNTIF(D60:D90,\"k*\")","v":1}]
[null,{"$f":"B48","v":"Fakultet dekani ____________ A.Absamatov"},null,{"$f":"D48","v":"Kafedra mudiri:__________________"}]
[null,{"$f":"B49","v":"        M.Oʻ.            Imzo                    F.I.SH."},null,{"$f":"D49","v":"         Imzo                    F.I.SH."}]
[null,null,null,null,"8b-shakl"]
[{"$f":"A51","v":"OʻZBEKISTON RESPUBLIKASI OLIY TAʻLIM, FAN VA INNOVATSIYALAR VAZIRLIGI"}]
[{"$f":"A52","v":"TERMIZ DAVLAT UNIVERSITETI"}]
[{"$f":"A4","v":"BAHOLASH QAYDNOMASI №___"}]
[{"$f":"A54","v":"IQTISODIYOT VA TURIZM FAKULTETI IQTISODIYOT TAʻLIM YOʻNALISHI 1-KURS 1-SEMESTR 101-GURUH"}]
[{"$f":"A55","v":"Moliya bozori"}]
[{"$f":"A7","v":"Maʻruza oʻqituvchisi: "},null,null,{"$f":"+D7","v":"Amaliyot oʻqituvchisi: "}]
["YaN oʻtkazuvchi komissiya: "]
[{"$f":"A58","v":"Semestrda fanga ajratilgan umumiy soatlar:"},null,null,{"$f":"+D9","v":"YaN oʻtkazilgan sana: "}]
[]
[{"$f":"A60","v":"№"},{"$f":"B60","v":"Talabaning familiyasi, ismi, sharifi"},{"$f":"C60","v":"Reyting daftarchasining raqami"},{"$f":"D60","v":"YaN"},{"$f":"E60","v":"YaN oʻtkazuvchining imzosi"},"YaN"]
[{"$f":"SUBTOTAL(103,B110)*(B110<>\"\")*(MAX(A$109:A109)+1)","v":0},{"$f":"IF(D61<=\"2 (qoniqarsiz)\",B61,IF(D61=\"kelmagan\",B61,\"\"))","v":""},{"$f":"C12","v":0},{"$f":"IF(F110=5,\"5 (a'lo)\",IF(AND(F110=4),\"4 (yaxshi)\",IF(AND(F110=3),\"3 (qoniqarli)\",IF(AND(F110=2),\"2 (qoniqarsiz)\",IF(AND(F110=1),\"kelmagan\",IF(AND(F110=\"\"),\"\",))))))","v":""}]
[{"$f":"SUBTOTAL(103,B111)*(B111<>\"\")*(MAX(A$109:A110)+1)","v":0},"",0,""]
[{"$f":"SUBTOTAL(103,B112)*(B112<>\"\")*(MAX(A$109:A111)+1)","v":0},"",0,""]
[{"$f":"SUBTOTAL(103,B113)*(B113<>\"\")*(MAX(A$109:A112)+1)","v":0},"",0,""]
[{"$f":"SUBTOTAL(103,B114)*(B114<>\"\")*(MAX(A$109:A113)+1)","v":0},"",0,""]
[{"$f":"SUBTOTAL(103,B115)*(B115<>\"\")*(MAX(A$109:A114)+1)","v":0},"",0,""]
[{"$f":"SUBTOTAL(103,B116)*(B116<>\"\")*(MAX(A$109:A115)+1)","v":0},"",0,""]
[{"$f":"SUBTOTAL(103,B117)*(B117<>\"\")*(MAX(A$109:A116)+1)","v":1},"Axmedov Alisher Oʻktamboevich",0,"2 (qoniqarsiz)",null,2]
[{"$f":"SUBTOTAL(103,B118)*(B118<>\"\")*(MAX(A$109:A117)+1)","v":0},"",0,""]
[{"$f":"SUBTOTAL(103,B119)*(B119<>\"\")*(MAX(A$109:A118)+1)","v":0},"",0,""]
[{"$f":"SUBTOTAL(103,B120)*(B120<>\"\")*(MAX(A$109:A119)+1)","v":0},"",0,""]
[{"$f":"SUBTOTAL(103,B121)*(B121<>\"\")*(MAX(A$109:A120)+1)","v":0},"",0,""]
[{"$f":"SUBTOTAL(103,B122)*(B122<>\"\")*(MAX(A$109:A121)+1)","v":0},"",0,""]
[{"$f":"SUBTOTAL(103,B123)*(B123<>\"\")*(MAX(A$109:A122)+1)","v":0},"",0,""]
[{"$f":"SUBTOTAL(103,B124)*(B124<>\"\")*(MAX(A$109:A123)+1)","v":2},"Karimov Bozor Abdugʻapparovich",0,"3 (qoniqarli)",null,3]
[{"$f":"SUBTOTAL(103,B125)*(B125<>\"\")*(MAX(A$109:A124)+1)","v":0},"",0,""]
[{"$f":"SUBTOTAL(103,B126)*(B126<>\"\")*(MAX(A$109:A125)+1)","v":0},"",0,""]
[{"$f":"SUBTOTAL(103,B127)*(B127<>\"\")*(MAX(A$109:A126)+1)","v":0},"",0,""]
[{"$f":"SUBTOTAL(103,B128)*(B128<>\"\")*(MAX(A$109:A127)+1)","v":0},"",0,""]
[{"$f":"SUBTOTAL(103,B129)*(B129<>\"\")*(MAX(A$109:A128)+1)","v":0},"",0,""]
[{"$f":"SUBTOTAL(103,B130)*(B130<>\"\")*(MAX(A$109:A129)+1)","v":0},"",0,""]
[{"$f":"SUBTOTAL(103,B131)*(B131<>\"\")*(MAX(A$109:A130)+1)","v":0},"",0,""]
[{"$f":"SUBTOTAL(103,B132)*(B132<>\"\")*(MAX(A$109:A131)+1)","v":0},"",0,""]
[{"$f":"SUBTOTAL(103,B133)*(B133<>\"\")*(MAX(A$109:A132)+1)","v":0},"",0,""]
[{"$f":"SUBTOTAL(103,B134)*(B134<>\"\")*(MAX(A$109:A133)+1)","v":0},"",0,""]
[{"$f":"SUBTOTAL(103,B135)*(B135<>\"\")*(MAX(A$109:A134)+1)","v":3},"Nurova Farogʻat Salohiddin qizi",0,"kelmagan",null,1]
[{"$f":"SUBTOTAL(103,B136)*(B136<>\"\")*(MAX(A$109:A135)+1)","v":0},"",0,""]
[{"$f":"SUBTOTAL(103,B137)*(B137<>\"\")*(MAX(A$109:A136)+1)","v":0},"",0,""]
[{"$f":"SUBTOTAL(103,B138)*(B138<>\"\")*(MAX(A$109:A137)+1)","v":0},"",0,""]
[{"$f":"SUBTOTAL(103,B139)*(B139<>\"\")*(MAX(A$109:A138)+1)","v":0},"",0,""]
[{"$f":"A42","v":"JN va ON oʻtkazgan professor-oʻqituvchi imzosi"}]
[null,"Jami talabalar soni:",{"$f":"COUNTIF(B109:B139,\"?*\")-1","v":3},"5 (aʻlo)",{"$f":"COUNTIF(D109:D139,\"5*\")","v":0}]
[null,null," ","4 (yaxshi)",{"$f":"COUNTIF(D109:D139,\"4*\")","v":0}]
[null,null,null,"3 (qoniqarli)",{"$f":"COUNTIF(D109:D139,\"3*\")","v":1}]
[null,null,null,"oʻzlashtira olmagan",{"$f":"COUNTIF(D109:D139,\"2*\")","v":1}]
[null,null,null,"kelmagan",{"$f":"COUNTIF(D109:D139,\"k*\")","v":1}]
[]
[null,{"$f":"B48","v":"Fakultet dekani ____________ A.Absamatov"},null,{"$f":"D48","v":"Kafedra mudiri:__________________"}]
[null,{"$f":"B49","v":"        M.Oʻ.            Imzo                    F.I.SH."},null,{"$f":"D49","v":"         Imzo                    F.I.SH."}]

{"sheet":"Soliq","index":1,"n_rows":148,"n_cols":8,"rows_kept":148,"cut":false,"hidden":false,"merged":[[1,0,1,4],[2,0,2,4],[3,0,3,4],[4,0,4,4],[5,0,5,4],[6,0,6,1],[7,0,7,4],[8,0,8,1],[41,0,41,2],[42,0,42,1],[48,1,48,2],[48,3,48,4],[50,0,50,4],[50,10,51,10],[51,0,51,4],[52,0,52,4],[52,10,53,10],[53,0,53,4],[54,0,54,4],[54,10,55,10],[55,0,55,2],[55,3,55,4],[56,0,56,4],[57,0,57,1],[57,3,57,4],[90,0,90,2],[91,0,91,1],[97,1,97,2],[97,3,97,4],[99,0,99,4],[100,0,100,4],[101,0,101,4],[102,0,102,4],[103,0,103,4],[104,0,104,2],[104,3,104,4],[105,0,105,4],[149,1,149,2],[149,3,149,4],[106,0,106,1],[106,3,106,4],[139,0,139,2],[147,1,147,2],[147,3,147,4],[148,3,148,4]]}
[null,null,null,null,"8-shakl"]
["OʻZBEKISTON RESPUBLIKASI OLIY TAʻLIM, FAN VA INNOVATSIYALAR VAZIRLIGI"]
["TERMIZ DAVLAT UNIVERSITETI"]
["BAHOLASH QAYDNOMASI №___"]
["IQTISODIYOT VA TURIZM FAKULTETI IQTISODIYOT TAʻLIM YOʻNALISHI 1-KURS 1-SEMESTR 101-GURUH"]
["Soliq"]
["Maʻruza oʻqituvchisi: ",null,null,"Amaliyot oʻqituvchisi: "]
["YaN oʻtkazuvchi komissiya: "]
["Semestrda fanga ajratilgan umumiy soatlar:",null,null,"YaN oʻtkazilgan sana: "]
[]
["№","Talabaning familiyasi, ismi, sharifi","Reyting daftarchasining raqami","YaN","YaN oʻtkazuvchining imzosi","YaN"]
[1,"Abdullaeva Dilfuza Bahodir qizi",null,{"$f":"H12","v":""},null,null,{"$f":"IF(D12=\"5 (a'lo)\",5,IF(AND(D12=\"4 (yaxshi)\"),4,IF(AND(D12=\"3 (qoniqarli)\"),3,IF(AND(D12=\"2 (qoniqarsiz)\"),2,IF(AND(D12=\"kelmagan\"),1,IF(AND(D12=\"\"), \"\",))))))","v":""},{"$f":"IF(F12=5,\"5 (a'lo)\",IF(AND(F12=4),\"4 (yaxshi)\",IF(AND(F12=3),\"3 (qoniqarli)\",IF(AND(F12=2),\"2 (qoniqarsiz)\",IF(AND(F12=1),\"kelmagan\",IF(AND(F12=\"\"),\"\",))))))","v":""}]
[2,"Abduraimov Asilbek Eralievich",null,{"$f":"H13","v":""},null,null,{"$f":"IF(D13=\"5 (a'lo)\",5,IF(AND(D13=\"4 (yaxshi)\"),4,IF(AND(D13=\"3 (qoniqarli)\"),3,IF(AND(D13=\"2 (qoniqarsiz)\"),2,IF(AND(D13=\"kelmagan\"),1,IF(AND(D13=\"\"), \"\",))))))","v":""},{"$f":"IF(F13=5,\"5 (a'lo)\",IF(AND(F13=4),\"4 (yaxshi)\",IF(AND(F13=3),\"3 (qoniqarli)\",IF(AND(F13=2),\"2 (qoniqarsiz)\",IF(AND(F13=1),\"kelmagan\",IF(AND(F13=\"\"),\"\",))))))","v":""}]
[3,"Abdurashidova Elnora Yoʻlchi qizi",null,"",null,null,"",""]
[4,"Abdusattorov Baxtiyor Ibragim oʻgʻli",null,"",null,null,"",""]
[5,"Avazov Mirzohid Akmal oʻgʻli",null,"",null,null,"",""]
[6,"Adinaev Javohirbek Bahodir oʻgʻli",null,"",null,null,"",""]
[7,"Allamurodov Bexruz Allamurod oʻgʻli",null,"",null,null,"",""]
[8,"Axmedov Alisher Oʻktamboevich",null,"",null,null,"",""]
[9,"Jamolov Bejan Xurshidovich",null,"",null,null,"",""]
[10,"Jumaeva Nigina Baxtiyor qizi",null,"",null,null,"",""]
[11,"Joʻraev Farrux Sobirovich",null,"",null,null,"",""]
[12,"Joʻraqulov Tolibjon Oʻktamovich",null,"",null,null,"",""]
[13,"Ibragimov Abbos Avaz oʻgʻli",null,"",null,null,"",""]
[14,"Karajanov Nurmuxammed Abdireiimovich",null,"",null,null,"",""]
[15,"Karimov Bozor Abdugʻapparovich",null,"",null,null,"",""]
[16,"Karimova Maftuna Komiljon qizi",null,"",null,null,"",""]
[17,"Qodirov Jahongir Turgʻun oʻgʻli",null,"",null,null,"",""]
[18,"Qurbonov Azizbek Yoʻldosh oʻgʻli",null,"",null,null,"",""]
[19,"Qurbonov Shahriyor Uralovich",null,"",null,null,"",""]
[20,"Mamatqulova Muyassarxon Ashurmuhammadovna",null,"",null,null,"",""]
[21,"Mamatqulova Sevara Faxriddin qizi",null,"",null,null,"",""]
[22,"Mardonov Sirojiddin Abdivoxidovich",null,"",null,null,"",""]
[23,"Mengliev Bekzod Hasan oʻgʻli",null,"",null,null,"",""]
[24,"Muxamadiev Raximjon Farxodjon oʻgʻli",null,"",null,null,"",""]
[25,"Normurodov Maxsudbek Yunusovich",null,"",null,null,"",""]
[26,"Nurova Farogʻat Salohiddin qizi",null,"",null,null,"",""]
[27,"Pardaev Shuhratjon Jahongirovich",null,"",null,null,"",""]
[28,"Ravshanova Munisa Hasan qizi",null,"",null,null,"",""]
[29,"Raximov Asliddin Raxmiddin oʻgʻli",null,"",null,null,"",""]
[30,"Roʻziboev Elbek Abdufattoh oʻgʻli",null,{"$f":"H41","v":""},null,null,"",""]
["JN va ON oʻtkazgan professor-oʻqituvchi imzosi"]
["Jami talabalar soni:",null,{"$f":"COUNTIF(B11:B41,\"?*\")-1","v":30},"5 (aʻlo)",{"$f":"COUNTIF(D11:D41,\"5*\")","v":0}]
[null,null," ","4 (yaxshi)",{"$f":"COUNTIF(D11:D41,\"4*\")","v":0}]
[null,null,null,"3 (qoniqarli)",{"$f":"COUNTIF(D11:D41,\"3*\")","v":0}]
[null,null,null,"oʻzlashtira olmagan",{"$f":"COUNTIF(D11:D41,\"2*\")","v":0}]
[null,null,null,"kelmagan",{"$f":"COUNTIF(D11:D41,\"k*\")","v":0}]
[null,"Fakultet dekani ____________ A.Absamatov",null,"Kafedra mudiri:__________________"]
[null,"        M.Oʻ.            Imzo                    F.I.SH.",null,"         Imzo                    F.I.SH."]
[null,null,null,null,"8a-shakl"]
[{"$f":"A2","v":"OʻZBEKISTON RESPUBLIKASI OLIY TAʻLIM, FAN VA INNOVATSIYALAR VAZIRLIGI"}]
["TERMIZ DAVLAT UNIVERSITETI"]
["BAHOLASH QAYDNOMASI №___"]
["IQTISODIYOT VA TURIZM FAKULTETI IQTISODIYOT TAʻLIM YOʻNALISHI 1-KURS 1-SEMESTR 101-GURUH"]
["Soliq"]
["Maʻruza oʻqituvchisi: ",null,null,{"$f":"+D7","v":"Amaliyot oʻqituvchisi: "}]
["YaN oʻtkazuvchi komissiya: "]
[{"$f":"A9","v":"Semestrda fanga ajratilgan umumiy soatlar:"},null,null,{"$f":"+D9","v":"YaN oʻtkazilgan sana: "}]
[]
[{"$f":"A11","v":"№"},{"$f":"B11","v":"Talabaning familiyasi, ismi, sharifi"},{"$f":"C11","v":"Reyting daftarchasining raqami"},{"$f":"D11","v":"YaN"},{"$f":"E11","v":"YaN oʻtkazuvchining imzosi"},"YaN"]
[{"$f":"SUBTOTAL(103,B61)*(B61<>\"\")*(MAX(A$60:A60)+1)","v":1},{"$f":"IF(D12<=\"2 (qoniqarsiz)\",B12,IF(D12=\"kelmagan\",B12,\"\"))","v":"Abdullaeva Dilfuza Bahodir qizi"},{"$f":"C12","v":0},{"$f":"H61","v":""},null,null,{"$f":"IF(D61=\"5 (a'lo)\",5,IF(AND(D61=\"4 (yaxshi)\"),4,IF(AND(D61=\"3 (qoniqarli)\"),3,IF(AND(D61=\"2 (qoniqarsiz)\"),2,IF(AND(D61=\"kelmagan\"),1,IF(AND(D61=\"\"), \"\",))))))","v":""},{"$f":"IF(F61=5,\"5 (a'lo)\",IF(AND(F61=4),\"4 (yaxshi)\",IF(AND(F61=3),\"3 (qoniqarli)\",IF(AND(F61=2),\"2 (qoniqarsiz)\",IF(AND(F61=1),\"kelmagan\",IF(AND(F61=\"\"),\"\",))))))","v":""}]
[{"$f":"SUBTOTAL(103,B62)*(B62<>\"\")*(MAX(A$60:A61)+1)","v":2},"Abduraimov Asilbek Eralievich",0,"",null,null,{"$f":"IF(D62=\"5 (a'lo)\",5,IF(AND(D62=\"4 (yaxshi)\"),4,IF(AND(D62=\"3 (qoniqarli)\"),3,IF(AND(D62=\"2 (qoniqarsiz)\"),2,IF(AND(D62=\"kelmagan\"),1,IF(AND(D62=\"\"), \"\",))))))","v":""},{"$f":"IF(F62=5,\"5 (a'lo)\",IF(AND(F62=4),\"4 (yaxshi)\",IF(AND(F62=3),\"3 (qoniqarli)\",IF(AND(F62=2),\"2 (qoniqarsiz)\",IF(AND(F62=1),\"kelmagan\",IF(AND(F62=\"\"),\"\",))))))","v":""}]
[{"$f":"SUBTOTAL(103,B63)*(B63<>\"\")*(MAX(A$60:A62)+1)","v":3},"Abdurashidova Elnora Yoʻlchi qizi",0,"",null,null,"",""]
[{"$f":"SUBTOTAL(103,B64)*(B64<>\"\")*(MAX(A$60:A63)+1)","v":4},"Abdusattorov Baxtiyor Ibragim oʻgʻli",0,"",null,null,"",""]
[{"$f":"SUBTOTAL(103,B65)*(B65<>\"\")*(MAX(A$60:A64)+1)","v":5},"Avazov Mirzohid Akmal oʻgʻli",0,"",null,null,"",""]
[{"$f":"SUBTOTAL(103,B66)*(B66<>\"\")*(MAX(A$60:A65)+1)","v":6},"Adinaev Javohirbek Bahodir oʻgʻli",0,"",null,null,"",""]
[{"$f":"SUBTOTAL(103,B67)*(B67<>\"\")*(MAX(A$60:A66)+1)","v":7},"Allamurodov Bexruz Allamurod oʻgʻli",0,"",null,null,"",""]
[{"$f":"SUBTOTAL(103,B68)*(B68<>\"\")*(MAX(A$60:A67)+1)","v":8},"Axmedov Alisher Oʻktamboevich",0,"",null,null,"",""]
[{"$f":"SUBTOTAL(103,B69)*(B69<>\"\")*(MAX(A$60:A68)+1)","v":9},"Jamolov Bejan Xurshidovich",0,"",null,null,"",""]
[{"$f":"SUBTOTAL(103,B70)*(B70<>\"\")*(MAX(A$60:A69)+1)","v":10},"Jumaeva Nigina Baxtiyor qizi",0,"",null,null,"",""]
[{"$f":"SUBTOTAL(103,B71)*(B71<>\"\")*(MAX(A$60:A70)+1)","v":11},"Joʻraev Farrux Sobirovich",0,"",null,null,"",""]
[{"$f":"SUBTOTAL(103,B72)*(B72<>\"\")*(MAX(A$60:A71)+1)","v":12},"Joʻraqulov Tolibjon Oʻktamovich",0,"",null,null,"",""]
[{"$f":"SUBTOTAL(103,B73)*(B73<>\"\")*(MAX(A$60:A72)+1)","v":13},"Ibragimov Abbos Avaz oʻgʻli",0,"",null,null,"",""]
[{"$f":"SUBTOTAL(103,B74)*(B74<>\"\")*(MAX(A$60:A73)+1)","v":14},"Karajanov Nurmuxammed Abdireiimovich",0,"",null,null,"",""]
[{"$f":"SUBTOTAL(103,B75)*(B75<>\"\")*(MAX(A$60:A74)+1)","v":15},"Karimov Bozor Abdugʻapparovich",0,"",null,null,"",""]
[{"$f":"SUBTOTAL(103,B76)*(B76<>\"\")*(MAX(A$60:A75)+1)","v":16},"Karimova Maftuna Komiljon qizi",0,"",null,null,"",""]
[{"$f":"SUBTOTAL(103,B77)*(B77<>\"\")*(MAX(A$60:A76)+1)","v":17},"Qodirov Jahongir Turgʻun oʻgʻli",0,"",null,null,"",""]
[{"$f":"SUBTOTAL(103,B78)*(B78<>\"\")*(MAX(A$60:A77)+1)","v":18},"Qurbonov Azizbek Yoʻldosh oʻgʻli",0,"",null,null,"",""]
[{"$f":"SUBTOTAL(103,B79)*(B79<>\"\")*(MAX(A$60:A78)+1)","v":19},"Qurbonov Shahriyor Uralovich",0,"",null,null,"",""]
[{"$f":"SUBTOTAL(103,B80)*(B80<>\"\")*(MAX(A$60:A79)+1)","v":20},"Mamatqulova Muyassarxon Ashurmuhammadovna",0,"",null,null,"",""]
[{"$f":"SUBTOTAL(103,B81)*(B81<>\"\")*(MAX(A$60:A80)+1)","v":21},"Mamatqulova Sevara Faxriddin qizi",0,"",null,null,"",""]
[{"$f":"SUBTOTAL(103,B82)*(B82<>\"\")*(MAX(A$60:A81)+1)","v":22},"Mardonov Sirojiddin Abdivoxidovich",0,"",null,null,"",""]
[{"$f":"SUBTOTAL(103,B83)*(B83<>\"\")*(MAX(A$60:A82)+1)","v":23},"Mengliev Bekzod Hasan oʻgʻli",0,"",null,null,"",""]
[{"$f":"SUBTOTAL(103,B84)*(B84<>\"\")*(MAX(A$60:A83)+1)","v":24},"Muxamadiev Raximjon Farxodjon oʻgʻli",0,"",null,null,"",""]
[{"$f":"SUBTOTAL(103,B85)*(B85<>\"\")*(MAX(A$60:A84)+1)","v":25},"Normurodov Maxsudbek Yunusovich",0,"",null,null,"",""]
[{"$f":"SUBTOTAL(103,B86)*(B86<>\"\")*(MAX(A$60:A85)+1)","v":26},"Nurova Farogʻat Salohiddin qizi",0,"",null,null,"",""]
[{"$f":"SUBTOTAL(103,B87)*(B87<>\"\")*(MAX(A$60:A86)+1)","v":27},"Pardaev Shuhratjon Jahongirovich",0,"",null,null,"",""]
[{"$f":"SUBTOTAL(103,B88)*(B88<>\"\")*(MAX(A$60:A87)+1)","v":28},"Ravshanova Munisa Hasan qizi",0,"",null,null,"",""]
[{"$f":"SUBTOTAL(103,B89)*(B89<>\"\")*(MAX(A$60:A88)+1)","v":29},"Raximov Asliddin Raxmiddin oʻgʻli",0,"",null,null,"",""]
[{"$f":"SUBTOTAL(103,B90)*(B90<>\"\")*(MAX(A$60:A89)+1)","v":30},"Roʻziboev Elbek Abdufattoh oʻgʻli",0,"",null,null,"",""]
[{"$f":"A42","v":"JN va ON oʻtkazgan professor-oʻqituvchi imzosi"}]
["Jami talabalar soni:",null,{"$f":"COUNTIF(B60:B90,\"?*\")-1","v":30},"5 (aʻlo)",{"$f":"COUNTIF(D60:D90,\"5*\")","v":0}]
[null,null," ","4 (yaxshi)",{"$f":"COUNTIF(D60:D90,\"4*\")","v":0}]
[null,null,null,"3 (qoniqarli)",{"$f":"COUNTIF(D60:D90,\"3*\")","v":0}]
[null,null,null,"oʻzlashtira olmagan",{"$f":"COUNTIF(D60:D90,\"2*\")","v":0}]
[null,null,null,"kelmagan",{"$f":"COUNTIF(D60:D90,\"k*\")","v":0}]
[null,{"$f":"B48","v":"Fakultet dekani ____________ A.Absamatov"},null,{"$f":"D48","v":"Kafedra mudiri:__________________"}]
[null,{"$f":"B49","v":"        M.Oʻ.            Imzo                    F.I.SH."},null,{"$f":"D49","v":"         Imzo                    F.I.SH."}]
[null,null,null,null,"8b-shakl"]
[{"$f":"A51","v":"OʻZBEKISTON RESPUBLIKASI OLIY TAʻLIM, FAN VA INNOVATSIYALAR VAZIRLIGI"}]
[{"$f":"A52","v":"TERMIZ DAVLAT UNIVERSITETI"}]
[{"$f":"A4","v":"BAHOLASH QAYDNOMASI №___"}]
[{"$f":"A54","v":"IQTISODIYOT VA TURIZM FAKULTETI IQTISODIYOT TAʻLIM YOʻNALISHI 1-KURS 1-SEMESTR 101-GURUH"}]
[{"$f":"A55","v":"Soliq"}]
[{"$f":"A7","v":"Maʻruza oʻqituvchisi: "},null,null,{"$f":"+D7","v":"Amaliyot oʻqituvchisi: "}]
["YaN oʻtkazuvchi komissiya: "]
[{"$f":"A58","v":"Semestrda fanga ajratilgan umumiy soatlar:"},null,null,{"$f":"+D9","v":"YaN oʻtkazilgan sana: "}]
[]
[{"$f":"A60","v":"№"},{"$f":"B60","v":"Talabaning familiyasi, ismi, sharifi"},{"$f":"C60","v":"Reyting daftarchasining raqami"},{"$f":"D60","v":"YaN"},{"$f":"E60","v":"YaN oʻtkazuvchining imzosi"},"YaN"]
[{"$f":"SUBTOTAL(103,B110)*(B110<>\"\")*(MAX(A$109:A109)+1)","v":1},{"$f":"IF(D61<=\"2 (qoniqarsiz)\",B61,IF(D61=\"kelmagan\",B61,\"\"))","v":"Abdullaeva Dilfuza Bahodir qizi"},{"$f":"C12","v":0},{"$f":"H110","v":""},null,null,{"$f":"IF(D110=\"5 (a'lo)\",5,IF(AND(D110=\"4 (yaxshi)\"),4,IF(AND(D110=\"3 (qoniqarli)\"),3,IF(AND(D110=\"2 (qoniqarsiz)\"),2,IF(AND(D110=\"kelmagan\"),1,IF(AND(D110=\"\"), \"\",))))))","v":""},{"$f":"IF(F110=5,\"5 (a'lo)\",IF(AND(F110=4),\"4 (yaxshi)\",IF(AND(F110=3),\"3 (qoniqarli)\",IF(AND(F110=2),\"2 (qoniqarsiz)\",IF(AND(F110=1),\"kelmagan\",IF(AND(F110=\"\"),\"\",))))))","v":""}]
[{"$f":"SUBTOTAL(103,B111)*(B111<>\"\")*(MAX(A$109:A110)+1)","v":2},"Abduraimov Asilbek Eralievich",0,{"$f":"H111","v":""},null,null,{"$f":"IF(D111=\"5 (a'lo)\",5,IF(AND(D111=\"4 (yaxshi)\"),4,IF(AND(D111=\"3 (qoniqarli)\"),3,IF(AND(D111=\"2 (qoniqarsiz)\"),2,IF(AND(D111=\"kelmagan\"),1,IF(AND(D111=\"\"), \"\",))))))","v":""},{"$f":"IF(F111=5,\"5 (a'lo)\",IF(AND(F111=4),\"4 (yaxshi)\",IF(AND(F111=3),\"3 (qoniqarli)\",IF(AND(F111=2),\"2 (qoniqarsiz)\",IF(AND(F111=1),\"kelmagan\",IF(AND(F111=\"\"),\"\",))))))","v":""}]
[{"$f":"SUBTOTAL(103,B112)*(B112<>\"\")*(MAX(A$109:A111)+1)","v":3},"Abdurashidova Elnora Yoʻlchi qizi",0,"",null,null,"",""]
[{"$f":"SUBTOTAL(103,B113)*(B113<>\"\")*(MAX(A$109:A112)+1)","v":4},"Abdusattorov Baxtiyor Ibragim oʻgʻli",0,"",null,null,"",""]
[{"$f":"SUBTOTAL(103,B114)*(B114<>\"\")*(MAX(A$109:A113)+1)","v":5},"Avazov Mirzohid Akmal oʻgʻli",0,"",null,null,"",""]
[{"$f":"SUBTOTAL(103,B115)*(B115<>\"\")*(MAX(A$109:A114)+1)","v":6},"Adinaev Javohirbek Bahodir oʻgʻli",0,"",null,null,"",""]
[{"$f":"SUBTOTAL(103,B116)*(B116<>\"\")*(MAX(A$109:A115)+1)","v":7},"Allamurodov Bexruz Allamurod oʻgʻli",0,"",null,null,"",""]
[{"$f":"SUBTOTAL(103,B117)*(B117<>\"\")*(MAX(A$109:A116)+1)","v":8},"Axmedov Alisher Oʻktamboevich",0,"",null,null,"",""]
[{"$f":"SUBTOTAL(103,B118)*(B118<>\"\")*(MAX(A$109:A117)+1)","v":9},"Jamolov Bejan Xurshidovich",0,"",null,null,"",""]
[{"$f":"SUBTOTAL(103,B119)*(B119<>\"\")*(MAX(A$109:A118)+1)","v":10},"Jumaeva Nigina Baxtiyor qizi",0,"",null,null,"",""]
[{"$f":"SUBTOTAL(103,B120)*(B120<>\"\")*(MAX(A$109:A119)+1)","v":11},"Joʻraev Farrux Sobirovich",0,"",null,null,"",""]
[{"$f":"SUBTOTAL(103,B121)*(B121<>\"\")*(MAX(A$109:A120)+1)","v":12},"Joʻraqulov Tolibjon Oʻktamovich",0,"",null,null,"",""]
[{"$f":"SUBTOTAL(103,B122)*(B122<>\"\")*(MAX(A$109:A121)+1)","v":13},"Ibragimov Abbos Avaz oʻgʻli",0,"",null,null,"",""]
[{"$f":"SUBTOTAL(103,B123)*(B123<>\"\")*(MAX(A$109:A122)+1)","v":14},"Karajanov Nurmuxammed Abdireiimovich",0,"",null,null,"",""]
[{"$f":"SUBTOTAL(103,B124)*(B124<>\"\")*(MAX(A$109:A123)+1)","v":15},"Karimov Bozor Abdugʻapparovich",0,"",null,null,"",""]
[{"$f":"SUBTOTAL(103,B125)*(B125<>\"\")*(MAX(A$109:A124)+1)","v":16},"Karimova Maftuna Komiljon qizi",0,"",null,null,"",""]
[{"$f":"SUBTOTAL(103,B126)*(B126<>\"\")*(MAX(A$109:A125)+1)","v":17},"Qodirov Jahongir Turgʻun oʻgʻli",0,"",null,null,"",""]
[{"$f":"SUBTOTAL(103,B127)*(B127<>\"\")*(MAX(A$109:A126)+1)","v":18},"Qurbonov Azizbek Yoʻldosh oʻgʻli",0,"",null,null,"",""]
[{"$f":"SUBTOTAL(103,B128)*(B128<>\"\")*(MAX(A$109:A127)+1)","v":19},"Qurbonov Shahriyor Uralovich",0,"",null,null,"",""]
[{"$f":"SUBTOTAL(103,B129)*(B129<>\"\")*(MAX(A$109:A128)+1)","v":20},"Mamatqulova Muyassarxon Ashurmuhammadovna",0,"",null,null,"",""]
[{"$f":"SUBTOTAL(103,B130)*(B130<>\"\")*(MAX(A$109:A129)+1)","v":21},"Mamatqulova Sevara Faxriddin qizi",0,"",null,null,"",""]
[{"$f":"SUBTOTAL(103,B131)*(B131<>\"\")*(MAX(A$109:A130)+1)","v":22},"Mardonov Sirojiddin Abdivoxidovich",0,"",null,null,"",""]
[{"$f":"SUBTOTAL(103,B132)*(B132<>\"\")*(MAX(A$109:A131)+1)","v":23},"Mengliev Bekzod Hasan oʻgʻli",0,"",null,null,"",""]
[{"$f":"SUBTOTAL(103,B133)*(B133<>\"\")*(MAX(A$109:A132)+1)","v":24},"Muxamadiev Raximjon Farxodjon oʻgʻli",0,"",null,null,"",""]
[{"$f":"SUBTOTAL(103,B134)*(B134<>\"\")*(MAX(A$109:A133)+1)","v":25},"Normurodov Maxsudbek Yunusovich",0,"",null,null,"",""]
[{"$f":"SUBTOTAL(103,B135)*(B135<>\"\")*(MAX(A$109:A134)+1)","v":26},"Nurova Farogʻat Salohiddin qizi",0,"",null,null,"",""]
[{"$f":"SUBTOTAL(103,B136)*(B136<>\"\")*(MAX(A$109:A135)+1)","v":27},"Pardaev Shuhratjon Jahongirovich",0,"",null,null,"",""]
[{"$f":"SUBTOTAL(103,B137)*(B137<>\"\")*(MAX(A$109:A136)+1)","v":28},"Ravshanova Munisa Hasan qizi",0,"",null,null,"",""]
[{"$f":"SUBTOTAL(103,B138)*(B138<>\"\")*(MAX(A$109:A137)+1)","v":29},"Raximov Asliddin Raxmiddin oʻgʻli",0,"",null,null,"",""]
[{"$f":"SUBTOTAL(103,B139)*(B139<>\"\")*(MAX(A$109:A138)+1)","v":30},"Roʻziboev Elbek Abdufattoh oʻgʻli",0,"",null,null,"",""]
[{"$f":"A42","v":"JN va ON oʻtkazgan professor-oʻqituvchi imzosi"}]
[null,"Jami talabalar soni:",{"$f":"COUNTIF(B109:B139,\"?*\")-1","v":30},"5 (aʻlo)",{"$f":"COUNTIF(D109:D139,\"5*\")","v":0}]
[null,null," ","4 (yaxshi)",{"$f":"COUNTIF(D109:D139,\"4*\")","v":0}]
[null,null,null,"3 (qoniqarli)",{"$f":"COUNTIF(D109:D139,\"3*\")","v":0}]
[null,null,null,"oʻzlashtira olmagan",{"$f":"COUNTIF(D109:D139,\"2*\")","v":0}]
[null,null,null,"kelmagan",{"$f":"COUNTIF(D109:D139,\"k*\")","v":0}]
[]
[null,{"$f":"B48","v":"Fakultet dekani ____________ A.Absamatov"},null,{"$f":"D48","v":"Kafedra mudiri:__________________"}]
[null,{"$f":"B49","v":"        M.Oʻ.            Imzo                    F.I.SH."},null,{"$f":"D49","v":"         Imzo                    F.I.SH."}]

{"sheet":"DB","index":2,"n_rows":148,"n_cols":8,"rows_kept":148,"cut":false,"hidden":false,"merged":[[1,0,1,4],[2,0,2,4],[3,0,3,4],[4,0,4,4],[5,0,5,4],[6,0,6,1],[7,0,7,4],[8,0,8,1],[41,0,41,2],[42,0,42,1],[48,1,48,2],[48,3,48,4],[50,0,50,4],[50,10,51,10],[51,0,51,4],[52,0,52,4],[52,10,53,10],[53,0,53,4],[54,0,54,4],[54,10,55,10],[55,0,55,2],[55,3,55,4],[56,0,56,4],[57,0,57,1],[57,3,57,4],[90,0,90,2],[91,0,91,1],[97,1,97,2],[97,3,97,4],[99,0,99,4],[100,0,100,4],[101,0,101,4],[102,0,102,4],[103,0,103,4],[104,0,104,2],[104,3,104,4],[105,0,105,4],[149,1,149,2],[149,3,149,4],[106,0,106,1],[106,3,106,4],[139,0,139,2],[147,1,147,2],[147,3,147,4],[148,3,148,4]]}
[null,null,null,null,"8-shakl"]
["OʻZBEKISTON RESPUBLIKASI OLIY TAʻLIM, FAN VA INNOVATSIYALAR VAZIRLIGI"]
["TERMIZ DAVLAT UNIVERSITETI"]
["BAHOLASH QAYDNOMASI №___"]
["IQTISODIYOT VA TURIZM FAKULTETI IQTISODIYOT TAʻLIM YOʻNALISHI 1-KURS 1-SEMESTR 101-GURUH"]
["Davlat budjeti"]
["Maʻruza oʻqituvchisi: ",null,null,"Amaliyot oʻqituvchisi: "]
["YaN oʻtkazuvchi komissiya: "]
["Semestrda fanga ajratilgan umumiy soatlar:",null,null,"YaN oʻtkazilgan sana: "]
[]
["№","Talabaning familiyasi, ismi, sharifi","Reyting daftarchasining raqami","YaN","YaN oʻtkazuvchining imzosi","YaN"]
[1,"Abdullaeva Dilfuza Bahodir qizi",null,{"$f":"H12","v":""},null,null,{"$f":"IF(D12=\"5 (a'lo)\",5,IF(AND(D12=\"4 (yaxshi)\"),4,IF(AND(D12=\"3 (qoniqarli)\"),3,IF(AND(D12=\"2 (qoniqarsiz)\"),2,IF(AND(D12=\"kelmagan\"),1,IF(AND(D12=\"\"), \"\",))))))","v":""},{"$f":"IF(F12=5,\"5 (a'lo)\",IF(AND(F12=4),\"4 (yaxshi)\",IF(AND(F12=3),\"3 (qoniqarli)\",IF(AND(F12=2),\"2 (qoniqarsiz)\",IF(AND(F12=1),\"kelmagan\",IF(AND(F12=\"\"),\"\",))))))","v":""}]
[2,"Abduraimov Asilbek Eralievich",null,{"$f":"H13","v":""},null,null,{"$f":"IF(D13=\"5 (a'lo)\",5,IF(AND(D13=\"4 (yaxshi)\"),4,IF(AND(D13=\"3 (qoniqarli)\"),3,IF(AND(D13=\"2 (qoniqarsiz)\"),2,IF(AND(D13=\"kelmagan\"),1,IF(AND(D13=\"\"), \"\",))))))","v":""},{"$f":"IF(F13=5,\"5 (a'lo)\",IF(AND(F13=4),\"4 (yaxshi)\",IF(AND(F13=3),\"3 (qoniqarli)\",IF(AND(F13=2),\"2 (qoniqarsiz)\",IF(AND(F13=1),\"kelmagan\",IF(AND(F13=\"\"),\"\",))))))","v":""}]
[3,"Abdurashidova Elnora Yoʻlchi qizi",null,"",null,null,"",""]
[4,"Abdusattorov Baxtiyor Ibragim oʻgʻli",null,"",null,null,"",""]
[5,"Avazov Mirzohid Akmal oʻgʻli",null,"",null,null,"",""]
[6,"Adinaev Javohirbek Bahodir oʻgʻli",null,"",null,null,"",""]
[7,"Allamurodov Bexruz Allamurod oʻgʻli",null,"",null,null,"",""]
[8,"Axmedov Alisher Oʻktamboevich",null,"",null,null,"",""]
[9,"Jamolov Bejan Xurshidovich",null,"",null,null,"",""]
[10,"Jumaeva Nigina Baxtiyor qizi",null,"",null,null,"",""]
[11,"Joʻraev Farrux Sobirovich",null,"",null,null,"",""]
[12,"Joʻraqulov Tolibjon Oʻktamovich",null,"",null,null,"",""]
[13,"Ibragimov Abbos Avaz oʻgʻli",null,"",null,null,"",""]
[14,"Karajanov Nurmuxammed Abdireiimovich",null,"",null,null,"",""]
[15,"Karimov Bozor Abdugʻapparovich",null,"",null,null,"",""]
[16,"Karimova Maftuna Komiljon qizi",null,"",null,null,"",""]
[17,"Qodirov Jahongir Turgʻun oʻgʻli",null,"",null,null,"",""]
[18,"Qurbonov Azizbek Yoʻldosh oʻgʻli",null,"",null,null,"",""]
[19,"Qurbonov Shahriyor Uralovich",null,"",null,null,"",""]
[20,"Mamatqulova Muyassarxon Ashurmuhammadovna",null,"",null,null,"",""]
[21,"Mamatqulova Sevara Faxriddin qizi",null,"",null,null,"",""]
[22,"Mardonov Sirojiddin Abdivoxidovich",null,"",null,null,"",""]
[23,"Mengliev Bekzod Hasan oʻgʻli",null,"",null,null,"",""]
[24,"Muxamadiev Raximjon Farxodjon oʻgʻli",null,"",null,null,"",""]
[25,"Normurodov Maxsudbek Yunusovich",null,"",null,null,"",""]
[26,"Nurova Farogʻat Salohiddin qizi",null,"",null,null,"",""]
[27,"Pardaev Shuhratjon Jahongirovich",null,"",null,null,"",""]
[28,"Ravshanova Munisa Hasan qizi",null,"",null,null,"",""]
[29,"Raximov Asliddin Raxmiddin oʻgʻli",null,"",null,null,"",""]
[30,"Roʻziboev Elbek Abdufattoh oʻgʻli",null,{"$f":"H41","v":""},null,null,"",""]
["JN va ON oʻtkazgan professor-oʻqituvchi imzosi"]
["Jami talabalar soni:",null,{"$f":"COUNTIF(B11:B41,\"?*\")-1","v":30},"5 (aʻlo)",{"$f":"COUNTIF(D11:D41,\"5*\")","v":0}]
[null,null," ","4 (yaxshi)",{"$f":"COUNTIF(D11:D41,\"4*\")","v":0}]
[null,null,null,"3 (qoniqarli)",{"$f":"COUNTIF(D11:D41,\"3*\")","v":0}]
[null,null,null,"oʻzlashtira olmagan",{"$f":"COUNTIF(D11:D41,\"2*\")","v":0}]
[null,null,null,"kelmagan",{"$f":"COUNTIF(D11:D41,\"k*\")","v":0}]
[null,"Fakultet dekani ____________ A.Absamatov",null,"Kafedra mudiri:__________________"]
[null,"        M.Oʻ.            Imzo                    F.I.SH.",null,"         Imzo                    F.I.SH."]
[null,null,null,null,"8a-shakl"]
[{"$f":"A2","v":"OʻZBEKISTON RESPUBLIKASI OLIY TAʻLIM, FAN VA INNOVATSIYALAR VAZIRLIGI"}]
["TERMIZ DAVLAT UNIVERSITETI"]
["BAHOLASH QAYDNOMASI №___"]
["IQTISODIYOT VA TURIZM FAKULTETI IQTISODIYOT TAʻLIM YOʻNALISHI 1-KURS 1-SEMESTR 101-GURUH"]
["Davlat budjeti"]
["Maʻruza oʻqituvchisi: ",null,null,{"$f":"+D7","v":"Amaliyot oʻqituvchisi: "}]
["YaN oʻtkazuvchi komissiya: "]
[{"$f":"A9","v":"Semestrda fanga ajratilgan umumiy soatlar:"},null,null,{"$f":"+D9","v":"YaN oʻtkazilgan sana: "}]
[]
[{"$f":"A11","v":"№"},{"$f":"B11","v":"Talabaning familiyasi, ismi, sharifi"},{"$f":"C11","v":"Reyting daftarchasining raqami"},{"$f":"D11","v":"YaN"},{"$f":"E11","v":"YaN oʻtkazuvchining imzosi"},"YaN"]
[{"$f":"SUBTOTAL(103,B61)*(B61<>\"\")*(MAX(A$60:A60)+1)","v":1},{"$f":"IF(D12<=\"2 (qoniqarsiz)\",B12,IF(D12=\"kelmagan\",B12,\"\"))","v":"Abdullaeva Dilfuza Bahodir qizi"},{"$f":"C12","v":0},{"$f":"H61","v":""},null,null,{"$f":"IF(D61=\"5 (a'lo)\",5,IF(AND(D61=\"4 (yaxshi)\"),4,IF(AND(D61=\"3 (qoniqarli)\"),3,IF(AND(D61=\"2 (qoniqarsiz)\"),2,IF(AND(D61=\"kelmagan\"),1,IF(AND(D61=\"\"), \"\",))))))","v":""},{"$f":"IF(F61=5,\"5 (a'lo)\",IF(AND(F61=4),\"4 (yaxshi)\",IF(AND(F61=3),\"3 (qoniqarli)\",IF(AND(F61=2),\"2 (qoniqarsiz)\",IF(AND(F61=1),\"kelmagan\",IF(AND(F61=\"\"),\"\",))))))","v":""}]
[{"$f":"SUBTOTAL(103,B62)*(B62<>\"\")*(MAX(A$60:A61)+1)","v":2},"Abduraimov Asilbek Eralievich",0,"",null,null,{"$f":"IF(D62=\"5 (a'lo)\",5,IF(AND(D62=\"4 (yaxshi)\"),4,IF(AND(D62=\"3 (qoniqarli)\"),3,IF(AND(D62=\"2 (qoniqarsiz)\"),2,IF(AND(D62=\"kelmagan\"),1,IF(AND(D62=\"\"), \"\",))))))","v":""},{"$f":"IF(F62=5,\"5 (a'lo)\",IF(AND(F62=4),\"4 (yaxshi)\",IF(AND(F62=3),\"3 (qoniqarli)\",IF(AND(F62=2),\"2 (qoniqarsiz)\",IF(AND(F62=1),\"kelmagan\",IF(AND(F62=\"\"),\"\",))))))","v":""}]
[{"$f":"SUBTOTAL(103,B63)*(B63<>\"\")*(MAX(A$60:A62)+1)","v":3},"Abdurashidova Elnora Yoʻlchi qizi",0,"",null,null,"",""]
[{"$f":"SUBTOTAL(103,B64)*(B64<>\"\")*(MAX(A$60:A63)+1)","v":4},"Abdusattorov Baxtiyor Ibragim oʻgʻli",0,"",null,null,"",""]
[{"$f":"SUBTOTAL(103,B65)*(B65<>\"\")*(MAX(A$60:A64)+1)","v":5},"Avazov Mirzohid Akmal oʻgʻli",0,"",null,null,"",""]
[{"$f":"SUBTOTAL(103,B66)*(B66<>\"\")*(MAX(A$60:A65)+1)","v":6},"Adinaev Javohirbek Bahodir oʻgʻli",0,"",null,null,"",""]
[{"$f":"SUBTOTAL(103,B67)*(B67<>\"\")*(MAX(A$60:A66)+1)","v":7},"Allamurodov Bexruz Allamurod oʻgʻli",0,"",null,null,"",""]
[{"$f":"SUBTOTAL(103,B68)*(B68<>\"\")*(MAX(A$60:A67)+1)","v":8},"Axmedov Alisher Oʻktamboevich",0,"",null,null,"",""]
[{"$f":"SUBTOTAL(103,B69)*(B69<>\"\")*(MAX(A$60:A68)+1)","v":9},"Jamolov Bejan Xurshidovich",0,"",null,null,"",""]
[{"$f":"SUBTOTAL(103,B70)*(B70<>\"\")*(MAX(A$60:A69)+1)","v":10},"Jumaeva Nigina Baxtiyor qizi",0,"",null,null,"",""]
[{"$f":"SUBTOTAL(103,B71)*(B71<>\"\")*(MAX(A$60:A70)+1)","v":11},"Joʻraev Farrux Sobirovich",0,"",null,null,"",""]
[{"$f":"SUBTOTAL(103,B72)*(B72<>\"\")*(MAX(A$60:A71)+1)","v":12},"Joʻraqulov Tolibjon Oʻktamovich",0,"",null,null,"",""]
[{"$f":"SUBTOTAL(103,B73)*(B73<>\"\")*(MAX(A$60:A72)+1)","v":13},"Ibragimov Abbos Avaz oʻgʻli",0,"",null,null,"",""]
[{"$f":"SUBTOTAL(103,B74)*(B74<>\"\")*(MAX(A$60:A73)+1)","v":14},"Karajanov Nurmuxammed Abdireiimovich",0,"",null,null,"",""]
[{"$f":"SUBTOTAL(103,B75)*(B75<>\"\")*(MAX(A$60:A74)+1)","v":15},"Karimov Bozor Abdugʻapparovich",0,"",null,null,"",""]
[{"$f":"SUBTOTAL(103,B76)*(B76<>\"\")*(MAX(A$60:A75)+1)","v":16},"Karimova Maftuna Komiljon qizi",0,"",null,null,"",""]
[{"$f":"SUBTOTAL(103,B77)*(B77<>\"\")*(MAX(A$60:A76)+1)","v":17},"Qodirov Jahongir Turgʻun oʻgʻli",0,"",null,null,"",""]
[{"$f":"SUBTOTAL(103,B78)*(B78<>\"\")*(MAX(A$60:A77)+1)","v":18},"Qurbonov Azizbek Yoʻldosh oʻgʻli",0,"",null,null,"",""]
[{"$f":"SUBTOTAL(103,B79)*(B79<>\"\")*(MAX(A$60:A78)+1)","v":19},"Qurbonov Shahriyor Uralovich",0,"",null,null,"",""]
[{"$f":"SUBTOTAL(103,B80)*(B80<>\"\")*(MAX(A$60:A79)+1)","v":20},"Mamatqulova Muyassarxon Ashurmuhammadovna",0,"",null,null,"",""]
[{"$f":"SUBTOTAL(103,B81)*(B81<>\"\")*(MAX(A$60:A80)+1)","v":21},"Mamatqulova Sevara Faxriddin qizi",0,"",null,null,"",""]
[{"$f":"SUBTOTAL(103,B82)*(B82<>\"\")*(MAX(A$60:A81)+1)","v":22},"Mardonov Sirojiddin Abdivoxidovich",0,"",null,null,"",""]
[{"$f":"SUBTOTAL(103,B83)*(B83<>\"\")*(MAX(A$60:A82)+1)","v":23},"Mengliev Bekzod Hasan oʻgʻli",0,"",null,null,"",""]
[{"$f":"SUBTOTAL(103,B84)*(B84<>\"\")*(MAX(A$60:A83)+1)","v":24},"Muxamadiev Raximjon Farxodjon oʻgʻli",0,"",null,null,"",""]
[{"$f":"SUBTOTAL(103,B85)*(B85<>\"\")*(MAX(A$60:A84)+1)","v":25},"Normurodov Maxsudbek Yunusovich",0,"",null,null,"",""]
[{"$f":"SUBTOTAL(103,B86)*(B86<>\"\")*(MAX(A$60:A85)+1)","v":26},"Nurova Farogʻat Salohiddin qizi",0,"",null,null,"",""]
[{"$f":"SUBTOTAL(103,B87)*(B87<>\"\")*(MAX(A$60:A86)+1)","v":27},"Pardaev Shuhratjon Jahongirovich",0,"",null,null,"",""]
[{"$f":"SUBTOTAL(103,B88)*(B88<>\"\")*(MAX(A$60:A87)+1)","v":28},"Ravshanova Munisa Hasan qizi",0,"",null,null,"",""]
[{"$f":"SUBTOTAL(103,B89)*(B89<>\"\")*(MAX(A$60:A88)+1)","v":29},"Raximov Asliddin Raxmiddin oʻgʻli",0,"",null,null,"",""]
[{"$f":"SUBTOTAL(103,B90)*(B90<>\"\")*(MAX(A$60:A89)+1)","v":30},"Roʻziboev Elbek Abdufattoh oʻgʻli",0,"",null,null,"",""]
[{"$f":"A42","v":"JN va ON oʻtkazgan professor-oʻqituvchi imzosi"}]
["Jami talabalar soni:",null,{"$f":"COUNTIF(B60:B90,\"?*\")-1","v":30},"5 (aʻlo)",{"$f":"COUNTIF(D60:D90,\"5*\")","v":0}]
[null,null," ","4 (yaxshi)",{"$f":"COUNTIF(D60:D90,\"4*\")","v":0}]
[null,null,null,"3 (qoniqarli)",{"$f":"COUNTIF(D60:D90,\"3*\")","v":0}]
[null,null,null,"oʻzlashtira olmagan",{"$f":"COUNTIF(D60:D90,\"2*\")","v":0}]
[null,null,null,"kelmagan",{"$f":"COUNTIF(D60:D90,\"k*\")","v":0}]
[null,{"$f":"B48","v":"Fakultet dekani ____________ A.Absamatov"},null,{"$f":"D48","v":"Kafedra mudiri:__________________"}]
[null,{"$f":"B49","v":"        M.Oʻ.            Imzo                    F.I.SH."},null,{"$f":"D49","v":"         Imzo                    F.I.SH."}]
[null,null,null,null,"8b-shakl"]
[{"$f":"A51","v":"OʻZBEKISTON RESPUBLIKASI OLIY TAʻLIM, FAN VA INNOVATSIYALAR VAZIRLIGI"}]
[{"$f":"A52","v":"TERMIZ DAVLAT UNIVERSITETI"}]
[{"$f":"A4","v":"BAHOLASH QAYDNOMASI №___"}]
[{"$f":"A54","v":"IQTISODIYOT VA TURIZM FAKULTETI IQTISODIYOT TAʻLIM YOʻNALISHI 1-KURS 1-SEMESTR 101-GURUH"}]
[{"$f":"A55","v":"Davlat budjeti"}]
[{"$f":"A7","v":"Maʻruza oʻqituvchisi: "},null,null,{"$f":"+D7","v":"Amaliyot oʻqituvchisi: "}]
["YaN oʻtkazuvchi komissiya: "]
[{"$f":"A58","v":"Semestrda fanga ajratilgan umumiy soatlar:"},null,null,{"$f":"+D9","v":"YaN oʻtkazilgan sana: "}]
[]
[{"$f":"A60","v":"№"},{"$f":"B60","v":"Talabaning familiyasi, ismi, sharifi"},{"$f":"C60","v":"Reyting daftarchasining raqami"},{"$f":"D60","v":"YaN"},{"$f":"E60","v":"YaN oʻtkazuvchining imzosi"},"YaN"]
[{"$f":"SUBTOTAL(103,B110)*(B110<>\"\")*(MAX(A$109:A109)+1)","v":1},{"$f":"IF(D61<=\"2 (qoniqarsiz)\",B61,IF(D61=\"kelmagan\",B61,\"\"))","v":"Abdullaeva Dilfuza Bahodir qizi"},{"$f":"C12","v":0},{"$f":"H110","v":""},null,null,{"$f":"IF(D110=\"5 (a'lo)\",5,IF(AND(D110=\"4 (yaxshi)\"),4,IF(AND(D110=\"3 (qoniqarli)\"),3,IF(AND(D110=\"2 (qoniqarsiz)\"),2,IF(AND(D110=\"kelmagan\"),1,IF(AND(D110=\"\"), \"\",))))))","v":""},{"$f":"IF(F110=5,\"5 (a'lo)\",IF(AND(F110=4),\"4 (yaxshi)\",IF(AND(F110=3),\"3 (qoniqarli)\",IF(AND(F110=2),\"2 (qoniqarsiz)\",IF(AND(F110=1),\"kelmagan\",IF(AND(F110=\"\"),\"\",))))))","v":""}]
[{"$f":"SUBTOTAL(103,B111)*(B111<>\"\")*(MAX(A$109:A110)+1)","v":2},"Abduraimov Asilbek Eralievich",0,{"$f":"H111","v":""},null,null,{"$f":"IF(D111=\"5 (a'lo)\",5,IF(AND(D111=\"4 (yaxshi)\"),4,IF(AND(D111=\"3 (qoniqarli)\"),3,IF(AND(D111=\"2 (qoniqarsiz)\"),2,IF(AND(D111=\"kelmagan\"),1,IF(AND(D111=\"\"), \"\",))))))","v":""},{"$f":"IF(F111=5,\"5 (a'lo)\",IF(AND(F111=4),\"4 (yaxshi)\",IF(AND(F111=3),\"3 (qoniqarli)\",IF(AND(F111=2),\"2 (qoniqarsiz)\",IF(AND(F111=1),\"kelmagan\",IF(AND(F111=\"\"),\"\",))))))","v":""}]
[{"$f":"SUBTOTAL(103,B112)*(B112<>\"\")*(MAX(A$109:A111)+1)","v":3},"Abdurashidova Elnora Yoʻlchi qizi",0,"",null,null,"",""]
[{"$f":"SUBTOTAL(103,B113)*(B113<>\"\")*(MAX(A$109:A112)+1)","v":4},"Abdusattorov Baxtiyor Ibragim oʻgʻli",0,"",null,null,"",""]
[{"$f":"SUBTOTAL(103,B114)*(B114<>\"\")*(MAX(A$109:A113)+1)","v":5},"Avazov Mirzohid Akmal oʻgʻli",0,"",null,null,"",""]
[{"$f":"SUBTOTAL(103,B115)*(B115<>\"\")*(MAX(A$109:A114)+1)","v":6},"Adinaev Javohirbek Bahodir oʻgʻli",0,"",null,null,"",""]
[{"$f":"SUBTOTAL(103,B116)*(B116<>\"\")*(MAX(A$109:A115)+1)","v":7},"Allamurodov Bexruz Allamurod oʻgʻli",0,"",null,null,"",""]
[{"$f":"SUBTOTAL(103,B117)*(B117<>\"\")*(MAX(A$109:A116)+1)","v":8},"Axmedov Alisher Oʻktamboevich",0,"",null,null,"",""]
[{"$f":"SUBTOTAL(103,B118)*(B118<>\"\")*(MAX(A$109:A117)+1)","v":9},"Jamolov Bejan Xurshidovich",0,"",null,null,"",""]
[{"$f":"SUBTOTAL(103,B119)*(B119<>\"\")*(MAX(A$109:A118)+1)","v":10},"Jumaeva Nigina Baxtiyor qizi",0,"",null,null,"",""]
[{"$f":"SUBTOTAL(103,B120)*(B120<>\"\")*(MAX(A$109:A119)+1)","v":11},"Joʻraev Farrux Sobirovich",0,"",null,null,"",""]
[{"$f":"SUBTOTAL(103,B121)*(B121<>\"\")*(MAX(A$109:A120)+1)","v":12},"Joʻraqulov Tolibjon Oʻktamovich",0,"",null,null,"",""]
[{"$f":"SUBTOTAL(103,B122)*(B122<>\"\")*(MAX(A$109:A121)+1)","v":13},"Ibragimov Abbos Avaz oʻgʻli",0,"",null,null,"",""]
[{"$f":"SUBTOTAL(103,B123)*(B123<>\"\")*(MAX(A$109:A122)+1)","v":14},"Karajanov Nurmuxammed Abdireiimovich",0,"",null,null,"",""]
[{"$f":"SUBTOTAL(103,B124)*(B124<>\"\")*(MAX(A$109:A123)+1)","v":15},"Karimov Bozor Abdugʻapparovich",0,"",null,null,"",""]
[{"$f":"SUBTOTAL(103,B125)*(B125<>\"\")*(MAX(A$109:A124)+1)","v":16},"Karimova Maftuna Komiljon qizi",0,"",null,null,"",""]
[{"$f":"SUBTOTAL(103,B126)*(B126<>\"\")*(MAX(A$109:A125)+1)","v":17},"Qodirov Jahongir Turgʻun oʻgʻli",0,"",null,null,"",""]
[{"$f":"SUBTOTAL(103,B127)*(B127<>\"\")*(MAX(A$109:A126)+1)","v":18},"Qurbonov Azizbek Yoʻldosh oʻgʻli",0,"",null,null,"",""]
[{"$f":"SUBTOTAL(103,B128)*(B128<>\"\")*(MAX(A$109:A127)+1)","v":19},"Qurbonov Shahriyor Uralovich",0,"",null,null,"",""]
[{"$f":"SUBTOTAL(103,B129)*(B129<>\"\")*(MAX(A$109:A128)+1)","v":20},"Mamatqulova Muyassarxon Ashurmuhammadovna",0,"",null,null,"",""]
[{"$f":"SUBTOTAL(103,B130)*(B130<>\"\")*(MAX(A$109:A129)+1)","v":21},"Mamatqulova Sevara Faxriddin qizi",0,"",null,null,"",""]
[{"$f":"SUBTOTAL(103,B131)*(B131<>\"\")*(MAX(A$109:A130)+1)","v":22},"Mardonov Sirojiddin Abdivoxidovich",0,"",null,null,"",""]
[{"$f":"SUBTOTAL(103,B132)*(B132<>\"\")*(MAX(A$109:A131)+1)","v":23},"Mengliev Bekzod Hasan oʻgʻli",0,"",null,null,"",""]
[{"$f":"SUBTOTAL(103,B133)*(B133<>\"\")*(MAX(A$109:A132)+1)","v":24},"Muxamadiev Raximjon Farxodjon oʻgʻli",0,"",null,null,"",""]
[{"$f":"SUBTOTAL(103,B134)*(B134<>\"\")*(MAX(A$109:A133)+1)","v":25},"Normurodov Maxsudbek Yunusovich",0,"",null,null,"",""]
[{"$f":"SUBTOTAL(103,B135)*(B135<>\"\")*(MAX(A$109:A134)+1)","v":26},"Nurova Farogʻat Salohiddin qizi",0,"",null,null,"",""]
[{"$f":"SUBTOTAL(103,B136)*(B136<>\"\")*(MAX(A$109:A135)+1)","v":27},"Pardaev Shuhratjon Jahongirovich",0,"",null,null,"",""]
[{"$f":"SUBTOTAL(103,B137)*(B137<>\"\")*(MAX(A$109:A136)+1)","v":28},"Ravshanova Munisa Hasan qizi",0,"",null,null,"",""]
[{"$f":"SUBTOTAL(103,B138)*(B138<>\"\")*(MAX(A$109:A137)+1)","v":29},"Raximov Asliddin Raxmiddin oʻgʻli",0,"",null,null,"",""]
[{"$f":"SUBTOTAL(103,B139)*(B139<>\"\")*(MAX(A$109:A138)+1)","v":30},"Roʻziboev Elbek Abdufattoh oʻgʻli",0,"",null,null,"",""]
[{"$f":"A42","v":"JN va ON oʻtkazgan professor-oʻqituvchi imzosi"}]
[null,"Jami talabalar soni:",{"$f":"COUNTIF(B109:B139,\"?*\")-1","v":30},"5 (aʻlo)",{"$f":"COUNTIF(D109:D139,\"5*\")","v":0}]
[null,null," ","4 (yaxshi)",{"$f":"COUNTIF(D109:D139,\"4*\")","v":0}]
[null,null,null,"3 (qoniqarli)",{"$f":"COUNTIF(D109:D139,\"3*\")","v":0}]
[null,null,null,"oʻzlashtira olmagan",{"$f":"COUNTIF(D109:D139,\"2*\")","v":0}]
[null,null,null,"kelmagan",{"$f":"COUNTIF(D109:D139,\"k*\")","v":0}]
[]
[null,{"$f":"B48","v":"Fakultet dekani ____________ A.Absamatov"},null,{"$f":"D48","v":"Kafedra mudiri:__________________"}]
[null,{"$f":"B49","v":"        M.Oʻ.            Imzo                    F.I.SH."},null,{"$f":"D49","v":"         Imzo                    F.I.SH."}]

{"sheet":"PI","index":3,"n_rows":148,"n_cols":8,"rows_kept":148,"cut":false,"hidden":false,"merged":[[1,0,1,4],[2,0,2,4],[3,0,3,4],[4,0,4,4],[5,0,5,4],[6,0,6,1],[7,0,7,4],[8,0,8,1],[41,0,41,2],[42,0,42,1],[48,1,48,2],[48,3,48,4],[50,0,50,4],[50,10,51,10],[51,0,51,4],[52,0,52,4],[52,10,53,10],[53,0,53,4],[54,0,54,4],[54,10,55,10],[55,0,55,2],[55,3,55,4],[56,0,56,4],[57,0,57,1],[57,3,57,4],[90,0,90,2],[91,0,91,1],[97,1,97,2],[97,3,97,4],[99,0,99,4],[100,0,100,4],[101,0,101,4],[102,0,102,4],[103,0,103,4],[104,0,104,2],[104,3,104,4],[105,0,105,4],[149,1,149,2],[149,3,149,4],[106,0,106,1],[106,3,106,4],[139,0,139,2],[147,1,147,2],[147,3,147,4],[148,3,148,4]]}
[null,null,null,null,"8-shakl"]
["OʻZBEKISTON RESPUBLIKASI OLIY TAʻLIM, FAN VA INNOVATSIYALAR VAZIRLIGI"]
["TERMIZ DAVLAT UNIVERSITETI"]
["BAHOLASH QAYDNOMASI №___"]
["IQTISODIYOT VA TURIZM FAKULTETI IQTISODIYOT TAʻLIM YOʻNALISHI 1-KURS 1-SEMESTR 101-GURUH"]
["Pensiya ishi"]
["Maʻruza oʻqituvchisi: ",null,null,"Amaliyot oʻqituvchisi: "]
["YaN oʻtkazuvchi komissiya: "]
["Semestrda fanga ajratilgan umumiy soatlar:",null,null,"YaN oʻtkazilgan sana: "]
[]
["№","Talabaning familiyasi, ismi, sharifi","Reyting daftarchasining raqami","YaN","YaN oʻtkazuvchining imzosi","YaN"]
[1,"Abdullaeva Dilfuza Bahodir qizi",null,{"$f":"H12","v":""},null,null,{"$f":"IF(D12=\"5 (a'lo)\",5,IF(AND(D12=\"4 (yaxshi)\"),4,IF(AND(D12=\"3 (qoniqarli)\"),3,IF(AND(D12=\"2 (qoniqarsiz)\"),2,IF(AND(D12=\"kelmagan\"),1,IF(AND(D12=\"\"), \"\",))))))","v":""},{"$f":"IF(F12=5,\"5 (a'lo)\",IF(AND(F12=4),\"4 (yaxshi)\",IF(AND(F12=3),\"3 (qoniqarli)\",IF(AND(F12=2),\"2 (qoniqarsiz)\",IF(AND(F12=1),\"kelmagan\",IF(AND(F12=\"\"),\"\",))))))","v":""}]
[2,"Abduraimov Asilbek Eralievich",null,{"$f":"H13","v":""},null,null,{"$f":"IF(D13=\"5 (a'lo)\",5,IF(AND(D13=\"4 (yaxshi)\"),4,IF(AND(D13=\"3 (qoniqarli)\"),3,IF(AND(D13=\"2 (qoniqarsiz)\"),2,IF(AND(D13=\"kelmagan\"),1,IF(AND(D13=\"\"), \"\",))))))","v":""},{"$f":"IF(F13=5,\"5 (a'lo)\",IF(AND(F13=4),\"4 (yaxshi)\",IF(AND(F13=3),\"3 (qoniqarli)\",IF(AND(F13=2),\"2 (qoniqarsiz)\",IF(AND(F13=1),\"kelmagan\",IF(AND(F13=\"\"),\"\",))))))","v":""}]
[3,"Abdurashidova Elnora Yoʻlchi qizi",null,"",null,null,"",""]
[4,"Abdusattorov Baxtiyor Ibragim oʻgʻli",null,"",null,null,"",""]
[5,"Avazov Mirzohid Akmal oʻgʻli",null,"",null,null,"",""]
[6,"Adinaev Javohirbek Bahodir oʻgʻli",null,"",null,null,"",""]
[7,"Allamurodov Bexruz Allamurod oʻgʻli",null,"",null,null,"",""]
[8,"Axmedov Alisher Oʻktamboevich",null,"",null,null,"",""]
[9,"Jamolov Bejan Xurshidovich",null,"",null,null,"",""]
[10,"Jumaeva Nigina Baxtiyor qizi",null,"",null,null,"",""]
[11,"Joʻraev Farrux Sobirovich",null,"",null,null,"",""]
[12,"Joʻraqulov Tolibjon Oʻktamovich",null,"",null,null,"",""]
[13,"Ibragimov Abbos Avaz oʻgʻli",null,"",null,null,"",""]
[14,"Karajanov Nurmuxammed Abdireiimovich",null,"",null,null,"",""]
[15,"Karimov Bozor Abdugʻapparovich",null,"",null,null,"",""]
[16,"Karimova Maftuna Komiljon qizi",null,"",null,null,"",""]
[17,"Qodirov Jahongir Turgʻun oʻgʻli",null,"",null,null,"",""]
[18,"Qurbonov Azizbek Yoʻldosh oʻgʻli",null,"",null,null,"",""]
[19,"Qurbonov Shahriyor Uralovich",null,"",null,null,"",""]
[20,"Mamatqulova Muyassarxon Ashurmuhammadovna",null,"",null,null,"",""]
[21,"Mamatqulova Sevara Faxriddin qizi",null,"",null,null,"",""]
[22,"Mardonov Sirojiddin Abdivoxidovich",null,"",null,null,"",""]
[23,"Mengliev Bekzod Hasan oʻgʻli",null,"",null,null,"",""]
[24,"Muxamadiev Raximjon Farxodjon oʻgʻli",null,"",null,null,"",""]
[25,"Normurodov Maxsudbek Yunusovich",null,"",null,null,"",""]
[26,"Nurova Farogʻat Salohiddin qizi",null,"",null,null,"",""]
[27,"Pardaev Shuhratjon Jahongirovich",null,"",null,null,"",""]
[28,"Ravshanova Munisa Hasan qizi",null,"",null,null,"",""]
[29,"Raximov Asliddin Raxmiddin oʻgʻli",null,"",null,null,"",""]
[30,"Roʻziboev Elbek Abdufattoh oʻgʻli",null,{"$f":"H41","v":""},null,null,"",""]
["JN va ON oʻtkazgan professor-oʻqituvchi imzosi"]
["Jami talabalar soni:",null,{"$f":"COUNTIF(B11:B41,\"?*\")-1","v":30},"5 (aʻlo)",{"$f":"COUNTIF(D11:D41,\"5*\")","v":0}]
[null,null," ","4 (yaxshi)",{"$f":"COUNTIF(D11:D41,\"4*\")","v":0}]
[null,null,null,"3 (qoniqarli)",{"$f":"COUNTIF(D11:D41,\"3*\")","v":0}]
[null,null,null,"oʻzlashtira olmagan",{"$f":"COUNTIF(D11:D41,\"2*\")","v":0}]
[null,null,null,"kelmagan",{"$f":"COUNTIF(D11:D41,\"k*\")","v":0}]
[null,"Fakultet dekani ____________ A.Absamatov",null,"Kafedra mudiri:__________________"]
[null,"        M.Oʻ.            Imzo                    F.I.SH.",null,"         Imzo                    F.I.SH."]
[null,null,null,null,"8a-shakl"]
[{"$f":"A2","v":"OʻZBEKISTON RESPUBLIKASI OLIY TAʻLIM, FAN VA INNOVATSIYALAR VAZIRLIGI"}]
["TERMIZ DAVLAT UNIVERSITETI"]
["BAHOLASH QAYDNOMASI №___"]
["IQTISODIYOT VA TURIZM FAKULTETI IQTISODIYOT TAʻLIM YOʻNALISHI 1-KURS 1-SEMESTR 101-GURUH"]
["Pensiya ishi"]
["Maʻruza oʻqituvchisi: ",null,null,{"$f":"+D7","v":"Amaliyot oʻqituvchisi: "}]
["YaN oʻtkazuvchi komissiya: "]
[{"$f":"A9","v":"Semestrda fanga ajratilgan umumiy soatlar:"},null,null,{"$f":"+D9","v":"YaN oʻtkazilgan sana: "}]
[]
[{"$f":"A11","v":"№"},{"$f":"B11","v":"Talabaning familiyasi, ismi, sharifi"},{"$f":"C11","v":"Reyting daftarchasining raqami"},{"$f":"D11","v":"YaN"},{"$f":"E11","v":"YaN oʻtkazuvchining imzosi"},"YaN"]
[{"$f":"SUBTOTAL(103,B61)*(B61<>\"\")*(MAX(A$60:A60)+1)","v":1},{"$f":"IF(D12<=\"2 (qoniqarsiz)\",B12,IF(D12=\"kelmagan\",B12,\"\"))","v":"Abdullaeva Dilfuza Bahodir qizi"},{"$f":"C12","v":0},{"$f":"H61","v":""},null,null,{"$f":"IF(D61=\"5 (a'lo)\",5,IF(AND(D61=\"4 (yaxshi)\"),4,IF(AND(D61=\"3 (qoniqarli)\"),3,IF(AND(D61=\"2 (qoniqarsiz)\"),2,IF(AND(D61=\"kelmagan\"),1,IF(AND(D61=\"\"), \"\",))))))","v":""},{"$f":"IF(F61=5,\"5 (a'lo)\",IF(AND(F61=4),\"4 (yaxshi)\",IF(AND(F61=3),\"3 (qoniqarli)\",IF(AND(F61=2),\"2 (qoniqarsiz)\",IF(AND(F61=1),\"kelmagan\",IF(AND(F61=\"\"),\"\",))))))","v":""}]
[{"$f":"SUBTOTAL(103,B62)*(B62<>\"\")*(MAX(A$60:A61)+1)","v":2},"Abduraimov Asilbek Eralievich",0,"",null,null,{"$f":"IF(D62=\"5 (a'lo)\",5,IF(AND(D62=\"4 (yaxshi)\"),4,IF(AND(D62=\"3 (qoniqarli)\"),3,IF(AND(D62=\"2 (qoniqarsiz)\"),2,IF(AND(D62=\"kelmagan\"),1,IF(AND(D62=\"\"), \"\",))))))","v":""},{"$f":"IF(F62=5,\"5 (a'lo)\",IF(AND(F62=4),\"4 (yaxshi)\",IF(AND(F62=3),\"3 (qoniqarli)\",IF(AND(F62=2),\"2 (qoniqarsiz)\",IF(AND(F62=1),\"kelmagan\",IF(AND(F62=\"\"),\"\",))))))","v":""}]
[{"$f":"SUBTOTAL(103,B63)*(B63<>\"\")*(MAX(A$60:A62)+1)","v":3},"Abdurashidova Elnora Yoʻlchi qizi",0,"",null,null,"",""]
[{"$f":"SUBTOTAL(103,B64)*(B64<>\"\")*(MAX(A$60:A63)+1)","v":4},"Abdusattorov Baxtiyor Ibragim oʻgʻli",0,"",null,null,"",""]
[{"$f":"SUBTOTAL(103,B65)*(B65<>\"\")*(MAX(A$60:A64)+1)","v":5},"Avazov Mirzohid Akmal oʻgʻli",0,"",null,null,"",""]
[{"$f":"SUBTOTAL(103,B66)*(B66<>\"\")*(MAX(A$60:A65)+1)","v":6},"Adinaev Javohirbek Bahodir oʻgʻli",0,"",null,null,"",""]
[{"$f":"SUBTOTAL(103,B67)*(B67<>\"\")*(MAX(A$60:A66)+1)","v":7},"Allamurodov Bexruz Allamurod oʻgʻli",0,"",null,null,"",""]
[{"$f":"SUBTOTAL(103,B68)*(B68<>\"\")*(MAX(A$60:A67)+1)","v":8},"Axmedov Alisher Oʻktamboevich",0,"",null,null,"",""]
[{"$f":"SUBTOTAL(103,B69)*(B69<>\"\")*(MAX(A$60:A68)+1)","v":9},"Jamolov Bejan Xurshidovich",0,"",null,null,"",""]
[{"$f":"SUBTOTAL(103,B70)*(B70<>\"\")*(MAX(A$60:A69)+1)","v":10},"Jumaeva Nigina Baxtiyor qizi",0,"",null,null,"",""]
[{"$f":"SUBTOTAL(103,B71)*(B71<>\"\")*(MAX(A$60:A70)+1)","v":11},"Joʻraev Farrux Sobirovich",0,"",null,null,"",""]
[{"$f":"SUBTOTAL(103,B72)*(B72<>\"\")*(MAX(A$60:A71)+1)","v":12},"Joʻraqulov Tolibjon Oʻktamovich",0,"",null,null,"",""]
[{"$f":"SUBTOTAL(103,B73)*(B73<>\"\")*(MAX(A$60:A72)+1)","v":13},"Ibragimov Abbos Avaz oʻgʻli",0,"",null,null,"",""]
[{"$f":"SUBTOTAL(103,B74)*(B74<>\"\")*(MAX(A$60:A73)+1)","v":14},"Karajanov Nurmuxammed Abdireiimovich",0,"",null,null,"",""]
[{"$f":"SUBTOTAL(103,B75)*(B75<>\"\")*(MAX(A$60:A74)+1)","v":15},"Karimov Bozor Abdugʻapparovich",0,"",null,null,"",""]
[{"$f":"SUBTOTAL(103,B76)*(B76<>\"\")*(MAX(A$60:A75)+1)","v":16},"Karimova Maftuna Komiljon qizi",0,"",null,null,"",""]
[{"$f":"SUBTOTAL(103,B77)*(B77<>\"\")*(MAX(A$60:A76)+1)","v":17},"Qodirov Jahongir Turgʻun oʻgʻli",0,"",null,null,"",""]
[{"$f":"SUBTOTAL(103,B78)*(B78<>\"\")*(MAX(A$60:A77)+1)","v":18},"Qurbonov Azizbek Yoʻldosh oʻgʻli",0,"",null,null,"",""]
[{"$f":"SUBTOTAL(103,B79)*(B79<>\"\")*(MAX(A$60:A78)+1)","v":19},"Qurbonov Shahriyor Uralovich",0,"",null,null,"",""]
[{"$f":"SUBTOTAL(103,B80)*(B80<>\"\")*(MAX(A$60:A79)+1)","v":20},"Mamatqulova Muyassarxon Ashurmuhammadovna",0,"",null,null,"",""]
[{"$f":"SUBTOTAL(103,B81)*(B81<>\"\")*(MAX(A$60:A80)+1)","v":21},"Mamatqulova Sevara Faxriddin qizi",0,"",null,null,"",""]
[{"$f":"SUBTOTAL(103,B82)*(B82<>\"\")*(MAX(A$60:A81)+1)","v":22},"Mardonov Sirojiddin Abdivoxidovich",0,"",null,null,"",""]
[{"$f":"SUBTOTAL(103,B83)*(B83<>\"\")*(MAX(A$60:A82)+1)","v":23},"Mengliev Bekzod Hasan oʻgʻli",0,"",null,null,"",""]
[{"$f":"SUBTOTAL(103,B84)*(B84<>\"\")*(MAX(A$60:A83)+1)","v":24},"Muxamadiev Raximjon Farxodjon oʻgʻli",0,"",null,null,"",""]
[{"$f":"SUBTOTAL(103,B85)*(B85<>\"\")*(MAX(A$60:A84)+1)","v":25},"Normurodov Maxsudbek Yunusovich",0,"",null,null,"",""]
[{"$f":"SUBTOTAL(103,B86)*(B86<>\"\")*(MAX(A$60:A85)+1)","v":26},"Nurova Farogʻat Salohiddin qizi",0,"",null,null,"",""]
[{"$f":"SUBTOTAL(103,B87)*(B87<>\"\")*(MAX(A$60:A86)+1)","v":27},"Pardaev Shuhratjon Jahongirovich",0,"",null,null,"",""]
[{"$f":"SUBTOTAL(103,B88)*(B88<>\"\")*(MAX(A$60:A87)+1)","v":28},"Ravshanova Munisa Hasan qizi",0,"",null,null,"",""]
[{"$f":"SUBTOTAL(103,B89)*(B89<>\"\")*(MAX(A$60:A88)+1)","v":29},"Raximov Asliddin Raxmiddin oʻgʻli",0,"",null,null,"",""]
[{"$f":"SUBTOTAL(103,B90)*(B90<>\"\")*(MAX(A$60:A89)+1)","v":30},"Roʻziboev Elbek Abdufattoh oʻgʻli",0,"",null,null,"",""]
[{"$f":"A42","v":"JN va ON oʻtkazgan professor-oʻqituvchi imzosi"}]
["Jami talabalar soni:",null,{"$f":"COUNTIF(B60:B90,\"?*\")-1","v":30},"5 (aʻlo)",{"$f":"COUNTIF(D60:D90,\"5*\")","v":0}]
[null,null," ","4 (yaxshi)",{"$f":"COUNTIF(D60:D90,\"4*\")","v":0}]
[null,null,null,"3 (qoniqarli)",{"$f":"COUNTIF(D60:D90,\"3*\")","v":0}]
[null,null,null,"oʻzlashtira olmagan",{"$f":"COUNTIF(D60:D90,\"2*\")","v":0}]
[null,null,null,"kelmagan",{"$f":"COUNTIF(D60:D90,\"k*\")","v":0}]
[null,{"$f":"B48","v":"Fakultet dekani ____________ A.Absamatov"},null,{"$f":"D48","v":"Kafedra mudiri:__________________"}]
[null,{"$f":"B49","v":"        M.Oʻ.            Imzo                    F.I.SH."},null,{"$f":"D49","v":"         Imzo                    F.I.SH."}]
[null,null,null,null,"8b-shakl"]
[{"$f":"A51","v":"OʻZBEKISTON RESPUBLIKASI OLIY TAʻLIM, FAN VA INNOVATSIYALAR VAZIRLIGI"}]
[{"$f":"A52","v":"TERMIZ DAVLAT UNIVERSITETI"}]
[{"$f":"A4","v":"BAHOLASH QAYDNOMASI №___"}]
[{"$f":"A54","v":"IQTISODIYOT VA TURIZM FAKULTETI IQTISODIYOT TAʻLIM YOʻNALISHI 1-KURS 1-SEMESTR 101-GURUH"}]
[{"$f":"A55","v":"Pensiya ishi"}]
[{"$f":"A7","v":"Maʻruza oʻqituvchisi: "},null,null,{"$f":"+D7","v":"Amaliyot oʻqituvchisi: "}]
["YaN oʻtkazuvchi komissiya: "]
[{"$f":"A58","v":"Semestrda fanga ajratilgan umumiy soatlar:"},null,null,{"$f":"+D9","v":"YaN oʻtkazilgan sana: "}]
[]
[{"$f":"A60","v":"№"},{"$f":"B60","v":"Talabaning familiyasi, ismi, sharifi"},{"$f":"C60","v":"Reyting daftarchasining raqami"},{"$f":"D60","v":"YaN"},{"$f":"E60","v":"YaN oʻtkazuvchining imzosi"},"YaN"]
[{"$f":"SUBTOTAL(103,B110)*(B110<>\"\")*(MAX(A$109:A109)+1)","v":1},{"$f":"IF(D61<=\"2 (qoniqarsiz)\",B61,IF(D61=\"kelmagan\",B61,\"\"))","v":"Abdullaeva Dilfuza Bahodir qizi"},{"$f":"C12","v":0},{"$f":"H110","v":""},null,null,{"$f":"IF(D110=\"5 (a'lo)\",5,IF(AND(D110=\"4 (yaxshi)\"),4,IF(AND(D110=\"3 (qoniqarli)\"),3,IF(AND(D110=\"2 (qoniqarsiz)\"),2,IF(AND(D110=\"kelmagan\"),1,IF(AND(D110=\"\"), \"\",))))))","v":""},{"$f":"IF(F110=5,\"5 (a'lo)\",IF(AND(F110=4),\"4 (yaxshi)\",IF(AND(F110=3),\"3 (qoniqarli)\",IF(AND(F110=2),\"2 (qoniqarsiz)\",IF(AND(F110=1),\"kelmagan\",IF(AND(F110=\"\"),\"\",))))))","v":""}]
[{"$f":"SUBTOTAL(103,B111)*(B111<>\"\")*(MAX(A$109:A110)+1)","v":2},"Abduraimov Asilbek Eralievich",0,{"$f":"H111","v":""},null,null,{"$f":"IF(D111=\"5 (a'lo)\",5,IF(AND(D111=\"4 (yaxshi)\"),4,IF(AND(D111=\"3 (qoniqarli)\"),3,IF(AND(D111=\"2 (qoniqarsiz)\"),2,IF(AND(D111=\"kelmagan\"),1,IF(AND(D111=\"\"), \"\",))))))","v":""},{"$f":"IF(F111=5,\"5 (a'lo)\",IF(AND(F111=4),\"4 (yaxshi)\",IF(AND(F111=3),\"3 (qoniqarli)\",IF(AND(F111=2),\"2 (qoniqarsiz)\",IF(AND(F111=1),\"kelmagan\",IF(AND(F111=\"\"),\"\",))))))","v":""}]
[{"$f":"SUBTOTAL(103,B112)*(B112<>\"\")*(MAX(A$109:A111)+1)","v":3},"Abdurashidova Elnora Yoʻlchi qizi",0,"",null,null,"",""]
[{"$f":"SUBTOTAL(103,B113)*(B113<>\"\")*(MAX(A$109:A112)+1)","v":4},"Abdusattorov Baxtiyor Ibragim oʻgʻli",0,"",null,null,"",""]
[{"$f":"SUBTOTAL(103,B114)*(B114<>\"\")*(MAX(A$109:A113)+1)","v":5},"Avazov Mirzohid Akmal oʻgʻli",0,"",null,null,"",""]
[{"$f":"SUBTOTAL(103,B115)*(B115<>\"\")*(MAX(A$109:A114)+1)","v":6},"Adinaev Javohirbek Bahodir oʻgʻli",0,"",null,null,"",""]
[{"$f":"SUBTOTAL(103,B116)*(B116<>\"\")*(MAX(A$109:A115)+1)","v":7},"Allamurodov Bexruz Allamurod oʻgʻli",0,"",null,null,"",""]
[{"$f":"SUBTOTAL(103,B117)*(B117<>\"\")*(MAX(A$109:A116)+1)","v":8},"Axmedov Alisher Oʻktamboevich",0,"",null,null,"",""]
[{"$f":"SUBTOTAL(103,B118)*(B118<>\"\")*(MAX(A$109:A117)+1)","v":9},"Jamolov Bejan Xurshidovich",0,"",null,null,"",""]
[{"$f":"SUBTOTAL(103,B119)*(B119<>\"\")*(MAX(A$109:A118)+1)","v":10},"Jumaeva Nigina Baxtiyor qizi",0,"",null,null,"",""]
[{"$f":"SUBTOTAL(103,B120)*(B120<>\"\")*(MAX(A$109:A119)+1)","v":11},"Joʻraev Farrux Sobirovich",0,"",null,null,"",""]
[{"$f":"SUBTOTAL(103,B121)*(B121<>\"\")*(MAX(A$109:A120)+1)","v":12},"Joʻraqulov Tolibjon Oʻktamovich",0,"",null,null,"",""]
[{"$f":"SUBTOTAL(103,B122)*(B122<>\"\")*(MAX(A$109:A121)+1)","v":13},"Ibragimov Abbos Avaz oʻgʻli",0,"",null,null,"",""]
[{"$f":"SUBTOTAL(103,B123)*(B123<>\"\")*(MAX(A$109:A122)+1)","v":14},"Karajanov Nurmuxammed Abdireiimovich",0,"",null,null,"",""]
[{"$f":"SUBTOTAL(103,B124)*(B124<>\"\")*(MAX(A$109:A123)+1)","v":15},"Karimov Bozor Abdugʻapparovich",0,"",null,null,"",""]
[{"$f":"SUBTOTAL(103,B125)*(B125<>\"\")*(MAX(A$109:A124)+1)","v":16},"Karimova Maftuna Komiljon qizi",0,"",null,null,"",""]
[{"$f":"SUBTOTAL(103,B126)*(B126<>\"\")*(MAX(A$109:A125)+1)","v":17},"Qodirov Jahongir Turgʻun oʻgʻli",0,"",null,null,"",""]
[{"$f":"SUBTOTAL(103,B127)*(B127<>\"\")*(MAX(A$109:A126)+1)","v":18},"Qurbonov Azizbek Yoʻldosh oʻgʻli",0,"",null,null,"",""]
[{"$f":"SUBTOTAL(103,B128)*(B128<>\"\")*(MAX(A$109:A127)+1)","v":19},"Qurbonov Shahriyor Uralovich",0,"",null,null,"",""]
[{"$f":"SUBTOTAL(103,B129)*(B129<>\"\")*(MAX(A$109:A128)+1)","v":20},"Mamatqulova Muyassarxon Ashurmuhammadovna",0,"",null,null,"",""]
[{"$f":"SUBTOTAL(103,B130)*(B130<>\"\")*(MAX(A$109:A129)+1)","v":21},"Mamatqulova Sevara Faxriddin qizi",0,"",null,null,"",""]
[{"$f":"SUBTOTAL(103,B131)*(B131<>\"\")*(MAX(A$109:A130)+1)","v":22},"Mardonov Sirojiddin Abdivoxidovich",0,"",null,null,"",""]
[{"$f":"SUBTOTAL(103,B132)*(B132<>\"\")*(MAX(A$109:A131)+1)","v":23},"Mengliev Bekzod Hasan oʻgʻli",0,"",null,null,"",""]
[{"$f":"SUBTOTAL(103,B133)*(B133<>\"\")*(MAX(A$109:A132)+1)","v":24},"Muxamadiev Raximjon Farxodjon oʻgʻli",0,"",null,null,"",""]
[{"$f":"SUBTOTAL(103,B134)*(B134<>\"\")*(MAX(A$109:A133)+1)","v":25},"Normurodov Maxsudbek Yunusovich",0,"",null,null,"",""]
[{"$f":"SUBTOTAL(103,B135)*(B135<>\"\")*(MAX(A$109:A134)+1)","v":26},"Nurova Farogʻat Salohiddin qizi",0,"",null,null,"",""]
[{"$f":"SUBTOTAL(103,B136)*(B136<>\"\")*(MAX(A$109:A135)+1)","v":27},"Pardaev Shuhratjon Jahongirovich",0,"",null,null,"",""]
[{"$f":"SUBTOTAL(103,B137)*(B137<>\"\")*(MAX(A$109:A136)+1)","v":28},"Ravshanova Munisa Hasan qizi",0,"",null,null,"",""]
[{"$f":"SUBTOTAL(103,B138)*(B138<>\"\")*(MAX(A$109:A137)+1)","v":29},"Raximov Asliddin Raxmiddin oʻgʻli",0,"",null,null,"",""]
[{"$f":"SUBTOTAL(103,B139)*(B139<>\"\")*(MAX(A$109:A138)+1)","v":30},"Roʻziboev Elbek Abdufattoh oʻgʻli",0,"",null,null,"",""]
[{"$f":"A42","v":"JN va ON oʻtkazgan professor-oʻqituvchi imzosi"}]
[null,"Jami talabalar soni:",{"$f":"COUNTIF(B109:B139,\"?*\")-1","v":30},"5 (aʻlo)",{"$f":"COUNTIF(D109:D139,\"5*\")","v":0}]
[null,null," ","4 (yaxshi)",{"$f":"COUNTIF(D109:D139,\"4*\")","v":0}]
[null,null,null,"3 (qoniqarli)",{"$f":"COUNTIF(D109:D139,\"3*\")","v":0}]
[null,null,null,"oʻzlashtira olmagan",{"$f":"COUNTIF(D109:D139,\"2*\")","v":0}]
[null,null,null,"kelmagan",{"$f":"COUNTIF(D109:D139,\"k*\")","v":0}]
[]
[null,{"$f":"B48","v":"Fakultet dekani ____________ A.Absamatov"},null,{"$f":"D48","v":"Kafedra mudiri:__________________"}]
[null,{"$f":"B49","v":"        M.Oʻ.            Imzo                    F.I.SH."},null,{"$f":"D49","v":"         Imzo                    F.I.SH."}]

{"sheet":"PVB","index":4,"n_rows":148,"n_cols":8,"rows_kept":148,"cut":false,"hidden":false,"merged":[[1,0,1,4],[2,0,2,4],[3,0,3,4],[4,0,4,4],[5,0,5,4],[6,0,6,1],[7,0,7,4],[8,0,8,1],[41,0,41,2],[42,0,42,1],[48,1,48,2],[48,3,48,4],[50,0,50,4],[50,10,51,10],[51,0,51,4],[52,0,52,4],[52,10,53,10],[53,0,53,4],[54,0,54,4],[54,10,55,10],[55,0,55,2],[55,3,55,4],[56,0,56,4],[57,0,57,1],[57,3,57,4],[90,0,90,2],[91,0,91,1],[97,1,97,2],[97,3,97,4],[99,0,99,4],[100,0,100,4],[101,0,101,4],[102,0,102,4],[103,0,103,4],[104,0,104,2],[104,3,104,4],[105,0,105,4],[149,1,149,2],[149,3,149,4],[106,0,106,1],[106,3,106,4],[139,0,139,2],[147,1,147,2],[147,3,147,4],[148,3,148,4]]}
[null,null,null,null,"8-shakl"]
["OʻZBEKISTON RESPUBLIKASI OLIY TAʻLIM, FAN VA INNOVATSIYALAR VAZIRLIGI"]
["TERMIZ DAVLAT UNIVERSITETI"]
["BAHOLASH QAYDNOMASI №___"]
["IQTISODIYOT VA TURIZM FAKULTETI IQTISODIYOT TAʻLIM YOʻNALISHI 1-KURS 1-SEMESTR 101-GURUH"]
["Pul va banklar"]
["Maʻruza oʻqituvchisi: ",null,null,"Amaliyot oʻqituvchisi: "]
["YaN oʻtkazuvchi komissiya: "]
["Semestrda fanga ajratilgan umumiy soatlar:",null,null,"YaN oʻtkazilgan sana: "]
[]
["№","Talabaning familiyasi, ismi, sharifi","Reyting daftarchasining raqami","YaN","YaN oʻtkazuvchining imzosi","YaN"]
[1,"Abdullaeva Dilfuza Bahodir qizi",null,{"$f":"H12","v":""},null,null,{"$f":"IF(D12=\"5 (a'lo)\",5,IF(AND(D12=\"4 (yaxshi)\"),4,IF(AND(D12=\"3 (qoniqarli)\"),3,IF(AND(D12=\"2 (qoniqarsiz)\"),2,IF(AND(D12=\"kelmagan\"),1,IF(AND(D12=\"\"), \"\",))))))","v":""},{"$f":"IF(F12=5,\"5 (a'lo)\",IF(AND(F12=4),\"4 (yaxshi)\",IF(AND(F12=3),\"3 (qoniqarli)\",IF(AND(F12=2),\"2 (qoniqarsiz)\",IF(AND(F12=1),\"kelmagan\",IF(AND(F12=\"\"),\"\",))))))","v":""}]
[2,"Abduraimov Asilbek Eralievich",null,{"$f":"H13","v":""},null,null,{"$f":"IF(D13=\"5 (a'lo)\",5,IF(AND(D13=\"4 (yaxshi)\"),4,IF(AND(D13=\"3 (qoniqarli)\"),3,IF(AND(D13=\"2 (qoniqarsiz)\"),2,IF(AND(D13=\"kelmagan\"),1,IF(AND(D13=\"\"), \"\",))))))","v":""},{"$f":"IF(F13=5,\"5 (a'lo)\",IF(AND(F13=4),\"4 (yaxshi)\",IF(AND(F13=3),\"3 (qoniqarli)\",IF(AND(F13=2),\"2 (qoniqarsiz)\",IF(AND(F13=1),\"kelmagan\",IF(AND(F13=\"\"),\"\",))))))","v":""}]
[3,"Abdurashidova Elnora Yoʻlchi qizi",null,"",null,null,"",""]
[4,"Abdusattorov Baxtiyor Ibragim oʻgʻli",null,"",null,null,"",""]
[5,"Avazov Mirzohid Akmal oʻgʻli",null,"",null,null,"",""]
[6,"Adinaev Javohirbek Bahodir oʻgʻli",null,"",null,null,"",""]
[7,"Allamurodov Bexruz Allamurod oʻgʻli",null,"",null,null,"",""]
[8,"Axmedov Alisher Oʻktamboevich",null,"",null,null,"",""]
[9,"Jamolov Bejan Xurshidovich",null,"",null,null,"",""]
[10,"Jumaeva Nigina Baxtiyor qizi",null,"",null,null,"",""]
[11,"Joʻraev Farrux Sobirovich",null,"",null,null,"",""]
[12,"Joʻraqulov Tolibjon Oʻktamovich",null,"",null,null,"",""]
[13,"Ibragimov Abbos Avaz oʻgʻli",null,"",null,null,"",""]
[14,"Karajanov Nurmuxammed Abdireiimovich",null,"",null,null,"",""]
[15,"Karimov Bozor Abdugʻapparovich",null,"",null,null,"",""]
[16,"Karimova Maftuna Komiljon qizi",null,"",null,null,"",""]
[17,"Qodirov Jahongir Turgʻun oʻgʻli",null,"",null,null,"",""]
[18,"Qurbonov Azizbek Yoʻldosh oʻgʻli",null,"",null,null,"",""]
[19,"Qurbonov Shahriyor Uralovich",null,"",null,null,"",""]
[20,"Mamatqulova Muyassarxon Ashurmuhammadovna",null,"",null,null,"",""]
[21,"Mamatqulova Sevara Faxriddin qizi",null,"",null,null,"",""]
[22,"Mardonov Sirojiddin Abdivoxidovich",null,"",null,null,"",""]
[23,"Mengliev Bekzod Hasan oʻgʻli",null,"",null,null,"",""]
[24,"Muxamadiev Raximjon Farxodjon oʻgʻli",null,"",null,null,"",""]
[25,"Normurodov Maxsudbek Yunusovich",null,"",null,null,"",""]
[26,"Nurova Farogʻat Salohiddin qizi",null,"",null,null,"",""]
[27,"Pardaev Shuhratjon Jahongirovich",null,"",null,null,"",""]
[28,"Ravshanova Munisa Hasan qizi",null,"",null,null,"",""]
[29,"Raximov Asliddin Raxmiddin oʻgʻli",null,"",null,null,"",""]
[30,"Roʻziboev Elbek Abdufattoh oʻgʻli",null,{"$f":"H41","v":""},null,null,"",""]
["JN va ON oʻtkazgan professor-oʻqituvchi imzosi"]
["Jami talabalar soni:",null,{"$f":"COUNTIF(B11:B41,\"?*\")-1","v":30},"5 (aʻlo)",{"$f":"COUNTIF(D11:D41,\"5*\")","v":0}]
[null,null," ","4 (yaxshi)",{"$f":"COUNTIF(D11:D41,\"4*\")","v":0}]
[null,null,null,"3 (qoniqarli)",{"$f":"COUNTIF(D11:D41,\"3*\")","v":0}]
[null,null,null,"oʻzlashtira olmagan",{"$f":"COUNTIF(D11:D41,\"2*\")","v":0}]
[null,null,null,"kelmagan",{"$f":"COUNTIF(D11:D41,\"k*\")","v":0}]
[null,"Fakultet dekani ____________ A.Absamatov",null,"Kafedra mudiri:__________________"]
[null,"        M.Oʻ.            Imzo                    F.I.SH.",null,"         Imzo                    F.I.SH."]
[null,null,null,null,"8a-shakl"]
[{"$f":"A2","v":"OʻZBEKISTON RESPUBLIKASI OLIY TAʻLIM, FAN VA INNOVATSIYALAR VAZIRLIGI"}]
["TERMIZ DAVLAT UNIVERSITETI"]
["BAHOLASH QAYDNOMASI №___"]
["IQTISODIYOT VA TURIZM FAKULTETI IQTISODIYOT TAʻLIM YOʻNALISHI 1-KURS 1-SEMESTR 101-GURUH"]
["Pul va banklar"]
["Maʻruza oʻqituvchisi: ",null,null,{"$f":"+D7","v":"Amaliyot oʻqituvchisi: "}]
["YaN oʻtkazuvchi komissiya: "]
[{"$f":"A9","v":"Semestrda fanga ajratilgan umumiy soatlar:"},null,null,{"$f":"+D9","v":"YaN oʻtkazilgan sana: "}]
[]
[{"$f":"A11","v":"№"},{"$f":"B11","v":"Talabaning familiyasi, ismi, sharifi"},{"$f":"C11","v":"Reyting daftarchasining raqami"},{"$f":"D11","v":"YaN"},{"$f":"E11","v":"YaN oʻtkazuvchining imzosi"},"YaN"]
[{"$f":"SUBTOTAL(103,B61)*(B61<>\"\")*(MAX(A$60:A60)+1)","v":1},{"$f":"IF(D12<=\"2 (qoniqarsiz)\",B12,IF(D12=\"kelmagan\",B12,\"\"))","v":"Abdullaeva Dilfuza Bahodir qizi"},{"$f":"C12","v":0},{"$f":"H61","v":""},null,null,{"$f":"IF(D61=\"5 (a'lo)\",5,IF(AND(D61=\"4 (yaxshi)\"),4,IF(AND(D61=\"3 (qoniqarli)\"),3,IF(AND(D61=\"2 (qoniqarsiz)\"),2,IF(AND(D61=\"kelmagan\"),1,IF(AND(D61=\"\"), \"\",))))))","v":""},{"$f":"IF(F61=5,\"5 (a'lo)\",IF(AND(F61=4),\"4 (yaxshi)\",IF(AND(F61=3),\"3 (qoniqarli)\",IF(AND(F61=2),\"2 (qoniqarsiz)\",IF(AND(F61=1),\"kelmagan\",IF(AND(F61=\"\"),\"\",))))))","v":""}]
[{"$f":"SUBTOTAL(103,B62)*(B62<>\"\")*(MAX(A$60:A61)+1)","v":2},"Abduraimov Asilbek Eralievich",0,"",null,null,{"$f":"IF(D62=\"5 (a'lo)\",5,IF(AND(D62=\"4 (yaxshi)\"),4,IF(AND(D62=\"3 (qoniqarli)\"),3,IF(AND(D62=\"2 (qoniqarsiz)\"),2,IF(AND(D62=\"kelmagan\"),1,IF(AND(D62=\"\"), \"\",))))))","v":""},{"$f":"IF(F62=5,\"5 (a'lo)\",IF(AND(F62=4),\"4 (yaxshi)\",IF(AND(F62=3),\"3 (qoniqarli)\",IF(AND(F62=2),\"2 (qoniqarsiz)\",IF(AND(F62=1),\"kelmagan\",IF(AND(F62=\"\"),\"\",))))))","v":""}]
[{"$f":"SUBTOTAL(103,B63)*(B63<>\"\")*(MAX(A$60:A62)+1)","v":3},"Abdurashidova Elnora Yoʻlchi qizi",0,"",null,null,"",""]
[{"$f":"SUBTOTAL(103,B64)*(B64<>\"\")*(MAX(A$60:A63)+1)","v":4},"Abdusattorov Baxtiyor Ibragim oʻgʻli",0,"",null,null,"",""]
[{"$f":"SUBTOTAL(103,B65)*(B65<>\"\")*(MAX(A$60:A64)+1)","v":5},"Avazov Mirzohid Akmal oʻgʻli",0,"",null,null,"",""]
[{"$f":"SUBTOTAL(103,B66)*(B66<>\"\")*(MAX(A$60:A65)+1)","v":6},"Adinaev Javohirbek Bahodir oʻgʻli",0,"",null,null,"",""]
[{"$f":"SUBTOTAL(103,B67)*(B67<>\"\")*(MAX(A$60:A66)+1)","v":7},"Allamurodov Bexruz Allamurod oʻgʻli",0,"",null,null,"",""]
[{"$f":"SUBTOTAL(103,B68)*(B68<>\"\")*(MAX(A$60:A67)+1)","v":8},"Axmedov Alisher Oʻktamboevich",0,"",null,null,"",""]
[{"$f":"SUBTOTAL(103,B69)*(B69<>\"\")*(MAX(A$60:A68)+1)","v":9},"Jamolov Bejan Xurshidovich",0,"",null,null,"",""]
[{"$f":"SUBTOTAL(103,B70)*(B70<>\"\")*(MAX(A$60:A69)+1)","v":10},"Jumaeva Nigina Baxtiyor qizi",0,"",null,null,"",""]
[{"$f":"SUBTOTAL(103,B71)*(B71<>\"\")*(MAX(A$60:A70)+1)","v":11},"Joʻraev Farrux Sobirovich",0,"",null,null,"",""]
[{"$f":"SUBTOTAL(103,B72)*(B72<>\"\")*(MAX(A$60:A71)+1)","v":12},"Joʻraqulov Tolibjon Oʻktamovich",0,"",null,null,"",""]
[{"$f":"SUBTOTAL(103,B73)*(B73<>\"\")*(MAX(A$60:A72)+1)","v":13},"Ibragimov Abbos Avaz oʻgʻli",0,"",null,null,"",""]
[{"$f":"SUBTOTAL(103,B74)*(B74<>\"\")*(MAX(A$60:A73)+1)","v":14},"Karajanov Nurmuxammed Abdireiimovich",0,"",null,null,"",""]
[{"$f":"SUBTOTAL(103,B75)*(B75<>\"\")*(MAX(A$60:A74)+1)","v":15},"Karimov Bozor Abdugʻapparovich",0,"",null,null,"",""]
[{"$f":"SUBTOTAL(103,B76)*(B76<>\"\")*(MAX(A$60:A75)+1)","v":16},"Karimova Maftuna Komiljon qizi",0,"",null,null,"",""]
[{"$f":"SUBTOTAL(103,B77)*(B77<>\"\")*(MAX(A$60:A76)+1)","v":17},"Qodirov Jahongir Turgʻun oʻgʻli",0,"",null,null,"",""]
[{"$f":"SUBTOTAL(103,B78)*(B78<>\"\")*(MAX(A$60:A77)+1)","v":18},"Qurbonov Azizbek Yoʻldosh oʻgʻli",0,"",null,null,"",""]
[{"$f":"SUBTOTAL(103,B79)*(B79<>\"\")*(MAX(A$60:A78)+1)","v":19},"Qurbonov Shahriyor Uralovich",0,"",null,null,"",""]
[{"$f":"SUBTOTAL(103,B80)*(B80<>\"\")*(MAX(A$60:A79)+1)","v":20},"Mamatqulova Muyassarxon Ashurmuhammadovna",0,"",null,null,"",""]
[{"$f":"SUBTOTAL(103,B81)*(B81<>\"\")*(MAX(A$60:A80)+1)","v":21},"Mamatqulova Sevara Faxriddin qizi",0,"",null,null,"",""]
[{"$f":"SUBTOTAL(103,B82)*(B82<>\"\")*(MAX(A$60:A81)+1)","v":22},"Mardonov Sirojiddin Abdivoxidovich",0,"",null,null,"",""]
[{"$f":"SUBTOTAL(103,B83)*(B83<>\"\")*(MAX(A$60:A82)+1)","v":23},"Mengliev Bekzod Hasan oʻgʻli",0,"",null,null,"",""]
[{"$f":"SUBTOTAL(103,B84)*(B84<>\"\")*(MAX(A$60:A83)+1)","v":24},"Muxamadiev Raximjon Farxodjon oʻgʻli",0,"",null,null,"",""]
[{"$f":"SUBTOTAL(103,B85)*(B85<>\"\")*(MAX(A$60:A84)+1)","v":25},"Normurodov Maxsudbek Yunusovich",0,"",null,null,"",""]
[{"$f":"SUBTOTAL(103,B86)*(B86<>\"\")*(MAX(A$60:A85)+1)","v":26},"Nurova Farogʻat Salohiddin qizi",0,"",null,null,"",""]
[{"$f":"SUBTOTAL(103,B87)*(B87<>\"\")*(MAX(A$60:A86)+1)","v":27},"Pardaev Shuhratjon Jahongirovich",0,"",null,null,"",""]
[{"$f":"SUBTOTAL(103,B88)*(B88<>\"\")*(MAX(A$60:A87)+1)","v":28},"Ravshanova Munisa Hasan qizi",0,"",null,null,"",""]
[{"$f":"SUBTOTAL(103,B89)*(B89<>\"\")*(MAX(A$60:A88)+1)","v":29},"Raximov Asliddin Raxmiddin oʻgʻli",0,"",null,null,"",""]
[{"$f":"SUBTOTAL(103,B90)*(B90<>\"\")*(MAX(A$60:A89)+1)","v":30},"Roʻziboev Elbek Abdufattoh oʻgʻli",0,"",null,null,"",""]
[{"$f":"A42","v":"JN va ON oʻtkazgan professor-oʻqituvchi imzosi"}]
["Jami talabalar soni:",null,{"$f":"COUNTIF(B60:B90,\"?*\")-1","v":30},"5 (aʻlo)",{"$f":"COUNTIF(D60:D90,\"5*\")","v":0}]
[null,null," ","4 (yaxshi)",{"$f":"COUNTIF(D60:D90,\"4*\")","v":0}]
[null,null,null,"3 (qoniqarli)",{"$f":"COUNTIF(D60:D90,\"3*\")","v":0}]
[null,null,null,"oʻzlashtira olmagan",{"$f":"COUNTIF(D60:D90,\"2*\")","v":0}]
[null,null,null,"kelmagan",{"$f":"COUNTIF(D60:D90,\"k*\")","v":0}]
[null,{"$f":"B48","v":"Fakultet dekani ____________ A.Absamatov"},null,{"$f":"D48","v":"Kafedra mudiri:__________________"}]
[null,{"$f":"B49","v":"        M.Oʻ.            Imzo                    F.I.SH."},null,{"$f":"D49","v":"         Imzo                    F.I.SH."}]
[null,null,null,null,"8b-shakl"]
[{"$f":"A51","v":"OʻZBEKISTON RESPUBLIKASI OLIY TAʻLIM, FAN VA INNOVATSIYALAR VAZIRLIGI"}]
[{"$f":"A52","v":"TERMIZ DAVLAT UNIVERSITETI"}]
[{"$f":"A4","v":"BAHOLASH QAYDNOMASI №___"}]
[{"$f":"A54","v":"IQTISODIYOT VA TURIZM FAKULTETI IQTISODIYOT TAʻLIM YOʻNALISHI 1-KURS 1-SEMESTR 101-GURUH"}]
[{"$f":"A55","v":"Pul va banklar"}]
[{"$f":"A7","v":"Maʻruza oʻqituvchisi: "},null,null,{"$f":"+D7","v":"Amaliyot oʻqituvchisi: "}]
["YaN oʻtkazuvchi komissiya: "]
[{"$f":"A58","v":"Semestrda fanga ajratilgan umumiy soatlar:"},null,null,{"$f":"+D9","v":"YaN oʻtkazilgan sana: "}]
[]
[{"$f":"A60","v":"№"},{"$f":"B60","v":"Talabaning familiyasi, ismi, sharifi"},{"$f":"C60","v":"Reyting daftarchasining raqami"},{"$f":"D60","v":"YaN"},{"$f":"E60","v":"YaN oʻtkazuvchining imzosi"},"YaN"]
[{"$f":"SUBTOTAL(103,B110)*(B110<>\"\")*(MAX(A$109:A109)+1)","v":1},{"$f":"IF(D61<=\"2 (qoniqarsiz)\",B61,IF(D61=\"kelmagan\",B61,\"\"))","v":"Abdullaeva Dilfuza Bahodir qizi"},{"$f":"C12","v":0},{"$f":"H110","v":""},null,null,{"$f":"IF(D110=\"5 (a'lo)\",5,IF(AND(D110=\"4 (yaxshi)\"),4,IF(AND(D110=\"3 (qoniqarli)\"),3,IF(AND(D110=\"2 (qoniqarsiz)\"),2,IF(AND(D110=\"kelmagan\"),1,IF(AND(D110=\"\"), \"\",))))))","v":""},{"$f":"IF(F110=5,\"5 (a'lo)\",IF(AND(F110=4),\"4 (yaxshi)\",IF(AND(F110=3),\"3 (qoniqarli)\",IF(AND(F110=2),\"2 (qoniqarsiz)\",IF(AND(F110=1),\"kelmagan\",IF(AND(F110=\"\"),\"\",))))))","v":""}]
[{"$f":"SUBTOTAL(103,B111)*(B111<>\"\")*(MAX(A$109:A110)+1)","v":2},"Abduraimov Asilbek Eralievich",0,{"$f":"H111","v":""},null,null,{"$f":"IF(D111=\"5 (a'lo)\",5,IF(AND(D111=\"4 (yaxshi)\"),4,IF(AND(D111=\"3 (qoniqarli)\"),3,IF(AND(D111=\"2 (qoniqarsiz)\"),2,IF(AND(D111=\"kelmagan\"),1,IF(AND(D111=\"\"), \"\",))))))","v":""},{"$f":"IF(F111=5,\"5 (a'lo)\",IF(AND(F111=4),\"4 (yaxshi)\",IF(AND(F111=3),\"3 (qoniqarli)\",IF(AND(F111=2),\"2 (qoniqarsiz)\",IF(AND(F111=1),\"kelmagan\",IF(AND(F111=\"\"),\"\",))))))","v":""}]
[{"$f":"SUBTOTAL(103,B112)*(B112<>\"\")*(MAX(A$109:A111)+1)","v":3},"Abdurashidova Elnora Yoʻlchi qizi",0,"",null,null,"",""]
[{"$f":"SUBTOTAL(103,B113)*(B113<>\"\")*(MAX(A$109:A112)+1)","v":4},"Abdusattorov Baxtiyor Ibragim oʻgʻli",0,"",null,null,"",""]
[{"$f":"SUBTOTAL(103,B114)*(B114<>\"\")*(MAX(A$109:A113)+1)","v":5},"Avazov Mirzohid Akmal oʻgʻli",0,"",null,null,"",""]
[{"$f":"SUBTOTAL(103,B115)*(B115<>\"\")*(MAX(A$109:A114)+1)","v":6},"Adinaev Javohirbek Bahodir oʻgʻli",0,"",null,null,"",""]
[{"$f":"SUBTOTAL(103,B116)*(B116<>\"\")*(MAX(A$109:A115)+1)","v":7},"Allamurodov Bexruz Allamurod oʻgʻli",0,"",null,null,"",""]
[{"$f":"SUBTOTAL(103,B117)*(B117<>\"\")*(MAX(A$109:A116)+1)","v":8},"Axmedov Alisher Oʻktamboevich",0,"",null,null,"",""]
[{"$f":"SUBTOTAL(103,B118)*(B118<>\"\")*(MAX(A$109:A117)+1)","v":9},"Jamolov Bejan Xurshidovich",0,"",null,null,"",""]
[{"$f":"SUBTOTAL(103,B119)*(B119<>\"\")*(MAX(A$109:A118)+1)","v":10},"Jumaeva Nigina Baxtiyor qizi",0,"",null,null,"",""]
[{"$f":"SUBTOTAL(103,B120)*(B120<>\"\")*(MAX(A$109:A119)+1)","v":11},"Joʻraev Farrux Sobirovich",0,"",null,null,"",""]
[{"$f":"SUBTOTAL(103,B121)*(B121<>\"\")*(MAX(A$109:A120)+1)","v":12},"Joʻraqulov Tolibjon Oʻktamovich",0,"",null,null,"",""]
[{"$f":"SUBTOTAL(103,B122)*(B122<>\"\")*(MAX(A$109:A121)+1)","v":13},"Ibragimov Abbos Avaz oʻgʻli",0,"",null,null,"",""]
[{"$f":"SUBTOTAL(103,B123)*(B123<>\"\")*(MAX(A$109:A122)+1)","v":14},"Karajanov Nurmuxammed Abdireiimovich",0,"",null,null,"",""]
[{"$f":"SUBTOTAL(103,B124)*(B124<>\"\")*(MAX(A$109:A123)+1)","v":15},"Karimov Bozor Abdugʻapparovich",0,"",null,null,"",""]
[{"$f":"SUBTOTAL(103,B125)*(B125<>\"\")*(MAX(A$109:A124)+1)","v":16},"Karimova Maftuna Komiljon qizi",0,"",null,null,"",""]
[{"$f":"SUBTOTAL(103,B126)*(B126<>\"\")*(MAX(A$109:A125)+1)","v":17},"Qodirov Jahongir Turgʻun oʻgʻli",0,"",null,null,"",""]
[{"$f":"SUBTOTAL(103,B127)*(B127<>\"\")*(MAX(A$109:A126)+1)","v":18},"Qurbonov Azizbek Yoʻldosh oʻgʻli",0,"",null,null,"",""]
[{"$f":"SUBTOTAL(103,B128)*(B128<>\"\")*(MAX(A$109:A127)+1)","v":19},"Qurbonov Shahriyor Uralovich",0,"",null,null,"",""]
[{"$f":"SUBTOTAL(103,B129)*(B129<>\"\")*(MAX(A$109:A128)+1)","v":20},"Mamatqulova Muyassarxon Ashurmuhammadovna",0,"",null,null,"",""]
[{"$f":"SUBTOTAL(103,B130)*(B130<>\"\")*(MAX(A$109:A129)+1)","v":21},"Mamatqulova Sevara Faxriddin qizi",0,"",null,null,"",""]
[{"$f":"SUBTOTAL(103,B131)*(B131<>\"\")*(MAX(A$109:A130)+1)","v":22},"Mardonov Sirojiddin Abdivoxidovich",0,"",null,null,"",""]
[{"$f":"SUBTOTAL(103,B132)*(B132<>\"\")*(MAX(A$109:A131)+1)","v":23},"Mengliev Bekzod Hasan oʻgʻli",0,"",null,null,"",""]
[{"$f":"SUBTOTAL(103,B133)*(B133<>\"\")*(MAX(A$109:A132)+1)","v":24},"Muxamadiev Raximjon Farxodjon oʻgʻli",0,"",null,null,"",""]
[{"$f":"SUBTOTAL(103,B134)*(B134<>\"\")*(MAX(A$109:A133)+1)","v":25},"Normurodov Maxsudbek Yunusovich",0,"",null,null,"",""]
[{"$f":"SUBTOTAL(103,B135)*(B135<>\"\")*(MAX(A$109:A134)+1)","v":26},"Nurova Farogʻat Salohiddin qizi",0,"",null,null,"",""]
[{"$f":"SUBTOTAL(103,B136)*(B136<>\"\")*(MAX(A$109:A135)+1)","v":27},"Pardaev Shuhratjon Jahongirovich",0,"",null,null,"",""]
[{"$f":"SUBTOTAL(103,B137)*(B137<>\"\")*(MAX(A$109:A136)+1)","v":28},"Ravshanova Munisa Hasan qizi",0,"",null,null,"",""]
[{"$f":"SUBTOTAL(103,B138)*(B138<>\"\")*(MAX(A$109:A137)+1)","v":29},"Raximov Asliddin Raxmiddin oʻgʻli",0,"",null,null,"",""]
[{"$f":"SUBTOTAL(103,B139)*(B139<>\"\")*(MAX(A$109:A138)+1)","v":30},"Roʻziboev Elbek Abdufattoh oʻgʻli",0,"",null,null,"",""]
[{"$f":"A42","v":"JN va ON oʻtkazgan professor-oʻqituvchi imzosi"}]
[null,"Jami talabalar soni:",{"$f":"COUNTIF(B109:B139,\"?*\")-1","v":30},"5 (aʻlo)",{"$f":"COUNTIF(D109:D139,\"5*\")","v":0}]
[null,null," ","4 (yaxshi)",{"$f":"COUNTIF(D109:D139,\"4*\")","v":0}]
[null,null,null,"3 (qoniqarli)",{"$f":"COUNTIF(D109:D139,\"3*\")","v":0}]
[null,null,null,"oʻzlashtira olmagan",{"$f":"COUNTIF(D109:D139,\"2*\")","v":0}]
[null,null,null,"kelmagan",{"$f":"COUNTIF(D109:D139,\"k*\")","v":0}]
[]
[null,{"$f":"B48","v":"Fakultet dekani ____________ A.Absamatov"},null,{"$f":"D48","v":"Kafedra mudiri:__________________"}]
[null,{"$f":"B49","v":"        M.Oʻ.            Imzo                    F.I.SH."},null,{"$f":"D49","v":"         Imzo                    F.I.SH."}]

{"sheet":"Moliyaviy boshqaruv","index":5,"n_rows":148,"n_cols":8,"rows_kept":148,"cut":false,"hidden":false,"merged":[[1,0,1,4],[2,0,2,4],[3,0,3,4],[4,0,4,4],[5,0,5,4],[6,0,6,1],[7,0,7,4],[8,0,8,1],[41,0,41,2],[42,0,42,1],[48,1,48,2],[48,3,48,4],[50,0,50,4],[50,10,51,10],[51,0,51,4],[52,0,52,4],[52,10,53,10],[53,0,53,4],[54,0,54,4],[54,10,55,10],[55,0,55,2],[55,3,55,4],[56,0,56,4],[57,0,57,1],[57,3,57,4],[90,0,90,2],[91,0,91,1],[97,1,97,2],[97,3,97,4],[99,0,99,4],[100,0,100,4],[101,0,101,4],[102,0,102,4],[103,0,103,4],[104,0,104,2],[104,3,104,4],[105,0,105,4],[149,1,149,2],[149,3,149,4],[106,0,106,1],[106,3,106,4],[139,0,139,2],[147,1,147,2],[147,3,147,4],[148,3,148,4]]}
[null,null,null,null,"8-shakl"]
["OʻZBEKISTON RESPUBLIKASI OLIY TAʻLIM, FAN VA INNOVATSIYALAR VAZIRLIGI"]
["TERMIZ DAVLAT UNIVERSITETI"]
["BAHOLASH QAYDNOMASI №___"]
["IQTISODIYOT VA TURIZM FAKULTETI IQTISODIYOT TAʻLIM YOʻNALISHI 1-KURS 1-SEMESTR 101-GURUH"]
["Moliyaviy boshqaruv"]
["Maʻruza oʻqituvchisi: ",null,null,"Amaliyot oʻqituvchisi: "]
["YaN oʻtkazuvchi komissiya: "]
["Semestrda fanga ajratilgan umumiy soatlar:",null,null,"YaN oʻtkazilgan sana: "]
[]
["№","Talabaning familiyasi, ismi, sharifi","Reyting daftarchasining raqami","YaN","YaN oʻtkazuvchining imzosi","YaN"]
[1,"Abdullaeva Dilfuza Bahodir qizi",null,{"$f":"H12","v":""},null,null,{"$f":"IF(D12=\"5 (a'lo)\",5,IF(AND(D12=\"4 (yaxshi)\"),4,IF(AND(D12=\"3 (qoniqarli)\"),3,IF(AND(D12=\"2 (qoniqarsiz)\"),2,IF(AND(D12=\"kelmagan\"),1,IF(AND(D12=\"\"), \"\",))))))","v":""},{"$f":"IF(F12=5,\"5 (a'lo)\",IF(AND(F12=4),\"4 (yaxshi)\",IF(AND(F12=3),\"3 (qoniqarli)\",IF(AND(F12=2),\"2 (qoniqarsiz)\",IF(AND(F12=1),\"kelmagan\",IF(AND(F12=\"\"),\"\",))))))","v":""}]
[2,"Abduraimov Asilbek Eralievich",null,{"$f":"H13","v":""},null,null,{"$f":"IF(D13=\"5 (a'lo)\",5,IF(AND(D13=\"4 (yaxshi)\"),4,IF(AND(D13=\"3 (qoniqarli)\"),3,IF(AND(D13=\"2 (qoniqarsiz)\"),2,IF(AND(D13=\"kelmagan\"),1,IF(AND(D13=\"\"), \"\",))))))","v":""},{"$f":"IF(F13=5,\"5 (a'lo)\",IF(AND(F13=4),\"4 (yaxshi)\",IF(AND(F13=3),\"3 (qoniqarli)\",IF(AND(F13=2),\"2 (qoniqarsiz)\",IF(AND(F13=1),\"kelmagan\",IF(AND(F13=\"\"),\"\",))))))","v":""}]
[3,"Abdurashidova Elnora Yoʻlchi qizi",null,"",null,null,"",""]
[4,"Abdusattorov Baxtiyor Ibragim oʻgʻli",null,"",null,null,"",""]
[5,"Avazov Mirzohid Akmal oʻgʻli",null,"",null,null,"",""]
[6,"Adinaev Javohirbek Bahodir oʻgʻli",null,"",null,null,"",""]
[7,"Allamurodov Bexruz Allamurod oʻgʻli",null,"",null,null,"",""]
[8,"Axmedov Alisher Oʻktamboevich",null,"",null,null,"",""]
[9,"Jamolov Bejan Xurshidovich",null,"",null,null,"",""]
[10,"Jumaeva Nigina Baxtiyor qizi",null,"",null,null,"",""]
[11,"Joʻraev Farrux Sobirovich",null,"",null,null,"",""]
[12,"Joʻraqulov Tolibjon Oʻktamovich",null,"",null,null,"",""]
[13,"Ibragimov Abbos Avaz oʻgʻli",null,"",null,null,"",""]
[14,"Karajanov Nurmuxammed Abdireiimovich",null,"",null,null,"",""]
[15,"Karimov Bozor Abdugʻapparovich",null,"",null,null,"",""]
[16,"Karimova Maftuna Komiljon qizi",null,"",null,null,"",""]
[17,"Qodirov Jahongir Turgʻun oʻgʻli",null,"",null,null,"",""]
[18,"Qurbonov Azizbek Yoʻldosh oʻgʻli",null,"",null,null,"",""]
[19,"Qurbonov Shahriyor Uralovich",null,"",null,null,"",""]
[20,"Mamatqulova Muyassarxon Ashurmuhammadovna",null,"",null,null,"",""]
[21,"Mamatqulova Sevara Faxriddin qizi",null,"",null,null,"",""]
[22,"Mardonov Sirojiddin Abdivoxidovich",null,"",null,null,"",""]
[23,"Mengliev Bekzod Hasan oʻgʻli",null,"",null,null,"",""]
[24,"Muxamadiev Raximjon Farxodjon oʻgʻli",null,"",null,null,"",""]
[25,"Normurodov Maxsudbek Yunusovich",null,"",null,null,"",""]
[26,"Nurova Farogʻat Salohiddin qizi",null,"",null,null,"",""]
[27,"Pardaev Shuhratjon Jahongirovich",null,"",null,null,"",""]
[28,"Ravshanova Munisa Hasan qizi",null,"",null,null,"",""]
[29,"Raximov Asliddin Raxmiddin oʻgʻli",null,"",null,null,"",""]
[30,"Roʻziboev Elbek Abdufattoh oʻgʻli",null,{"$f":"H41","v":""},null,null,"",""]
["JN va ON oʻtkazgan professor-oʻqituvchi imzosi"]
["Jami talabalar soni:",null,{"$f":"COUNTIF(B11:B41,\"?*\")-1","v":30},"5 (aʻlo)",{"$f":"COUNTIF(D11:D41,\"5*\")","v":0}]
[null,null," ","4 (yaxshi)",{"$f":"COUNTIF(D11:D41,\"4*\")","v":0}]
[null,null,null,"3 (qoniqarli)",{"$f":"COUNTIF(D11:D41,\"3*\")","v":0}]
[null,null,null,"oʻzlashtira olmagan",{"$f":"COUNTIF(D11:D41,\"2*\")","v":0}]
[null,null,null,"kelmagan",{"$f":"COUNTIF(D11:D41,\"k*\")","v":0}]
[null,"Fakultet dekani ____________ A.Absamatov",null,"Kafedra mudiri:__________________"]
[null,"        M.Oʻ.            Imzo                    F.I.SH.",null,"         Imzo                    F.I.SH."]
[null,null,null,null,"8a-shakl"]
[{"$f":"A2","v":"OʻZBEKISTON RESPUBLIKASI OLIY TAʻLIM, FAN VA INNOVATSIYALAR VAZIRLIGI"}]
["TERMIZ DAVLAT UNIVERSITETI"]
["BAHOLASH QAYDNOMASI №___"]
["IQTISODIYOT VA TURIZM FAKULTETI IQTISODIYOT TAʻLIM YOʻNALISHI 1-KURS 1-SEMESTR 101-GURUH"]
["Moliyaviy boshqaruv"]
["Maʻruza oʻqituvchisi: ",null,null,{"$f":"+D7","v":"Amaliyot oʻqituvchisi: "}]
["YaN oʻtkazuvchi komissiya: "]
[{"$f":"A9","v":"Semestrda fanga ajratilgan umumiy soatlar:"},null,null,{"$f":"+D9","v":"YaN oʻtkazilgan sana: "}]
[]
[{"$f":"A11","v":"№"},{"$f":"B11","v":"Talabaning familiyasi, ismi, sharifi"},{"$f":"C11","v":"Reyting daftarchasining raqami"},{"$f":"D11","v":"YaN"},{"$f":"E11","v":"YaN oʻtkazuvchining imzosi"},"YaN"]
[{"$f":"SUBTOTAL(103,B61)*(B61<>\"\")*(MAX(A$60:A60)+1)","v":1},{"$f":"IF(D12<=\"2 (qoniqarsiz)\",B12,IF(D12=\"kelmagan\",B12,\"\"))","v":"Abdullaeva Dilfuza Bahodir qizi"},{"$f":"C12","v":0},{"$f":"H61","v":""},null,null,{"$f":"IF(D61=\"5 (a'lo)\",5,IF(AND(D61=\"4 (yaxshi)\"),4,IF(AND(D61=\"3 (qoniqarli)\"),3,IF(AND(D61=\"2 (qoniqarsiz)\"),2,IF(AND(D61=\"kelmagan\"),1,IF(AND(D61=\"\"), \"\",))))))","v":""},{"$f":"IF(F61=5,\"5 (a'lo)\",IF(AND(F61=4),\"4 (yaxshi)\",IF(AND(F61=3),\"3 (qoniqarli)\",IF(AND(F61=2),\"2 (qoniqarsiz)\",IF(AND(F61=1),\"kelmagan\",IF(AND(F61=\"\"),\"\",))))))","v":""}]
[{"$f":"SUBTOTAL(103,B62)*(B62<>\"\")*(MAX(A$60:A61)+1)","v":2},"Abduraimov Asilbek Eralievich",0,"",null,null,{"$f":"IF(D62=\"5 (a'lo)\",5,IF(AND(D62=\"4 (yaxshi)\"),4,IF(AND(D62=\"3 (qoniqarli)\"),3,IF(AND(D62=\"2 (qoniqarsiz)\"),2,IF(AND(D62=\"kelmagan\"),1,IF(AND(D62=\"\"), \"\",))))))","v":""},{"$f":"IF(F62=5,\"5 (a'lo)\",IF(AND(F62=4),\"4 (yaxshi)\",IF(AND(F62=3),\"3 (qoniqarli)\",IF(AND(F62=2),\"2 (qoniqarsiz)\",IF(AND(F62=1),\"kelmagan\",IF(AND(F62=\"\"),\"\",))))))","v":""}]
[{"$f":"SUBTOTAL(103,B63)*(B63<>\"\")*(MAX(A$60:A62)+1)","v":3},"Abdurashidova Elnora Yoʻlchi qizi",0,"",null,null,"",""]
[{"$f":"SUBTOTAL(103,B64)*(B64<>\"\")*(MAX(A$60:A63)+1)","v":4},"Abdusattorov Baxtiyor Ibragim oʻgʻli",0,"",null,null,"",""]
[{"$f":"SUBTOTAL(103,B65)*(B65<>\"\")*(MAX(A$60:A64)+1)","v":5},"Avazov Mirzohid Akmal oʻgʻli",0,"",null,null,"",""]
[{"$f":"SUBTOTAL(103,B66)*(B66<>\"\")*(MAX(A$60:A65)+1)","v":6},"Adinaev Javohirbek Bahodir oʻgʻli",0,"",null,null,"",""]
[{"$f":"SUBTOTAL(103,B67)*(B67<>\"\")*(MAX(A$60:A66)+1)","v":7},"Allamurodov Bexruz Allamurod oʻgʻli",0,"",null,null,"",""]
[{"$f":"SUBTOTAL(103,B68)*(B68<>\"\")*(MAX(A$60:A67)+1)","v":8},"Axmedov Alisher Oʻktamboevich",0,"",null,null,"",""]
[{"$f":"SUBTOTAL(103,B69)*(B69<>\"\")*(MAX(A$60:A68)+1)","v":9},"Jamolov Bejan Xurshidovich",0,"",null,null,"",""]
[{"$f":"SUBTOTAL(103,B70)*(B70<>\"\")*(MAX(A$60:A69)+1)","v":10},"Jumaeva Nigina Baxtiyor qizi",0,"",null,null,"",""]
[{"$f":"SUBTOTAL(103,B71)*(B71<>\"\")*(MAX(A$60:A70)+1)","v":11},"Joʻraev Farrux Sobirovich",0,"",null,null,"",""]
[{"$f":"SUBTOTAL(103,B72)*(B72<>\"\")*(MAX(A$60:A71)+1)","v":12},"Joʻraqulov Tolibjon Oʻktamovich",0,"",null,null,"",""]
[{"$f":"SUBTOTAL(103,B73)*(B73<>\"\")*(MAX(A$60:A72)+1)","v":13},"Ibragimov Abbos Avaz oʻgʻli",0,"",null,null,"",""]
[{"$f":"SUBTOTAL(103,B74)*(B74<>\"\")*(MAX(A$60:A73)+1)","v":14},"Karajanov Nurmuxammed Abdireiimovich",0,"",null,null,"",""]
[{"$f":"SUBTOTAL(103,B75)*(B75<>\"\")*(MAX(A$60:A74)+1)","v":15},"Karimov Bozor Abdugʻapparovich",0,"",null,null,"",""]
[{"$f":"SUBTOTAL(103,B76)*(B76<>\"\")*(MAX(A$60:A75)+1)","v":16},"Karimova Maftuna Komiljon qizi",0,"",null,null,"",""]
[{"$f":"SUBTOTAL(103,B77)*(B77<>\"\")*(MAX(A$60:A76)+1)","v":17},"Qodirov Jahongir Turgʻun oʻgʻli",0,"",null,null,"",""]
[{"$f":"SUBTOTAL(103,B78)*(B78<>\"\")*(MAX(A$60:A77)+1)","v":18},"Qurbonov Azizbek Yoʻldosh oʻgʻli",0,"",null,null,"",""]
[{"$f":"SUBTOTAL(103,B79)*(B79<>\"\")*(MAX(A$60:A78)+1)","v":19},"Qurbonov Shahriyor Uralovich",0,"",null,null,"",""]
[{"$f":"SUBTOTAL(103,B80)*(B80<>\"\")*(MAX(A$60:A79)+1)","v":20},"Mamatqulova Muyassarxon Ashurmuhammadovna",0,"",null,null,"",""]
[{"$f":"SUBTOTAL(103,B81)*(B81<>\"\")*(MAX(A$60:A80)+1)","v":21},"Mamatqulova Sevara Faxriddin qizi",0,"",null,null,"",""]
[{"$f":"SUBTOTAL(103,B82)*(B82<>\"\")*(MAX(A$60:A81)+1)","v":22},"Mardonov Sirojiddin Abdivoxidovich",0,"",null,null,"",""]
[{"$f":"SUBTOTAL(103,B83)*(B83<>\"\")*(MAX(A$60:A82)+1)","v":23},"Mengliev Bekzod Hasan oʻgʻli",0,"",null,null,"",""]
[{"$f":"SUBTOTAL(103,B84)*(B84<>\"\")*(MAX(A$60:A83)+1)","v":24},"Muxamadiev Raximjon Farxodjon oʻgʻli",0,"",null,null,"",""]
[{"$f":"SUBTOTAL(103,B85)*(B85<>\"\")*(MAX(A$60:A84)+1)","v":25},"Normurodov Maxsudbek Yunusovich",0,"",null,null,"",""]
[{"$f":"SUBTOTAL(103,B86)*(B86<>\"\")*(MAX(A$60:A85)+1)","v":26},"Nurova Farogʻat Salohiddin qizi",0,"",null,null,"",""]
[{"$f":"SUBTOTAL(103,B87)*(B87<>\"\")*(MAX(A$60:A86)+1)","v":27},"Pardaev Shuhratjon Jahongirovich",0,"",null,null,"",""]
[{"$f":"SUBTOTAL(103,B88)*(B88<>\"\")*(MAX(A$60:A87)+1)","v":28},"Ravshanova Munisa Hasan qizi",0,"",null,null,"",""]
[{"$f":"SUBTOTAL(103,B89)*(B89<>\"\")*(MAX(A$60:A88)+1)","v":29},"Raximov Asliddin Raxmiddin oʻgʻli",0,"",null,null,"",""]
[{"$f":"SUBTOTAL(103,B90)*(B90<>\"\")*(MAX(A$60:A89)+1)","v":30},"Roʻziboev Elbek Abdufattoh oʻgʻli",0,"",null,null,"",""]
[{"$f":"A42","v":"JN va ON oʻtkazgan professor-oʻqituvchi imzosi"}]
["Jami talabalar soni:",null,{"$f":"COUNTIF(B60:B90,\"?*\")-1","v":30},"5 (aʻlo)",{"$f":"COUNTIF(D60:D90,\"5*\")","v":0}]
[null,null," ","4 (yaxshi)",{"$f":"COUNTIF(D60:D90,\"4*\")","v":0}]
[null,null,null,"3 (qoniqarli)",{"$f":"COUNTIF(D60:D90,\"3*\")","v":0}]
[null,null,null,"oʻzlashtira olmagan",{"$f":"COUNTIF(D60:D90,\"2*\")","v":0}]
[null,null,null,"kelmagan",{"$f":"COUNTIF(D60:D90,\"k*\")","v":0}]
[null,{"$f":"B48","v":"Fakultet dekani ____________ A.Absamatov"},null,{"$f":"D48","v":"Kafedra mudiri:__________________"}]
[null,{"$f":"B49","v":"        M.Oʻ.            Imzo                    F.I.SH."},null,{"$f":"D49","v":"         Imzo                    F.I.SH."}]
[null,null,null,null,"8b-shakl"]
[{"$f":"A51","v":"OʻZBEKISTON RESPUBLIKASI OLIY TAʻLIM, FAN VA INNOVATSIYALAR VAZIRLIGI"}]
[{"$f":"A52","v":"TERMIZ DAVLAT UNIVERSITETI"}]
[{"$f":"A4","v":"BAHOLASH QAYDNOMASI №___"}]
[{"$f":"A54","v":"IQTISODIYOT VA TURIZM FAKULTETI IQTISODIYOT TAʻLIM YOʻNALISHI 1-KURS 1-SEMESTR 101-GURUH"}]
[{"$f":"A55","v":"Moliyaviy boshqaruv"}]
[{"$f":"A7","v":"Maʻruza oʻqituvchisi: "},null,null,{"$f":"+D7","v":"Amaliyot oʻqituvchisi: "}]
["YaN oʻtkazuvchi komissiya: "]
[{"$f":"A58","v":"Semestrda fanga ajratilgan umumiy soatlar:"},null,null,{"$f":"+D9","v":"YaN oʻtkazilgan sana: "}]
[]
[{"$f":"A60","v":"№"},{"$f":"B60","v":"Talabaning familiyasi, ismi, sharifi"},{"$f":"C60","v":"Reyting daftarchasining raqami"},{"$f":"D60","v":"YaN"},{"$f":"E60","v":"YaN oʻtkazuvchining imzosi"},"YaN"]
[{"$f":"SUBTOTAL(103,B110)*(B110<>\"\")*(MAX(A$109:A109)+1)","v":1},{"$f":"IF(D61<=\"2 (qoniqarsiz)\",B61,IF(D61=\"kelmagan\",B61,\"\"))","v":"Abdullaeva Dilfuza Bahodir qizi"},{"$f":"C12","v":0},{"$f":"H110","v":""},null,null,{"$f":"IF(D110=\"5 (a'lo)\",5,IF(AND(D110=\"4 (yaxshi)\"),4,IF(AND(D110=\"3 (qoniqarli)\"),3,IF(AND(D110=\"2 (qoniqarsiz)\"),2,IF(AND(D110=\"kelmagan\"),1,IF(AND(D110=\"\"), \"\",))))))","v":""},{"$f":"IF(F110=5,\"5 (a'lo)\",IF(AND(F110=4),\"4 (yaxshi)\",IF(AND(F110=3),\"3 (qoniqarli)\",IF(AND(F110=2),\"2 (qoniqarsiz)\",IF(AND(F110=1),\"kelmagan\",IF(AND(F110=\"\"),\"\",))))))","v":""}]
[{"$f":"SUBTOTAL(103,B111)*(B111<>\"\")*(MAX(A$109:A110)+1)","v":2},"Abduraimov Asilbek Eralievich",0,{"$f":"H111","v":""},null,null,{"$f":"IF(D111=\"5 (a'lo)\",5,IF(AND(D111=\"4 (yaxshi)\"),4,IF(AND(D111=\"3 (qoniqarli)\"),3,IF(AND(D111=\"2 (qoniqarsiz)\"),2,IF(AND(D111=\"kelmagan\"),1,IF(AND(D111=\"\"), \"\",))))))","v":""},{"$f":"IF(F111=5,\"5 (a'lo)\",IF(AND(F111=4),\"4 (yaxshi)\",IF(AND(F111=3),\"3 (qoniqarli)\",IF(AND(F111=2),\"2 (qoniqarsiz)\",IF(AND(F111=1),\"kelmagan\",IF(AND(F111=\"\"),\"\",))))))","v":""}]
[{"$f":"SUBTOTAL(103,B112)*(B112<>\"\")*(MAX(A$109:A111)+1)","v":3},"Abdurashidova Elnora Yoʻlchi qizi",0,"",null,null,"",""]
[{"$f":"SUBTOTAL(103,B113)*(B113<>\"\")*(MAX(A$109:A112)+1)","v":4},"Abdusattorov Baxtiyor Ibragim oʻgʻli",0,"",null,null,"",""]
[{"$f":"SUBTOTAL(103,B114)*(B114<>\"\")*(MAX(A$109:A113)+1)","v":5},"Avazov Mirzohid Akmal oʻgʻli",0,"",null,null,"",""]
[{"$f":"SUBTOTAL(103,B115)*(B115<>\"\")*(MAX(A$109:A114)+1)","v":6},"Adinaev Javohirbek Bahodir oʻgʻli",0,"",null,null,"",""]
[{"$f":"SUBTOTAL(103,B116)*(B116<>\"\")*(MAX(A$109:A115)+1)","v":7},"Allamurodov Bexruz Allamurod oʻgʻli",0,"",null,null,"",""]
[{"$f":"SUBTOTAL(103,B117)*(B117<>\"\")*(MAX(A$109:A116)+1)","v":8},"Axmedov Alisher Oʻktamboevich",0,"",null,null,"",""]
[{"$f":"SUBTOTAL(103,B118)*(B118<>\"\")*(MAX(A$109:A117)+1)","v":9},"Jamolov Bejan Xurshidovich",0,"",null,null,"",""]
[{"$f":"SUBTOTAL(103,B119)*(B119<>\"\")*(MAX(A$109:A118)+1)","v":10},"Jumaeva Nigina Baxtiyor qizi",0,"",null,null,"",""]
[{"$f":"SUBTOTAL(103,B120)*(B120<>\"\")*(MAX(A$109:A119)+1)","v":11},"Joʻraev Farrux Sobirovich",0,"",null,null,"",""]
[{"$f":"SUBTOTAL(103,B121)*(B121<>\"\")*(MAX(A$109:A120)+1)","v":12},"Joʻraqulov Tolibjon Oʻktamovich",0,"",null,null,"",""]
[{"$f":"SUBTOTAL(103,B122)*(B122<>\"\")*(MAX(A$109:A121)+1)","v":13},"Ibragimov Abbos Avaz oʻgʻli",0,"",null,null,"",""]
[{"$f":"SUBTOTAL(103,B123)*(B123<>\"\")*(MAX(A$109:A122)+1)","v":14},"Karajanov Nurmuxammed Abdireiimovich",0,"",null,null,"",""]
[{"$f":"SUBTOTAL(103,B124)*(B124<>\"\")*(MAX(A$109:A123)+1)","v":15},"Karimov Bozor Abdugʻapparovich",0,"",null,null,"",""]
[{"$f":"SUBTOTAL(103,B125)*(B125<>\"\")*(MAX(A$109:A124)+1)","v":16},"Karimova Maftuna Komiljon qizi",0,"",null,null,"",""]
[{"$f":"SUBTOTAL(103,B126)*(B126<>\"\")*(MAX(A$109:A125)+1)","v":17},"Qodirov Jahongir Turgʻun oʻgʻli",0,"",null,null,"",""]
[{"$f":"SUBTOTAL(103,B127)*(B127<>\"\")*(MAX(A$109:A126)+1)","v":18},"Qurbonov Azizbek Yoʻldosh oʻgʻli",0,"",null,null,"",""]
[{"$f":"SUBTOTAL(103,B128)*(B128<>\"\")*(MAX(A$109:A127)+1)","v":19},"Qurbonov Shahriyor Uralovich",0,"",null,null,"",""]
[{"$f":"SUBTOTAL(103,B129)*(B129<>\"\")*(MAX(A$109:A128)+1)","v":20},"Mamatqulova Muyassarxon Ashurmuhammadovna",0,"",null,null,"",""]
[{"$f":"SUBTOTAL(103,B130)*(B130<>\"\")*(MAX(A$109:A129)+1)","v":21},"Mamatqulova Sevara Faxriddin qizi",0,"",null,null,"",""]
[{"$f":"SUBTOTAL(103,B131)*(B131<>\"\")*(MAX(A$109:A130)+1)","v":22},"Mardonov Sirojiddin Abdivoxidovich",0,"",null,null,"",""]
[{"$f":"SUBTOTAL(103,B132)*(B132<>\"\")*(MAX(A$109:A131)+1)","v":23},"Mengliev Bekzod Hasan oʻgʻli",0,"",null,null,"",""]
[{"$f":"SUBTOTAL(103,B133)*(B133<>\"\")*(MAX(A$109:A132)+1)","v":24},"Muxamadiev Raximjon Farxodjon oʻgʻli",0,"",null,null,"",""]
[{"$f":"SUBTOTAL(103,B134)*(B134<>\"\")*(MAX(A$109:A133)+1)","v":25},"Normurodov Maxsudbek Yunusovich",0,"",null,null,"",""]
[{"$f":"SUBTOTAL(103,B135)*(B135<>\"\")*(MAX(A$109:A134)+1)","v":26},"Nurova Farogʻat Salohiddin qizi",0,"",null,null,"",""]
[{"$f":"SUBTOTAL(103,B136)*(B136<>\"\")*(MAX(A$109:A135)+1)","v":27},"Pardaev Shuhratjon Jahongirovich",0,"",null,null,"",""]
[{"$f":"SUBTOTAL(103,B137)*(B137<>\"\")*(MAX(A$109:A136)+1)","v":28},"Ravshanova Munisa Hasan qizi",0,"",null,null,"",""]
[{"$f":"SUBTOTAL(103,B138)*(B138<>\"\")*(MAX(A$109:A137)+1)","v":29},"Raximov Asliddin Raxmiddin oʻgʻli",0,"",null,null,"",""]
[{"$f":"SUBTOTAL(103,B139)*(B139<>\"\")*(MAX(A$109:A138)+1)","v":30},"Roʻziboev Elbek Abdufattoh oʻgʻli",0,"",null,null,"",""]
[{"$f":"A42","v":"JN va ON oʻtkazgan professor-oʻqituvchi imzosi"}]
[null,"Jami talabalar soni:",{"$f":"COUNTIF(B109:B139,\"?*\")-1","v":30},"5 (aʻlo)",{"$f":"COUNTIF(D109:D139,\"5*\")","v":0}]
[null,null," ","4 (yaxshi)",{"$f":"COUNTIF(D109:D139,\"4*\")","v":0}]
[null,null,null,"3 (qoniqarli)",{"$f":"COUNTIF(D109:D139,\"3*\")","v":0}]
[null,null,null,"oʻzlashtira olmagan",{"$f":"COUNTIF(D109:D139,\"2*\")","v":0}]
[null,null,null,"kelmagan",{"$f":"COUNTIF(D109:D139,\"k*\")","v":0}]
[]
[null,{"$f":"B48","v":"Fakultet dekani ____________ A.Absamatov"},null,{"$f":"D48","v":"Kafedra mudiri:__________________"}]
[null,{"$f":"B49","v":"        M.Oʻ.            Imzo                    F.I.SH."},null,{"$f":"D49","v":"         Imzo                    F.I.SH."}]

{"sheet":"Korporativ moliya","index":6,"n_rows":148,"n_cols":8,"rows_kept":148,"cut":false,"hidden":false,"merged":[[1,0,1,4],[2,0,2,4],[3,0,3,4],[4,0,4,4],[5,0,5,4],[6,0,6,1],[7,0,7,4],[8,0,8,1],[41,0,41,2],[42,0,42,1],[48,1,48,2],[48,3,48,4],[50,0,50,4],[50,10,51,10],[51,0,51,4],[52,0,52,4],[52,10,53,10],[53,0,53,4],[54,0,54,4],[54,10,55,10],[55,0,55,2],[55,3,55,4],[56,0,56,4],[57,0,57,1],[57,3,57,4],[90,0,90,2],[91,0,91,1],[97,1,97,2],[97,3,97,4],[99,0,99,4],[100,0,100,4],[101,0,101,4],[102,0,102,4],[103,0,103,4],[104,0,104,2],[104,3,104,4],[105,0,105,4],[149,1,149,2],[149,3,149,4],[106,0,106,1],[106,3,106,4],[139,0,139,2],[147,1,147,2],[147,3,147,4],[148,3,148,4]]}
[null,null,null,null,"8-shakl"]
["OʻZBEKISTON RESPUBLIKASI OLIY TAʻLIM, FAN VA INNOVATSIYALAR VAZIRLIGI"]
["TERMIZ DAVLAT UNIVERSITETI"]
["BAHOLASH QAYDNOMASI №___"]
["IQTISODIYOT VA TURIZM FAKULTETI IQTISODIYOT TAʻLIM YOʻNALISHI 1-KURS 1-SEMESTR 101-GURUH"]
["Korporativ moliya"]
["Maʻruza oʻqituvchisi: ",null,null,"Amaliyot oʻqituvchisi: "]
["YaN oʻtkazuvchi komissiya: "]
["Semestrda fanga ajratilgan umumiy soatlar:",null,null,"YaN oʻtkazilgan sana: "]
[]
["№","Talabaning familiyasi, ismi, sharifi","Reyting daftarchasining raqami","YaN","YaN oʻtkazuvchining imzosi","YaN"]
[1,"Abdullaeva Dilfuza Bahodir qizi",null,{"$f":"H12","v":""},null,null,{"$f":"IF(D12=\"5 (a'lo)\",5,IF(AND(D12=\"4 (yaxshi)\"),4,IF(AND(D12=\"3 (qoniqarli)\"),3,IF(AND(D12=\"2 (qoniqarsiz)\"),2,IF(AND(D12=\"kelmagan\"),1,IF(AND(D12=\"\"), \"\",))))))","v":""},{"$f":"IF(F12=5,\"5 (a'lo)\",IF(AND(F12=4),\"4 (yaxshi)\",IF(AND(F12=3),\"3 (qoniqarli)\",IF(AND(F12=2),\"2 (qoniqarsiz)\",IF(AND(F12=1),\"kelmagan\",IF(AND(F12=\"\"),\"\",))))))","v":""}]
[2,"Abduraimov Asilbek Eralievich",null,{"$f":"H13","v":""},null,null,{"$f":"IF(D13=\"5 (a'lo)\",5,IF(AND(D13=\"4 (yaxshi)\"),4,IF(AND(D13=\"3 (qoniqarli)\"),3,IF(AND(D13=\"2 (qoniqarsiz)\"),2,IF(AND(D13=\"kelmagan\"),1,IF(AND(D13=\"\"), \"\",))))))","v":""},{"$f":"IF(F13=5,\"5 (a'lo)\",IF(AND(F13=4),\"4 (yaxshi)\",IF(AND(F13=3),\"3 (qoniqarli)\",IF(AND(F13=2),\"2 (qoniqarsiz)\",IF(AND(F13=1),\"kelmagan\",IF(AND(F13=\"\"),\"\",))))))","v":""}]
[3,"Abdurashidova Elnora Yoʻlchi qizi",null,"",null,null,"",""]
[4,"Abdusattorov Baxtiyor Ibragim oʻgʻli",null,"",null,null,"",""]
[5,"Avazov Mirzohid Akmal oʻgʻli",null,"",null,null,"",""]
[6,"Adinaev Javohirbek Bahodir oʻgʻli",null,"",null,null,"",""]
[7,"Allamurodov Bexruz Allamurod oʻgʻli",null,"",null,null,"",""]
[8,"Axmedov Alisher Oʻktamboevich",null,"",null,null,"",""]
[9,"Jamolov Bejan Xurshidovich",null,"",null,null,"",""]
[10,"Jumaeva Nigina Baxtiyor qizi",null,"",null,null,"",""]
[11,"Joʻraev Farrux Sobirovich",null,"",null,null,"",""]
[12,"Joʻraqulov Tolibjon Oʻktamovich",null,"",null,null,"",""]
[13,"Ibragimov Abbos Avaz oʻgʻli",null,"",null,null,"",""]
[14,"Karajanov Nurmuxammed Abdireiimovich",null,"",null,null,"",""]
[15,"Karimov Bozor Abdugʻapparovich",null,"",null,null,"",""]
[16,"Karimova Maftuna Komiljon qizi",null,"",null,null,"",""]
[17,"Qodirov Jahongir Turgʻun oʻgʻli",null,"",null,null,"",""]
[18,"Qurbonov Azizbek Yoʻldosh oʻgʻli",null,"",null,null,"",""]
[19,"Qurbonov Shahriyor Uralovich",null,"",null,null,"",""]
[20,"Mamatqulova Muyassarxon Ashurmuhammadovna",null,"",null,null,"",""]
[21,"Mamatqulova Sevara Faxriddin qizi",null,"",null,null,"",""]
[22,"Mardonov Sirojiddin Abdivoxidovich",null,"",null,null,"",""]
[23,"Mengliev Bekzod Hasan oʻgʻli",null,"",null,null,"",""]
[24,"Muxamadiev Raximjon Farxodjon oʻgʻli",null,"",null,null,"",""]
[25,"Normurodov Maxsudbek Yunusovich",null,"",null,null,"",""]
[26,"Nurova Farogʻat Salohiddin qizi",null,"",null,null,"",""]
[27,"Pardaev Shuhratjon Jahongirovich",null,"",null,null,"",""]
[28,"Ravshanova Munisa Hasan qizi",null,"",null,null,"",""]
[29,"Raximov Asliddin Raxmiddin oʻgʻli",null,"",null,null,"",""]
[30,"Roʻziboev Elbek Abdufattoh oʻgʻli",null,{"$f":"H41","v":""},null,null,"",""]
["JN va ON oʻtkazgan professor-oʻqituvchi imzosi"]
["Jami talabalar soni:",null,{"$f":"COUNTIF(B11:B41,\"?*\")-1","v":30},"5 (aʻlo)",{"$f":"COUNTIF(D11:D41,\"5*\")","v":0}]
[null,null," ","4 (yaxshi)",{"$f":"COUNTIF(D11:D41,\"4*\")","v":0}]
[null,null,null,"3 (qoniqarli)",{"$f":"COUNTIF(D11:D41,\"3*\")","v":0}]
[null,null,null,"oʻzlashtira olmagan",{"$f":"COUNTIF(D11:D41,\"2*\")","v":0}]
[null,null,null,"kelmagan",{"$f":"COUNTIF(D11:D41,\"k*\")","v":0}]
[null,"Fakultet dekani ____________ A.Absamatov",null,"Kafedra mudiri:__________________"]
[null,"        M.Oʻ.            Imzo                    F.I.SH.",null,"         Imzo                    F.I.SH."]
[null,null,null,null,"8a-shakl"]
[{"$f":"A2","v":"OʻZBEKISTON RESPUBLIKASI OLIY TAʻLIM, FAN VA INNOVATSIYALAR VAZIRLIGI"}]
["TERMIZ DAVLAT UNIVERSITETI"]
["BAHOLASH QAYDNOMASI №___"]
["IQTISODIYOT VA TURIZM FAKULTETI IQTISODIYOT TAʻLIM YOʻNALISHI 1-KURS 1-SEMESTR 101-GURUH"]
["Korporativ moliya"]
["Maʻruza oʻqituvchisi: ",null,null,{"$f":"+D7","v":"Amaliyot oʻqituvchisi: "}]
["YaN oʻtkazuvchi komissiya: "]
[{"$f":"A9","v":"Semestrda fanga ajratilgan umumiy soatlar:"},null,null,{"$f":"+D9","v":"YaN oʻtkazilgan sana: "}]
[]
[{"$f":"A11","v":"№"},{"$f":"B11","v":"Talabaning familiyasi, ismi, sharifi"},{"$f":"C11","v":"Reyting daftarchasining raqami"},{"$f":"D11","v":"YaN"},{"$f":"E11","v":"YaN oʻtkazuvchining imzosi"},"YaN"]
[{"$f":"SUBTOTAL(103,B61)*(B61<>\"\")*(MAX(A$60:A60)+1)","v":1},{"$f":"IF(D12<=\"2 (qoniqarsiz)\",B12,IF(D12=\"kelmagan\",B12,\"\"))","v":"Abdullaeva Dilfuza Bahodir qizi"},{"$f":"C12","v":0},{"$f":"H61","v":""},null,null,{"$f":"IF(D61=\"5 (a'lo)\",5,IF(AND(D61=\"4 (yaxshi)\"),4,IF(AND(D61=\"3 (qoniqarli)\"),3,IF(AND(D61=\"2 (qoniqarsiz)\"),2,IF(AND(D61=\"kelmagan\"),1,IF(AND(D61=\"\"), \"\",))))))","v":""},{"$f":"IF(F61=5,\"5 (a'lo)\",IF(AND(F61=4),\"4 (yaxshi)\",IF(AND(F61=3),\"3 (qoniqarli)\",IF(AND(F61=2),\"2 (qoniqarsiz)\",IF(AND(F61=1),\"kelmagan\",IF(AND(F61=\"\"),\"\",))))))","v":""}]
[{"$f":"SUBTOTAL(103,B62)*(B62<>\"\")*(MAX(A$60:A61)+1)","v":2},"Abduraimov Asilbek Eralievich",0,"",null,null,{"$f":"IF(D62=\"5 (a'lo)\",5,IF(AND(D62=\"4 (yaxshi)\"),4,IF(AND(D62=\"3 (qoniqarli)\"),3,IF(AND(D62=\"2 (qoniqarsiz)\"),2,IF(AND(D62=\"kelmagan\"),1,IF(AND(D62=\"\"), \"\",))))))","v":""},{"$f":"IF(F62=5,\"5 (a'lo)\",IF(AND(F62=4),\"4 (yaxshi)\",IF(AND(F62=3),\"3 (qoniqarli)\",IF(AND(F62=2),\"2 (qoniqarsiz)\",IF(AND(F62=1),\"kelmagan\",IF(AND(F62=\"\"),\"\",))))))","v":""}]
[{"$f":"SUBTOTAL(103,B63)*(B63<>\"\")*(MAX(A$60:A62)+1)","v":3},"Abdurashidova Elnora Yoʻlchi qizi",0,"",null,null,"",""]
[{"$f":"SUBTOTAL(103,B64)*(B64<>\"\")*(MAX(A$60:A63)+1)","v":4},"Abdusattorov Baxtiyor Ibragim oʻgʻli",0,"",null,null,"",""]
[{"$f":"SUBTOTAL(103,B65)*(B65<>\"\")*(MAX(A$60:A64)+1)","v":5},"Avazov Mirzohid Akmal oʻgʻli",0,"",null,null,"",""]
[{"$f":"SUBTOTAL(103,B66)*(B66<>\"\")*(MAX(A$60:A65)+1)","v":6},"Adinaev Javohirbek Bahodir oʻgʻli",0,"",null,null,"",""]
[{"$f":"SUBTOTAL(103,B67)*(B67<>\"\")*(MAX(A$60:A66)+1)","v":7},"Allamurodov Bexruz Allamurod oʻgʻli",0,"",null,null,"",""]
[{"$f":"SUBTOTAL(103,B68)*(B68<>\"\")*(MAX(A$60:A67)+1)","v":8},"Axmedov Alisher Oʻktamboevich",0,"",null,null,"",""]
[{"$f":"SUBTOTAL(103,B69)*(B69<>\"\")*(MAX(A$60:A68)+1)","v":9},"Jamolov Bejan Xurshidovich",0,"",null,null,"",""]
[{"$f":"SUBTOTAL(103,B70)*(B70<>\"\")*(MAX(A$60:A69)+1)","v":10},"Jumaeva Nigina Baxtiyor qizi",0,"",null,null,"",""]
[{"$f":"SUBTOTAL(103,B71)*(B71<>\"\")*(MAX(A$60:A70)+1)","v":11},"Joʻraev Farrux Sobirovich",0,"",null,null,"",""]
[{"$f":"SUBTOTAL(103,B72)*(B72<>\"\")*(MAX(A$60:A71)+1)","v":12},"Joʻraqulov Tolibjon Oʻktamovich",0,"",null,null,"",""]
[{"$f":"SUBTOTAL(103,B73)*(B73<>\"\")*(MAX(A$60:A72)+1)","v":13},"Ibragimov Abbos Avaz oʻgʻli",0,"",null,null,"",""]
[{"$f":"SUBTOTAL(103,B74)*(B74<>\"\")*(MAX(A$60:A73)+1)","v":14},"Karajanov Nurmuxammed Abdireiimovich",0,"",null,null,"",""]
[{"$f":"SUBTOTAL(103,B75)*(B75<>\"\")*(MAX(A$60:A74)+1)","v":15},"Karimov Bozor Abdugʻapparovich",0,"",null,null,"",""]
[{"$f":"SUBTOTAL(103,B76)*(B76<>\"\")*(MAX(A$60:A75)+1)","v":16},"Karimova Maftuna Komiljon qizi",0,"",null,null,"",""]
[{"$f":"SUBTOTAL(103,B77)*(B77<>\"\")*(MAX(A$60:A76)+1)","v":17},"Qodirov Jahongir Turgʻun oʻgʻli",0,"",null,null,"",""]
[{"$f":"SUBTOTAL(103,B78)*(B78<>\"\")*(MAX(A$60:A77)+1)","v":18},"Qurbonov Azizbek Yoʻldosh oʻgʻli",0,"",null,null,"",""]
[{"$f":"SUBTOTAL(103,B79)*(B79<>\"\")*(MAX(A$60:A78)+1)","v":19},"Qurbonov Shahriyor Uralovich",0,"",null,null,"",""]
[{"$f":"SUBTOTAL(103,B80)*(B80<>\"\")*(MAX(A$60:A79)+1)","v":20},"Mamatqulova Muyassarxon Ashurmuhammadovna",0,"",null,null,"",""]
[{"$f":"SUBTOTAL(103,B81)*(B81<>\"\")*(MAX(A$60:A80)+1)","v":21},"Mamatqulova Sevara Faxriddin qizi",0,"",null,null,"",""]
[{"$f":"SUBTOTAL(103,B82)*(B82<>\"\")*(MAX(A$60:A81)+1)","v":22},"Mardonov Sirojiddin Abdivoxidovich",0,"",null,null,"",""]
[{"$f":"SUBTOTAL(103,B83)*(B83<>\"\")*(MAX(A$60:A82)+1)","v":23},"Mengliev Bekzod Hasan oʻgʻli",0,"",null,null,"",""]
[{"$f":"SUBTOTAL(103,B84)*(B84<>\"\")*(MAX(A$60:A83)+1)","v":24},"Muxamadiev Raximjon Farxodjon oʻgʻli",0,"",null,null,"",""]
[{"$f":"SUBTOTAL(103,B85)*(B85<>\"\")*(MAX(A$60:A84)+1)","v":25},"Normurodov Maxsudbek Yunusovich",0,"",null,null,"",""]
[{"$f":"SUBTOTAL(103,B86)*(B86<>\"\")*(MAX(A$60:A85)+1)","v":26},"Nurova Farogʻat Salohiddin qizi",0,"",null,null,"",""]
[{"$f":"SUBTOTAL(103,B87)*(B87<>\"\")*(MAX(A$60:A86)+1)","v":27},"Pardaev Shuhratjon Jahongirovich",0,"",null,null,"",""]
[{"$f":"SUBTOTAL(103,B88)*(B88<>\"\")*(MAX(A$60:A87)+1)","v":28},"Ravshanova Munisa Hasan qizi",0,"",null,null,"",""]
[{"$f":"SUBTOTAL(103,B89)*(B89<>\"\")*(MAX(A$60:A88)+1)","v":29},"Raximov Asliddin Raxmiddin oʻgʻli",0,"",null,null,"",""]
[{"$f":"SUBTOTAL(103,B90)*(B90<>\"\")*(MAX(A$60:A89)+1)","v":30},"Roʻziboev Elbek Abdufattoh oʻgʻli",0,"",null,null,"",""]
[{"$f":"A42","v":"JN va ON oʻtkazgan professor-oʻqituvchi imzosi"}]
["Jami talabalar soni:",null,{"$f":"COUNTIF(B60:B90,\"?*\")-1","v":30},"5 (aʻlo)",{"$f":"COUNTIF(D60:D90,\"5*\")","v":0}]
[null,null," ","4 (yaxshi)",{"$f":"COUNTIF(D60:D90,\"4*\")","v":0}]
[null,null,null,"3 (qoniqarli)",{"$f":"COUNTIF(D60:D90,\"3*\")","v":0}]
[null,null,null,"oʻzlashtira olmagan",{"$f":"COUNTIF(D60:D90,\"2*\")","v":0}]
[null,null,null,"kelmagan",{"$f":"COUNTIF(D60:D90,\"k*\")","v":0}]
[null,{"$f":"B48","v":"Fakultet dekani ____________ A.Absamatov"},null,{"$f":"D48","v":"Kafedra mudiri:__________________"}]
[null,{"$f":"B49","v":"        M.Oʻ.            Imzo                    F.I.SH."},null,{"$f":"D49","v":"         Imzo                    F.I.SH."}]
[null,null,null,null,"8b-shakl"]
[{"$f":"A51","v":"OʻZBEKISTON RESPUBLIKASI OLIY TAʻLIM, FAN VA INNOVATSIYALAR VAZIRLIGI"}]
[{"$f":"A52","v":"TERMIZ DAVLAT UNIVERSITETI"}]
[{"$f":"A4","v":"BAHOLASH QAYDNOMASI №___"}]
[{"$f":"A54","v":"IQTISODIYOT VA TURIZM FAKULTETI IQTISODIYOT TAʻLIM YOʻNALISHI 1-KURS 1-SEMESTR 101-GURUH"}]
[{"$f":"A55","v":"Korporativ moliya"}]
[{"$f":"A7","v":"Maʻruza oʻqituvchisi: "},null,null,{"$f":"+D7","v":"Amaliyot oʻqituvchisi: "}]
["YaN oʻtkazuvchi komissiya: "]
[{"$f":"A58","v":"Semestrda fanga ajratilgan umumiy soatlar:"},null,null,{"$f":"+D9","v":"YaN oʻtkazilgan sana: "}]
[]
[{"$f":"A60","v":"№"},{"$f":"B60","v":"Talabaning familiyasi, ismi, sharifi"},{"$f":"C60","v":"Reyting daftarchasining raqami"},{"$f":"D60","v":"YaN"},{"$f":"E60","v":"YaN oʻtkazuvchining imzosi"},"YaN"]
[{"$f":"SUBTOTAL(103,B110)*(B110<>\"\")*(MAX(A$109:A109)+1)","v":1},{"$f":"IF(D61<=\"2 (qoniqarsiz)\",B61,IF(D61=\"kelmagan\",B61,\"\"))","v":"Abdullaeva Dilfuza Bahodir qizi"},{"$f":"C12","v":0},{"$f":"H110","v":""},null,null,{"$f":"IF(D110=\"5 (a'lo)\",5,IF(AND(D110=\"4 (yaxshi)\"),4,IF(AND(D110=\"3 (qoniqarli)\"),3,IF(AND(D110=\"2 (qoniqarsiz)\"),2,IF(AND(D110=\"kelmagan\"),1,IF(AND(D110=\"\"), \"\",))))))","v":""},{"$f":"IF(F110=5,\"5 (a'lo)\",IF(AND(F110=4),\"4 (yaxshi)\",IF(AND(F110=3),\"3 (qoniqarli)\",IF(AND(F110=2),\"2 (qoniqarsiz)\",IF(AND(F110=1),\"kelmagan\",IF(AND(F110=\"\"),\"\",))))))","v":""}]
[{"$f":"SUBTOTAL(103,B111)*(B111<>\"\")*(MAX(A$109:A110)+1)","v":2},"Abduraimov Asilbek Eralievich",0,{"$f":"H111","v":""},null,null,{"$f":"IF(D111=\"5 (a'lo)\",5,IF(AND(D111=\"4 (yaxshi)\"),4,IF(AND(D111=\"3 (qoniqarli)\"),3,IF(AND(D111=\"2 (qoniqarsiz)\"),2,IF(AND(D111=\"kelmagan\"),1,IF(AND(D111=\"\"), \"\",))))))","v":""},{"$f":"IF(F111=5,\"5 (a'lo)\",IF(AND(F111=4),\"4 (yaxshi)\",IF(AND(F111=3),\"3 (qoniqarli)\",IF(AND(F111=2),\"2 (qoniqarsiz)\",IF(AND(F111=1),\"kelmagan\",IF(AND(F111=\"\"),\"\",))))))","v":""}]
[{"$f":"SUBTOTAL(103,B112)*(B112<>\"\")*(MAX(A$109:A111)+1)","v":3},"Abdurashidova Elnora Yoʻlchi qizi",0,"",null,null,"",""]
[{"$f":"SUBTOTAL(103,B113)*(B113<>\"\")*(MAX(A$109:A112)+1)","v":4},"Abdusattorov Baxtiyor Ibragim oʻgʻli",0,"",null,null,"",""]
[{"$f":"SUBTOTAL(103,B114)*(B114<>\"\")*(MAX(A$109:A113)+1)","v":5},"Avazov Mirzohid Akmal oʻgʻli",0,"",null,null,"",""]
[{"$f":"SUBTOTAL(103,B115)*(B115<>\"\")*(MAX(A$109:A114)+1)","v":6},"Adinaev Javohirbek Bahodir oʻgʻli",0,"",null,null,"",""]
[{"$f":"SUBTOTAL(103,B116)*(B116<>\"\")*(MAX(A$109:A115)+1)","v":7},"Allamurodov Bexruz Allamurod oʻgʻli",0,"",null,null,"",""]
[{"$f":"SUBTOTAL(103,B117)*(B117<>\"\")*(MAX(A$109:A116)+1)","v":8},"Axmedov Alisher Oʻktamboevich",0,"",null,null,"",""]
[{"$f":"SUBTOTAL(103,B118)*(B118<>\"\")*(MAX(A$109:A117)+1)","v":9},"Jamolov Bejan Xurshidovich",0,"",null,null,"",""]
[{"$f":"SUBTOTAL(103,B119)*(B119<>\"\")*(MAX(A$109:A118)+1)","v":10},"Jumaeva Nigina Baxtiyor qizi",0,"",null,null,"",""]
[{"$f":"SUBTOTAL(103,B120)*(B120<>\"\")*(MAX(A$109:A119)+1)","v":11},"Joʻraev Farrux Sobirovich",0,"",null,null,"",""]
[{"$f":"SUBTOTAL(103,B121)*(B121<>\"\")*(MAX(A$109:A120)+1)","v":12},"Joʻraqulov Tolibjon Oʻktamovich",0,"",null,null,"",""]
[{"$f":"SUBTOTAL(103,B122)*(B122<>\"\")*(MAX(A$109:A121)+1)","v":13},"Ibragimov Abbos Avaz oʻgʻli",0,"",null,null,"",""]
[{"$f":"SUBTOTAL(103,B123)*(B123<>\"\")*(MAX(A$109:A122)+1)","v":14},"Karajanov Nurmuxammed Abdireiimovich",0,"",null,null,"",""]
[{"$f":"SUBTOTAL(103,B124)*(B124<>\"\")*(MAX(A$109:A123)+1)","v":15},"Karimov Bozor Abdugʻapparovich",0,"",null,null,"",""]
[{"$f":"SUBTOTAL(103,B125)*(B125<>\"\")*(MAX(A$109:A124)+1)","v":16},"Karimova Maftuna Komiljon qizi",0,"",null,null,"",""]
[{"$f":"SUBTOTAL(103,B126)*(B126<>\"\")*(MAX(A$109:A125)+1)","v":17},"Qodirov Jahongir Turgʻun oʻgʻli",0,"",null,null,"",""]
[{"$f":"SUBTOTAL(103,B127)*(B127<>\"\")*(MAX(A$109:A126)+1)","v":18},"Qurbonov Azizbek Yoʻldosh oʻgʻli",0,"",null,null,"",""]
[{"$f":"SUBTOTAL(103,B128)*(B128<>\"\")*(MAX(A$109:A127)+1)","v":19},"Qurbonov Shahriyor Uralovich",0,"",null,null,"",""]
[{"$f":"SUBTOTAL(103,B129)*(B129<>\"\")*(MAX(A$109:A128)+1)","v":20},"Mamatqulova Muyassarxon Ashurmuhammadovna",0,"",null,null,"",""]
[{"$f":"SUBTOTAL(103,B130)*(B130<>\"\")*(MAX(A$109:A129)+1)","v":21},"Mamatqulova Sevara Faxriddin qizi",0,"",null,null,"",""]
[{"$f":"SUBTOTAL(103,B131)*(B131<>\"\")*(MAX(A$109:A130)+1)","v":22},"Mardonov Sirojiddin Abdivoxidovich",0,"",null,null,"",""]
[{"$f":"SUBTOTAL(103,B132)*(B132<>\"\")*(MAX(A$109:A131)+1)","v":23},"Mengliev Bekzod Hasan oʻgʻli",0,"",null,null,"",""]
[{"$f":"SUBTOTAL(103,B133)*(B133<>\"\")*(MAX(A$109:A132)+1)","v":24},"Muxamadiev Raximjon Farxodjon oʻgʻli",0,"",null,null,"",""]
[{"$f":"SUBTOTAL(103,B134)*(B134<>\"\")*(MAX(A$109:A133)+1)","v":25},"Normurodov Maxsudbek Yunusovich",0,"",null,null,"",""]
[{"$f":"SUBTOTAL(103,B135)*(B135<>\"\")*(MAX(A$109:A134)+1)","v":26},"Nurova Farogʻat Salohiddin qizi",0,"",null,null,"",""]
[{"$f":"SUBTOTAL(103,B136)*(B136<>\"\")*(MAX(A$109:A135)+1)","v":27},"Pardaev Shuhratjon Jahongirovich",0,"",null,null,"",""]
[{"$f":"SUBTOTAL(103,B137)*(B137<>\"\")*(MAX(A$109:A136)+1)","v":28},"Ravshanova Munisa Hasan qizi",0,"",null,null,"",""]
[{"$f":"SUBTOTAL(103,B138)*(B138<>\"\")*(MAX(A$109:A137)+1)","v":29},"Raximov Asliddin Raxmiddin oʻgʻli",0,"",null,null,"",""]
[{"$f":"SUBTOTAL(103,B139)*(B139<>\"\")*(MAX(A$109:A138)+1)","v":30},"Roʻziboev Elbek Abdufattoh oʻgʻli",0,"",null,null,"",""]
[{"$f":"A42","v":"JN va ON oʻtkazgan professor-oʻqituvchi imzosi"}]
[null,"Jami talabalar soni:",{"$f":"COUNTIF(B109:B139,\"?*\")-1","v":30},"5 (aʻlo)",{"$f":"COUNTIF(D109:D139,\"5*\")","v":0}]
[null,null," ","4 (yaxshi)",{"$f":"COUNTIF(D109:D139,\"4*\")","v":0}]
[null,null,null,"3 (qoniqarli)",{"$f":"COUNTIF(D109:D139,\"3*\")","v":0}]
[null,null,null,"oʻzlashtira olmagan",{"$f":"COUNTIF(D109:D139,\"2*\")","v":0}]
[null,null,null,"kelmagan",{"$f":"COUNTIF(D109:D139,\"k*\")","v":0}]
[]
[null,{"$f":"B48","v":"Fakultet dekani ____________ A.Absamatov"},null,{"$f":"D48","v":"Kafedra mudiri:__________________"}]
[null,{"$f":"B49","v":"        M.Oʻ.            Imzo                    F.I.SH."},null,{"$f":"D49","v":"         Imzo                    F.I.SH."}]

{"sheet":"Statistika","index":7,"n_rows":148,"n_cols":8,"rows_kept":148,"cut":false,"hidden":false,"merged":[[1,0,1,4],[2,0,2,4],[3,0,3,4],[4,0,4,4],[5,0,5,4],[6,0,6,1],[7,0,7,4],[8,0,8,1],[41,0,41,2],[42,0,42,1],[48,1,48,2],[48,3,48,4],[50,0,50,4],[50,10,51,10],[51,0,51,4],[52,0,52,4],[52,10,53,10],[53,0,53,4],[54,0,54,4],[54,10,55,10],[55,0,55,2],[55,3,55,4],[56,0,56,4],[57,0,57,1],[57,3,57,4],[90,0,90,2],[91,0,91,1],[97,1,97,2],[97,3,97,4],[99,0,99,4],[100,0,100,4],[101,0,101,4],[102,0,102,4],[103,0,103,4],[104,0,104,2],[104,3,104,4],[105,0,105,4],[149,1,149,2],[149,3,149,4],[106,0,106,1],[106,3,106,4],[139,0,139,2],[147,1,147,2],[147,3,147,4],[148,3,148,4]]}
[null,null,null,null,"8-shakl"]
["OʻZBEKISTON RESPUBLIKASI OLIY TAʻLIM, FAN VA INNOVATSIYALAR VAZIRLIGI"]
["TERMIZ DAVLAT UNIVERSITETI"]
["BAHOLASH QAYDNOMASI №___"]
["IQTISODIYOT VA TURIZM FAKULTETI IQTISODIYOT TAʻLIM YOʻNALISHI 1-KURS 1-SEMESTR 101-GURUH"]
["Statistika"]
["Maʻruza oʻqituvchisi: ",null,null,"Amaliyot oʻqituvchisi: "]
["YaN oʻtkazuvchi komissiya: "]
["Semestrda fanga ajratilgan umumiy soatlar:",null,null,"YaN oʻtkazilgan sana: "]
[]
["№","Talabaning familiyasi, ismi, sharifi","Reyting daftarchasining raqami","YaN","YaN oʻtkazuvchining imzosi","YaN"]
[1,"Abdullaeva Dilfuza Bahodir qizi",null,{"$f":"H12","v":""},null,null,{"$f":"IF(D12=\"5 (a'lo)\",5,IF(AND(D12=\"4 (yaxshi)\"),4,IF(AND(D12=\"3 (qoniqarli)\"),3,IF(AND(D12=\"2 (qoniqarsiz)\"),2,IF(AND(D12=\"kelmagan\"),1,IF(AND(D12=\"\"), \"\",))))))","v":""},{"$f":"IF(F12=5,\"5 (a'lo)\",IF(AND(F12=4),\"4 (yaxshi)\",IF(AND(F12=3),\"3 (qoniqarli)\",IF(AND(F12=2),\"2 (qoniqarsiz)\",IF(AND(F12=1),\"kelmagan\",IF(AND(F12=\"\"),\"\",))))))","v":""}]
[2,"Abduraimov Asilbek Eralievich",null,{"$f":"H13","v":""},null,null,{"$f":"IF(D13=\"5 (a'lo)\",5,IF(AND(D13=\"4 (yaxshi)\"),4,IF(AND(D13=\"3 (qoniqarli)\"),3,IF(AND(D13=\"2 (qoniqarsiz)\"),2,IF(AND(D13=\"kelmagan\"),1,IF(AND(D13=\"\"), \"\",))))))","v":""},{"$f":"IF(F13=5,\"5 (a'lo)\",IF(AND(F13=4),\"4 (yaxshi)\",IF(AND(F13=3),\"3 (qoniqarli)\",IF(AND(F13=2),\"2 (qoniqarsiz)\",IF(AND(F13=1),\"kelmagan\",IF(AND(F13=\"\"),\"\",))))))","v":""}]
[3,"Abdurashidova Elnora Yoʻlchi qizi",null,"",null,null,"",""]
[4,"Abdusattorov Baxtiyor Ibragim oʻgʻli",null,"",null,null,"",""]
[5,"Avazov Mirzohid Akmal oʻgʻli",null,"",null,null,"",""]
[6,"Adinaev Javohirbek Bahodir oʻgʻli",null,"",null,null,"",""]
[7,"Allamurodov Bexruz Allamurod oʻgʻli",null,"",null,null,"",""]
[8,"Axmedov Alisher Oʻktamboevich",null,"",null,null,"",""]
[9,"Jamolov Bejan Xurshidovich",null,"",null,null,"",""]
[10,"Jumaeva Nigina Baxtiyor qizi",null,"",null,null,"",""]
[11,"Joʻraev Farrux Sobirovich",null,"",null,null,"",""]
[12,"Joʻraqulov Tolibjon Oʻktamovich",null,"",null,null,"",""]
[13,"Ibragimov Abbos Avaz oʻgʻli",null,"",null,null,"",""]
[14,"Karajanov Nurmuxammed Abdireiimovich",null,"",null,null,"",""]
[15,"Karimov Bozor Abdugʻapparovich",null,"",null,null,"",""]
[16,"Karimova Maftuna Komiljon qizi",null,"",null,null,"",""]
[17,"Qodirov Jahongir Turgʻun oʻgʻli",null,"",null,null,"",""]
[18,"Qurbonov Azizbek Yoʻldosh oʻgʻli",null,"",null,null,"",""]
[19,"Qurbonov Shahriyor Uralovich",null,"",null,null,"",""]
[20,"Mamatqulova Muyassarxon Ashurmuhammadovna",null,"",null,null,"",""]
[21,"Mamatqulova Sevara Faxriddin qizi",null,"",null,null,"",""]
[22,"Mardonov Sirojiddin Abdivoxidovich",null,"",null,null,"",""]
[23,"Mengliev Bekzod Hasan oʻgʻli",null,"",null,null,"",""]
[24,"Muxamadiev Raximjon Farxodjon oʻgʻli",null,"",null,null,"",""]
[25,"Normurodov Maxsudbek Yunusovich",null,"",null,null,"",""]
[26,"Nurova Farogʻat Salohiddin qizi",null,"",null,null,"",""]
[27,"Pardaev Shuhratjon Jahongirovich",null,"",null,null,"",""]
[28,"Ravshanova Munisa Hasan qizi",null,"",null,null,"",""]
[29,"Raximov Asliddin Raxmiddin oʻgʻli",null,"",null,null,"",""]
[30,"Roʻziboev Elbek Abdufattoh oʻgʻli",null,{"$f":"H41","v":""},null,null,"",""]
["JN va ON oʻtkazgan professor-oʻqituvchi imzosi"]
["Jami talabalar soni:",null,{"$f":"COUNTIF(B11:B41,\"?*\")-1","v":30},"5 (aʻlo)",{"$f":"COUNTIF(D11:D41,\"5*\")","v":0}]
[null,null," ","4 (yaxshi)",{"$f":"COUNTIF(D11:D41,\"4*\")","v":0}]
[null,null,null,"3 (qoniqarli)",{"$f":"COUNTIF(D11:D41,\"3*\")","v":0}]
[null,null,null,"oʻzlashtira olmagan",{"$f":"COUNTIF(D11:D41,\"2*\")","v":0}]
[null,null,null,"kelmagan",{"$f":"COUNTIF(D11:D41,\"k*\")","v":0}]
[null,"Fakultet dekani ____________ A.Absamatov",null,"Kafedra mudiri:__________________"]
[null,"        M.Oʻ.            Imzo                    F.I.SH.",null,"         Imzo                    F.I.SH."]
[null,null,null,null,"8a-shakl"]
[{"$f":"A2","v":"OʻZBEKISTON RESPUBLIKASI OLIY TAʻLIM, FAN VA INNOVATSIYALAR VAZIRLIGI"}]
["TERMIZ DAVLAT UNIVERSITETI"]
["BAHOLASH QAYDNOMASI №___"]
["IQTISODIYOT VA TURIZM FAKULTETI IQTISODIYOT TAʻLIM YOʻNALISHI 1-KURS 1-SEMESTR 101-GURUH"]
["Statistika"]
["Maʻruza oʻqituvchisi: ",null,null,{"$f":"+D7","v":"Amaliyot oʻqituvchisi: "}]
["YaN oʻtkazuvchi komissiya: "]
[{"$f":"A9","v":"Semestrda fanga ajratilgan umumiy soatlar:"},null,null,{"$f":"+D9","v":"YaN oʻtkazilgan sana: "}]
[]
[{"$f":"A11","v":"№"},{"$f":"B11","v":"Talabaning familiyasi, ismi, sharifi"},{"$f":"C11","v":"Reyting daftarchasining raqami"},{"$f":"D11","v":"YaN"},{"$f":"E11","v":"YaN oʻtkazuvchining imzosi"},"YaN"]
[{"$f":"SUBTOTAL(103,B61)*(B61<>\"\")*(MAX(A$60:A60)+1)","v":1},{"$f":"IF(D12<=\"2 (qoniqarsiz)\",B12,IF(D12=\"kelmagan\",B12,\"\"))","v":"Abdullaeva Dilfuza Bahodir qizi"},{"$f":"C12","v":0},{"$f":"H61","v":""},null,null,{"$f":"IF(D61=\"5 (a'lo)\",5,IF(AND(D61=\"4 (yaxshi)\"),4,IF(AND(D61=\"3 (qoniqarli)\"),3,IF(AND(D61=\"2 (qoniqarsiz)\"),2,IF(AND(D61=\"kelmagan\"),1,IF(AND(D61=\"\"), \"\",))))))","v":""},{"$f":"IF(F61=5,\"5 (a'lo)\",IF(AND(F61=4),\"4 (yaxshi)\",IF(AND(F61=3),\"3 (qoniqarli)\",IF(AND(F61=2),\"2 (qoniqarsiz)\",IF(AND(F61=1),\"kelmagan\",IF(AND(F61=\"\"),\"\",))))))","v":""}]
[{"$f":"SUBTOTAL(103,B62)*(B62<>\"\")*(MAX(A$60:A61)+1)","v":2},"Abduraimov Asilbek Eralievich",0,"",null,null,{"$f":"IF(D62=\"5 (a'lo)\",5,IF(AND(D62=\"4 (yaxshi)\"),4,IF(AND(D62=\"3 (qoniqarli)\"),3,IF(AND(D62=\"2 (qoniqarsiz)\"),2,IF(AND(D62=\"kelmagan\"),1,IF(AND(D62=\"\"), \"\",))))))","v":""},{"$f":"IF(F62=5,\"5 (a'lo)\",IF(AND(F62=4),\"4 (yaxshi)\",IF(AND(F62=3),\"3 (qoniqarli)\",IF(AND(F62=2),\"2 (qoniqarsiz)\",IF(AND(F62=1),\"kelmagan\",IF(AND(F62=\"\"),\"\",))))))","v":""}]
[{"$f":"SUBTOTAL(103,B63)*(B63<>\"\")*(MAX(A$60:A62)+1)","v":3},"Abdurashidova Elnora Yoʻlchi qizi",0,"",null,null,"",""]
[{"$f":"SUBTOTAL(103,B64)*(B64<>\"\")*(MAX(A$60:A63)+1)","v":4},"Abdusattorov Baxtiyor Ibragim oʻgʻli",0,"",null,null,"",""]
[{"$f":"SUBTOTAL(103,B65)*(B65<>\"\")*(MAX(A$60:A64)+1)","v":5},"Avazov Mirzohid Akmal oʻgʻli",0,"",null,null,"",""]
[{"$f":"SUBTOTAL(103,B66)*(B66<>\"\")*(MAX(A$60:A65)+1)","v":6},"Adinaev Javohirbek Bahodir oʻgʻli",0,"",null,null,"",""]
[{"$f":"SUBTOTAL(103,B67)*(B67<>\"\")*(MAX(A$60:A66)+1)","v":7},"Allamurodov Bexruz Allamurod oʻgʻli",0,"",null,null,"",""]
[{"$f":"SUBTOTAL(103,B68)*(B68<>\"\")*(MAX(A$60:A67)+1)","v":8},"Axmedov Alisher Oʻktamboevich",0,"",null,null,"",""]
[{"$f":"SUBTOTAL(103,B69)*(B69<>\"\")*(MAX(A$60:A68)+1)","v":9},"Jamolov Bejan Xurshidovich",0,"",null,null,"",""]
[{"$f":"SUBTOTAL(103,B70)*(B70<>\"\")*(MAX(A$60:A69)+1)","v":10},"Jumaeva Nigina Baxtiyor qizi",0,"",null,null,"",""]
[{"$f":"SUBTOTAL(103,B71)*(B71<>\"\")*(MAX(A$60:A70)+1)","v":11},"Joʻraev Farrux Sobirovich",0,"",null,null,"",""]
[{"$f":"SUBTOTAL(103,B72)*(B72<>\"\")*(MAX(A$60:A71)+1)","v":12},"Joʻraqulov Tolibjon Oʻktamovich",0,"",null,null,"",""]
[{"$f":"SUBTOTAL(103,B73)*(B73<>\"\")*(MAX(A$60:A72)+1)","v":13},"Ibragimov Abbos Avaz oʻgʻli",0,"",null,null,"",""]
[{"$f":"SUBTOTAL(103,B74)*(B74<>\"\")*(MAX(A$60:A73)+1)","v":14},"Karajanov Nurmuxammed Abdireiimovich",0,"",null,null,"",""]
[{"$f":"SUBTOTAL(103,B75)*(B75<>\"\")*(MAX(A$60:A74)+1)","v":15},"Karimov Bozor Abdugʻapparovich",0,"",null,null,"",""]
[{"$f":"SUBTOTAL(103,B76)*(B76<>\"\")*(MAX(A$60:A75)+1)","v":16},"Karimova Maftuna Komiljon qizi",0,"",null,null,"",""]
[{"$f":"SUBTOTAL(103,B77)*(B77<>\"\")*(MAX(A$60:A76)+1)","v":17},"Qodirov Jahongir Turgʻun oʻgʻli",0,"",null,null,"",""]
[{"$f":"SUBTOTAL(103,B78)*(B78<>\"\")*(MAX(A$60:A77)+1)","v":18},"Qurbonov Azizbek Yoʻldosh oʻgʻli",0,"",null,null,"",""]
[{"$f":"SUBTOTAL(103,B79)*(B79<>\"\")*(MAX(A$60:A78)+1)","v":19},"Qurbonov Shahriyor Uralovich",0,"",null,null,"",""]
[{"$f":"SUBTOTAL(103,B80)*(B80<>\"\")*(MAX(A$60:A79)+1)","v":20},"Mamatqulova Muyassarxon Ashurmuhammadovna",0,"",null,null,"",""]
[{"$f":"SUBTOTAL(103,B81)*(B81<>\"\")*(MAX(A$60:A80)+1)","v":21},"Mamatqulova Sevara Faxriddin qizi",0,"",null,null,"",""]
[{"$f":"SUBTOTAL(103,B82)*(B82<>\"\")*(MAX(A$60:A81)+1)","v":22},"Mardonov Sirojiddin Abdivoxidovich",0,"",null,null,"",""]
[{"$f":"SUBTOTAL(103,B83)*(B83<>\"\")*(MAX(A$60:A82)+1)","v":23},"Mengliev Bekzod Hasan oʻgʻli",0,"",null,null,"",""]
[{"$f":"SUBTOTAL(103,B84)*(B84<>\"\")*(MAX(A$60:A83)+1)","v":24},"Muxamadiev Raximjon Farxodjon oʻgʻli",0,"",null,null,"",""]
[{"$f":"SUBTOTAL(103,B85)*(B85<>\"\")*(MAX(A$60:A84)+1)","v":25},"Normurodov Maxsudbek Yunusovich",0,"",null,null,"",""]
[{"$f":"SUBTOTAL(103,B86)*(B86<>\"\")*(MAX(A$60:A85)+1)","v":26},"Nurova Farogʻat Salohiddin qizi",0,"",null,null,"",""]
[{"$f":"SUBTOTAL(103,B87)*(B87<>\"\")*(MAX(A$60:A86)+1)","v":27},"Pardaev Shuhratjon Jahongirovich",0,"",null,null,"",""]
[{"$f":"SUBTOTAL(103,B88)*(B88<>\"\")*(MAX(A$60:A87)+1)","v":28},"Ravshanova Munisa Hasan qizi",0,"",null,null,"",""]
[{"$f":"SUBTOTAL(103,B89)*(B89<>\"\")*(MAX(A$60:A88)+1)","v":29},"Raximov Asliddin Raxmiddin oʻgʻli",0,"",null,null,"",""]
[{"$f":"SUBTOTAL(103,B90)*(B90<>\"\")*(MAX(A$60:A89)+1)","v":30},"Roʻziboev Elbek Abdufattoh oʻgʻli",0,"",null,null,"",""]
[{"$f":"A42","v":"JN va ON oʻtkazgan professor-oʻqituvchi imzosi"}]
["Jami talabalar soni:",null,{"$f":"COUNTIF(B60:B90,\"?*\")-1","v":30},"5 (aʻlo)",{"$f":"COUNTIF(D60:D90,\"5*\")","v":0}]
[null,null," ","4 (yaxshi)",{"$f":"COUNTIF(D60:D90,\"4*\")","v":0}]
[null,null,null,"3 (qoniqarli)",{"$f":"COUNTIF(D60:D90,\"3*\")","v":0}]
[null,null,null,"oʻzlashtira olmagan",{"$f":"COUNTIF(D60:D90,\"2*\")","v":0}]
[null,null,null,"kelmagan",{"$f":"COUNTIF(D60:D90,\"k*\")","v":0}]
[null,{"$f":"B48","v":"Fakultet dekani ____________ A.Absamatov"},null,{"$f":"D48","v":"Kafedra mudiri:__________________"}]
[null,{"$f":"B49","v":"        M.Oʻ.            Imzo                    F.I.SH."},null,{"$f":"D49","v":"         Imzo                    F.I.SH."}]
[null,null,null,null,"8b-shakl"]
[{"$f":"A51","v":"OʻZBEKISTON RESPUBLIKASI OLIY TAʻLIM, FAN VA INNOVATSIYALAR VAZIRLIGI"}]
[{"$f":"A52","v":"TERMIZ DAVLAT UNIVERSITETI"}]
[{"$f":"A4","v":"BAHOLASH QAYDNOMASI №___"}]
[{"$f":"A54","v":"IQTISODIYOT VA TURIZM FAKULTETI IQTISODIYOT TAʻLIM YOʻNALISHI 1-KURS 1-SEMESTR 101-GURUH"}]
[{"$f":"A55","v":"Statistika"}]
[{"$f":"A7","v":"Maʻruza oʻqituvchisi: "},null,null,{"$f":"+D7","v":"Amaliyot oʻqituvchisi: "}]
["YaN oʻtkazuvchi komissiya: "]
[{"$f":"A58","v":"Semestrda fanga ajratilgan umumiy soatlar:"},null,null,{"$f":"+D9","v":"YaN oʻtkazilgan sana: "}]
[]
[{"$f":"A60","v":"№"},{"$f":"B60","v":"Talabaning familiyasi, ismi, sharifi"},{"$f":"C60","v":"Reyting daftarchasining raqami"},{"$f":"D60","v":"YaN"},{"$f":"E60","v":"YaN oʻtkazuvchining imzosi"},"YaN"]
[{"$f":"SUBTOTAL(103,B110)*(B110<>\"\")*(MAX(A$109:A109)+1)","v":1},{"$f":"IF(D61<=\"2 (qoniqarsiz)\",B61,IF(D61=\"kelmagan\",B61,\"\"))","v":"Abdullaeva Dilfuza Bahodir qizi"},{"$f":"C12","v":0},{"$f":"H110","v":""},null,null,{"$f":"IF(D110=\"5 (a'lo)\",5,IF(AND(D110=\"4 (yaxshi)\"),4,IF(AND(D110=\"3 (qoniqarli)\"),3,IF(AND(D110=\"2 (qoniqarsiz)\"),2,IF(AND(D110=\"kelmagan\"),1,IF(AND(D110=\"\"), \"\",))))))","v":""},{"$f":"IF(F110=5,\"5 (a'lo)\",IF(AND(F110=4),\"4 (yaxshi)\",IF(AND(F110=3),\"3 (qoniqarli)\",IF(AND(F110=2),\"2 (qoniqarsiz)\",IF(AND(F110=1),\"kelmagan\",IF(AND(F110=\"\"),\"\",))))))","v":""}]
[{"$f":"SUBTOTAL(103,B111)*(B111<>\"\")*(MAX(A$109:A110)+1)","v":2},"Abduraimov Asilbek Eralievich",0,{"$f":"H111","v":""},null,null,{"$f":"IF(D111=\"5 (a'lo)\",5,IF(AND(D111=\"4 (yaxshi)\"),4,IF(AND(D111=\"3 (qoniqarli)\"),3,IF(AND(D111=\"2 (qoniqarsiz)\"),2,IF(AND(D111=\"kelmagan\"),1,IF(AND(D111=\"\"), \"\",))))))","v":""},{"$f":"IF(F111=5,\"5 (a'lo)\",IF(AND(F111=4),\"4 (yaxshi)\",IF(AND(F111=3),\"3 (qoniqarli)\",IF(AND(F111=2),\"2 (qoniqarsiz)\",IF(AND(F111=1),\"kelmagan\",IF(AND(F111=\"\"),\"\",))))))","v":""}]
[{"$f":"SUBTOTAL(103,B112)*(B112<>\"\")*(MAX(A$109:A111)+1)","v":3},"Abdurashidova Elnora Yoʻlchi qizi",0,"",null,null,"",""]
[{"$f":"SUBTOTAL(103,B113)*(B113<>\"\")*(MAX(A$109:A112)+1)","v":4},"Abdusattorov Baxtiyor Ibragim oʻgʻli",0,"",null,null,"",""]
[{"$f":"SUBTOTAL(103,B114)*(B114<>\"\")*(MAX(A$109:A113)+1)","v":5},"Avazov Mirzohid Akmal oʻgʻli",0,"",null,null,"",""]
[{"$f":"SUBTOTAL(103,B115)*(B115<>\"\")*(MAX(A$109:A114)+1)","v":6},"Adinaev Javohirbek Bahodir oʻgʻli",0,"",null,null,"",""]
[{"$f":"SUBTOTAL(103,B116)*(B116<>\"\")*(MAX(A$109:A115)+1)","v":7},"Allamurodov Bexruz Allamurod oʻgʻli",0,"",null,null,"",""]
[{"$f":"SUBTOTAL(103,B117)*(B117<>\"\")*(MAX(A$109:A116)+1)","v":8},"Axmedov Alisher Oʻktamboevich",0,"",null,null,"",""]
[{"$f":"SUBTOTAL(103,B118)*(B118<>\"\")*(MAX(A$109:A117)+1)","v":9},"Jamolov Bejan Xurshidovich",0,"",null,null,"",""]
[{"$f":"SUBTOTAL(103,B119)*(B119<>\"\")*(MAX(A$109:A118)+1)","v":10},"Jumaeva Nigina Baxtiyor qizi",0,"",null,null,"",""]
[{"$f":"SUBTOTAL(103,B120)*(B120<>\"\")*(MAX(A$109:A119)+1)","v":11},"Joʻraev Farrux Sobirovich",0,"",null,null,"",""]
[{"$f":"SUBTOTAL(103,B121)*(B121<>\"\")*(MAX(A$109:A120)+1)","v":12},"Joʻraqulov Tolibjon Oʻktamovich",0,"",null,null,"",""]
[{"$f":"SUBTOTAL(103,B122)*(B122<>\"\")*(MAX(A$109:A121)+1)","v":13},"Ibragimov Abbos Avaz oʻgʻli",0,"",null,null,"",""]
[{"$f":"SUBTOTAL(103,B123)*(B123<>\"\")*(MAX(A$109:A122)+1)","v":14},"Karajanov Nurmuxammed Abdireiimovich",0,"",null,null,"",""]
[{"$f":"SUBTOTAL(103,B124)*(B124<>\"\")*(MAX(A$109:A123)+1)","v":15},"Karimov Bozor Abdugʻapparovich",0,"",null,null,"",""]
[{"$f":"SUBTOTAL(103,B125)*(B125<>\"\")*(MAX(A$109:A124)+1)","v":16},"Karimova Maftuna Komiljon qizi",0,"",null,null,"",""]
[{"$f":"SUBTOTAL(103,B126)*(B126<>\"\")*(MAX(A$109:A125)+1)","v":17},"Qodirov Jahongir Turgʻun oʻgʻli",0,"",null,null,"",""]
[{"$f":"SUBTOTAL(103,B127)*(B127<>\"\")*(MAX(A$109:A126)+1)","v":18},"Qurbonov Azizbek Yoʻldosh oʻgʻli",0,"",null,null,"",""]
[{"$f":"SUBTOTAL(103,B128)*(B128<>\"\")*(MAX(A$109:A127)+1)","v":19},"Qurbonov Shahriyor Uralovich",0,"",null,null,"",""]
[{"$f":"SUBTOTAL(103,B129)*(B129<>\"\")*(MAX(A$109:A128)+1)","v":20},"Mamatqulova Muyassarxon Ashurmuhammadovna",0,"",null,null,"",""]
[{"$f":"SUBTOTAL(103,B130)*(B130<>\"\")*(MAX(A$109:A129)+1)","v":21},"Mamatqulova Sevara Faxriddin qizi",0,"",null,null,"",""]
[{"$f":"SUBTOTAL(103,B131)*(B131<>\"\")*(MAX(A$109:A130)+1)","v":22},"Mardonov Sirojiddin Abdivoxidovich",0,"",null,null,"",""]
[{"$f":"SUBTOTAL(103,B132)*(B132<>\"\")*(MAX(A$109:A131)+1)","v":23},"Mengliev Bekzod Hasan oʻgʻli",0,"",null,null,"",""]
[{"$f":"SUBTOTAL(103,B133)*(B133<>\"\")*(MAX(A$109:A132)+1)","v":24},"Muxamadiev Raximjon Farxodjon oʻgʻli",0,"",null,null,"",""]
[{"$f":"SUBTOTAL(103,B134)*(B134<>\"\")*(MAX(A$109:A133)+1)","v":25},"Normurodov Maxsudbek Yunusovich",0,"",null,null,"",""]
[{"$f":"SUBTOTAL(103,B135)*(B135<>\"\")*(MAX(A$109:A134)+1)","v":26},"Nurova Farogʻat Salohiddin qizi",0,"",null,null,"",""]
[{"$f":"SUBTOTAL(103,B136)*(B136<>\"\")*(MAX(A$109:A135)+1)","v":27},"Pardaev Shuhratjon Jahongirovich",0,"",null,null,"",""]
[{"$f":"SUBTOTAL(103,B137)*(B137<>\"\")*(MAX(A$109:A136)+1)","v":28},"Ravshanova Munisa Hasan qizi",0,"",null,null,"",""]
[{"$f":"SUBTOTAL(103,B138)*(B138<>\"\")*(MAX(A$109:A137)+1)","v":29},"Raximov Asliddin Raxmiddin oʻgʻli",0,"",null,null,"",""]
[{"$f":"SUBTOTAL(103,B139)*(B139<>\"\")*(MAX(A$109:A138)+1)","v":30},"Roʻziboev Elbek Abdufattoh oʻgʻli",0,"",null,null,"",""]
[{"$f":"A42","v":"JN va ON oʻtkazgan professor-oʻqituvchi imzosi"}]
[null,"Jami talabalar soni:",{"$f":"COUNTIF(B109:B139,\"?*\")-1","v":30},"5 (aʻlo)",{"$f":"COUNTIF(D109:D139,\"5*\")","v":0}]
[null,null," ","4 (yaxshi)",{"$f":"COUNTIF(D109:D139,\"4*\")","v":0}]
[null,null,null,"3 (qoniqarli)",{"$f":"COUNTIF(D109:D139,\"3*\")","v":0}]
[null,null,null,"oʻzlashtira olmagan",{"$f":"COUNTIF(D109:D139,\"2*\")","v":0}]
[null,null,null,"kelmagan",{"$f":"COUNTIF(D109:D139,\"k*\")","v":0}]
[]
[null,{"$f":"B48","v":"Fakultet dekani ____________ A.Absamatov"},null,{"$f":"D48","v":"Kafedra mudiri:__________________"}]
[null,{"$f":"B49","v":"        M.Oʻ.            Imzo                    F.I.SH."},null,{"$f":"D49","v":"         Imzo                    F.I.SH."}]

{"sheet":"Mikroiqtisodiyot","index":8,"n_rows":148,"n_cols":8,"rows_kept":148,"cut":false,"hidden":false,"merged":[[1,0,1,4],[2,0,2,4],[3,0,3,4],[4,0,4,4],[5,0,5,4],[6,0,6,1],[7,0,7,4],[8,0,8,1],[41,0,41,2],[42,0,42,1],[48,1,48,2],[48,3,48,4],[50,0,50,4],[50,10,51,10],[51,0,51,4],[52,0,52,4],[52,10,53,10],[53,0,53,4],[54,0,54,4],[54,10,55,10],[55,0,55,2],[55,3,55,4],[56,0,56,4],[57,0,57,1],[57,3,57,4],[90,0,90,2],[91,0,91,1],[97,1,97,2],[97,3,97,4],[99,0,99,4],[100,0,100,4],[101,0,101,4],[102,0,102,4],[103,0,103,4],[104,0,104,2],[104,3,104,4],[105,0,105,4],[149,1,149,2],[149,3,149,4],[106,0,106,1],[106,3,106,4],[139,0,139,2],[147,1,147,2],[147,3,147,4],[148,3,148,4]]}
[null,null,null,null,"8-shakl"]
["OʻZBEKISTON RESPUBLIKASI OLIY TAʻLIM, FAN VA INNOVATSIYALAR VAZIRLIGI"]
["TERMIZ DAVLAT UNIVERSITETI"]
["BAHOLASH QAYDNOMASI №___"]
["IQTISODIYOT VA TURIZM FAKULTETI IQTISODIYOT TAʻLIM YOʻNALISHI 1-KURS 1-SEMESTR 101-GURUH"]
["Mikroiqtisodiyot"]
["Maʻruza oʻqituvchisi: ",null,null,"Amaliyot oʻqituvchisi: "]
["YaN oʻtkazuvchi komissiya: "]
["Semestrda fanga ajratilgan umumiy soatlar:",null,null,"YaN oʻtkazilgan sana: "]
[]
["№","Talabaning familiyasi, ismi, sharifi","Reyting daftarchasining raqami","YaN","YaN oʻtkazuvchining imzosi","YaN"]
[1,"Abdullaeva Dilfuza Bahodir qizi",null,{"$f":"H12","v":""},null,null,{"$f":"IF(D12=\"5 (a'lo)\",5,IF(AND(D12=\"4 (yaxshi)\"),4,IF(AND(D12=\"3 (qoniqarli)\"),3,IF(AND(D12=\"2 (qoniqarsiz)\"),2,IF(AND(D12=\"kelmagan\"),1,IF(AND(D12=\"\"), \"\",))))))","v":""},{"$f":"IF(F12=5,\"5 (a'lo)\",IF(AND(F12=4),\"4 (yaxshi)\",IF(AND(F12=3),\"3 (qoniqarli)\",IF(AND(F12=2),\"2 (qoniqarsiz)\",IF(AND(F12=1),\"kelmagan\",IF(AND(F12=\"\"),\"\",))))))","v":""}]
[2,"Abduraimov Asilbek Eralievich",null,{"$f":"H13","v":""},null,null,{"$f":"IF(D13=\"5 (a'lo)\",5,IF(AND(D13=\"4 (yaxshi)\"),4,IF(AND(D13=\"3 (qoniqarli)\"),3,IF(AND(D13=\"2 (qoniqarsiz)\"),2,IF(AND(D13=\"kelmagan\"),1,IF(AND(D13=\"\"), \"\",))))))","v":""},{"$f":"IF(F13=5,\"5 (a'lo)\",IF(AND(F13=4),\"4 (yaxshi)\",IF(AND(F13=3),\"3 (qoniqarli)\",IF(AND(F13=2),\"2 (qoniqarsiz)\",IF(AND(F13=1),\"kelmagan\",IF(AND(F13=\"\"),\"\",))))))","v":""}]
[3,"Abdurashidova Elnora Yoʻlchi qizi",null,"",null,null,"",""]
[4,"Abdusattorov Baxtiyor Ibragim oʻgʻli",null,"",null,null,"",""]
[5,"Avazov Mirzohid Akmal oʻgʻli",null,"",null,null,"",""]
[6,"Adinaev Javohirbek Bahodir oʻgʻli",null,"",null,null,"",""]
[7,"Allamurodov Bexruz Allamurod oʻgʻli",null,"",null,null,"",""]
[8,"Axmedov Alisher Oʻktamboevich",null,"",null,null,"",""]
[9,"Jamolov Bejan Xurshidovich",null,"",null,null,"",""]
[10,"Jumaeva Nigina Baxtiyor qizi",null,"",null,null,"",""]
[11,"Joʻraev Farrux Sobirovich",null,"",null,null,"",""]
[12,"Joʻraqulov Tolibjon Oʻktamovich",null,"",null,null,"",""]
[13,"Ibragimov Abbos Avaz oʻgʻli",null,"",null,null,"",""]
[14,"Karajanov Nurmuxammed Abdireiimovich",null,"",null,null,"",""]
[15,"Karimov Bozor Abdugʻapparovich",null,"",null,null,"",""]
[16,"Karimova Maftuna Komiljon qizi",null,"",null,null,"",""]
[17,"Qodirov Jahongir Turgʻun oʻgʻli",null,"",null,null,"",""]
[18,"Qurbonov Azizbek Yoʻldosh oʻgʻli",null,"",null,null,"",""]
[19,"Qurbonov Shahriyor Uralovich",null,"",null,null,"",""]
[20,"Mamatqulova Muyassarxon Ashurmuhammadovna",null,"",null,null,"",""]
[21,"Mamatqulova Sevara Faxriddin qizi",null,"",null,null,"",""]
[22,"Mardonov Sirojiddin Abdivoxidovich",null,"",null,null,"",""]
[23,"Mengliev Bekzod Hasan oʻgʻli",null,"",null,null,"",""]
[24,"Muxamadiev Raximjon Farxodjon oʻgʻli",null,"",null,null,"",""]
[25,"Normurodov Maxsudbek Yunusovich",null,"",null,null,"",""]
[26,"Nurova Farogʻat Salohiddin qizi",null,"",null,null,"",""]
[27,"Pardaev Shuhratjon Jahongirovich",null,"",null,null,"",""]
[28,"Ravshanova Munisa Hasan qizi",null,"",null,null,"",""]
[29,"Raximov Asliddin Raxmiddin oʻgʻli",null,"",null,null,"",""]
[30,"Roʻziboev Elbek Abdufattoh oʻgʻli",null,{"$f":"H41","v":""},null,null,"",""]
["JN va ON oʻtkazgan professor-oʻqituvchi imzosi"]
["Jami talabalar soni:",null,{"$f":"COUNTIF(B11:B41,\"?*\")-1","v":30},"5 (aʻlo)",{"$f":"COUNTIF(D11:D41,\"5*\")","v":0}]
[null,null," ","4 (yaxshi)",{"$f":"COUNTIF(D11:D41,\"4*\")","v":0}]
[null,null,null,"3 (qoniqarli)",{"$f":"COUNTIF(D11:D41,\"3*\")","v":0}]
[null,null,null,"oʻzlashtira olmagan",{"$f":"COUNTIF(D11:D41,\"2*\")","v":0}]
[null,null,null,"kelmagan",{"$f":"COUNTIF(D11:D41,\"k*\")","v":0}]
[null,"Fakultet dekani ____________ A.Absamatov",null,"Kafedra mudiri:__________________"]
[null,"        M.Oʻ.            Imzo                    F.I.SH.",null,"         Imzo                    F.I.SH."]
[null,null,null,null,"8a-shakl"]
[{"$f":"A2","v":"OʻZBEKISTON RESPUBLIKASI OLIY TAʻLIM, FAN VA INNOVATSIYALAR VAZIRLIGI"}]
["TERMIZ DAVLAT UNIVERSITETI"]
["BAHOLASH QAYDNOMASI №___"]
["IQTISODIYOT VA TURIZM FAKULTETI IQTISODIYOT TAʻLIM YOʻNALISHI 1-KURS 1-SEMESTR 101-GURUH"]
["Mikroiqtisodiyot"]
["Maʻruza oʻqituvchisi: ",null,null,{"$f":"+D7","v":"Amaliyot oʻqituvchisi: "}]
["YaN oʻtkazuvchi komissiya: "]
[{"$f":"A9","v":"Semestrda fanga ajratilgan umumiy soatlar:"},null,null,{"$f":"+D9","v":"YaN oʻtkazilgan sana: "}]
[]
[{"$f":"A11","v":"№"},{"$f":"B11","v":"Talabaning familiyasi, ismi, sharifi"},{"$f":"C11","v":"Reyting daftarchasining raqami"},{"$f":"D11","v":"YaN"},{"$f":"E11","v":"YaN oʻtkazuvchining imzosi"},"YaN"]
[{"$f":"SUBTOTAL(103,B61)*(B61<>\"\")*(MAX(A$60:A60)+1)","v":1},{"$f":"IF(D12<=\"2 (qoniqarsiz)\",B12,IF(D12=\"kelmagan\",B12,\"\"))","v":"Abdullaeva Dilfuza Bahodir qizi"},{"$f":"C12","v":0},{"$f":"H61","v":""},null,null,{"$f":"IF(D61=\"5 (a'lo)\",5,IF(AND(D61=\"4 (yaxshi)\"),4,IF(AND(D61=\"3 (qoniqarli)\"),3,IF(AND(D61=\"2 (qoniqarsiz)\"),2,IF(AND(D61=\"kelmagan\"),1,IF(AND(D61=\"\"), \"\",))))))","v":""},{"$f":"IF(F61=5,\"5 (a'lo)\",IF(AND(F61=4),\"4 (yaxshi)\",IF(AND(F61=3),\"3 (qoniqarli)\",IF(AND(F61=2),\"2 (qoniqarsiz)\",IF(AND(F61=1),\"kelmagan\",IF(AND(F61=\"\"),\"\",))))))","v":""}]
[{"$f":"SUBTOTAL(103,B62)*(B62<>\"\")*(MAX(A$60:A61)+1)","v":2},"Abduraimov Asilbek Eralievich",0,"",null,null,{"$f":"IF(D62=\"5 (a'lo)\",5,IF(AND(D62=\"4 (yaxshi)\"),4,IF(AND(D62=\"3 (qoniqarli)\"),3,IF(AND(D62=\"2 (qoniqarsiz)\"),2,IF(AND(D62=\"kelmagan\"),1,IF(AND(D62=\"\"), \"\",))))))","v":""},{"$f":"IF(F62=5,\"5 (a'lo)\",IF(AND(F62=4),\"4 (yaxshi)\",IF(AND(F62=3),\"3 (qoniqarli)\",IF(AND(F62=2),\"2 (qoniqarsiz)\",IF(AND(F62=1),\"kelmagan\",IF(AND(F62=\"\"),\"\",))))))","v":""}]
[{"$f":"SUBTOTAL(103,B63)*(B63<>\"\")*(MAX(A$60:A62)+1)","v":3},"Abdurashidova Elnora Yoʻlchi qizi",0,"",null,null,"",""]
[{"$f":"SUBTOTAL(103,B64)*(B64<>\"\")*(MAX(A$60:A63)+1)","v":4},"Abdusattorov Baxtiyor Ibragim oʻgʻli",0,"",null,null,"",""]
[{"$f":"SUBTOTAL(103,B65)*(B65<>\"\")*(MAX(A$60:A64)+1)","v":5},"Avazov Mirzohid Akmal oʻgʻli",0,"",null,null,"",""]
[{"$f":"SUBTOTAL(103,B66)*(B66<>\"\")*(MAX(A$60:A65)+1)","v":6},"Adinaev Javohirbek Bahodir oʻgʻli",0,"",null,null,"",""]
[{"$f":"SUBTOTAL(103,B67)*(B67<>\"\")*(MAX(A$60:A66)+1)","v":7},"Allamurodov Bexruz Allamurod oʻgʻli",0,"",null,null,"",""]
[{"$f":"SUBTOTAL(103,B68)*(B68<>\"\")*(MAX(A$60:A67)+1)","v":8},"Axmedov Alisher Oʻktamboevich",0,"",null,null,"",""]
[{"$f":"SUBTOTAL(103,B69)*(B69<>\"\")*(MAX(A$60:A68)+1)","v":9},"Jamolov Bejan Xurshidovich",0,"",null,null,"",""]
[{"$f":"SUBTOTAL(103,B70)*(B70<>\"\")*(MAX(A$60:A69)+1)","v":10},"Jumaeva Nigina Baxtiyor qizi",0,"",null,null,"",""]
[{"$f":"SUBTOTAL(103,B71)*(B71<>\"\")*(MAX(A$60:A70)+1)","v":11},"Joʻraev Farrux Sobirovich",0,"",null,null,"",""]
[{"$f":"SUBTOTAL(103,B72)*(B72<>\"\")*(MAX(A$60:A71)+1)","v":12},"Joʻraqulov Tolibjon Oʻktamovich",0,"",null,null,"",""]
[{"$f":"SUBTOTAL(103,B73)*(B73<>\"\")*(MAX(A$60:A72)+1)","v":13},"Ibragimov Abbos Avaz oʻgʻli",0,"",null,null,"",""]
[{"$f":"SUBTOTAL(103,B74)*(B74<>\"\")*(MAX(A$60:A73)+1)","v":14},"Karajanov Nurmuxammed Abdireiimovich",0,"",null,null,"",""]
[{"$f":"SUBTOTAL(103,B75)*(B75<>\"\")*(MAX(A$60:A74)+1)","v":15},"Karimov Bozor Abdugʻapparovich",0,"",null,null,"",""]
[{"$f":"SUBTOTAL(103,B76)*(B76<>\"\")*(MAX(A$60:A75)+1)","v":16},"Karimova Maftuna Komiljon qizi",0,"",null,null,"",""]
[{"$f":"SUBTOTAL(103,B77)*(B77<>\"\")*(MAX(A$60:A76)+1)","v":17},"Qodirov Jahongir Turgʻun oʻgʻli",0,"",null,null,"",""]
[{"$f":"SUBTOTAL(103,B78)*(B78<>\"\")*(MAX(A$60:A77)+1)","v":18},"Qurbonov Azizbek Yoʻldosh oʻgʻli",0,"",null,null,"",""]
[{"$f":"SUBTOTAL(103,B79)*(B79<>\"\")*(MAX(A$60:A78)+1)","v":19},"Qurbonov Shahriyor Uralovich",0,"",null,null,"",""]
[{"$f":"SUBTOTAL(103,B80)*(B80<>\"\")*(MAX(A$60:A79)+1)","v":20},"Mamatqulova Muyassarxon Ashurmuhammadovna",0,"",null,null,"",""]
[{"$f":"SUBTOTAL(103,B81)*(B81<>\"\")*(MAX(A$60:A80)+1)","v":21},"Mamatqulova Sevara Faxriddin qizi",0,"",null,null,"",""]
[{"$f":"SUBTOTAL(103,B82)*(B82<>\"\")*(MAX(A$60:A81)+1)","v":22},"Mardonov Sirojiddin Abdivoxidovich",0,"",null,null,"",""]
[{"$f":"SUBTOTAL(103,B83)*(B83<>\"\")*(MAX(A$60:A82)+1)","v":23},"Mengliev Bekzod Hasan oʻgʻli",0,"",null,null,"",""]
[{"$f":"SUBTOTAL(103,B84)*(B84<>\"\")*(MAX(A$60:A83)+1)","v":24},"Muxamadiev Raximjon Farxodjon oʻgʻli",0,"",null,null,"",""]
[{"$f":"SUBTOTAL(103,B85)*(B85<>\"\")*(MAX(A$60:A84)+1)","v":25},"Normurodov Maxsudbek Yunusovich",0,"",null,null,"",""]
[{"$f":"SUBTOTAL(103,B86)*(B86<>\"\")*(MAX(A$60:A85)+1)","v":26},"Nurova Farogʻat Salohiddin qizi",0,"",null,null,"",""]
[{"$f":"SUBTOTAL(103,B87)*(B87<>\"\")*(MAX(A$60:A86)+1)","v":27},"Pardaev Shuhratjon Jahongirovich",0,"",null,null,"",""]
[{"$f":"SUBTOTAL(103,B88)*(B88<>\"\")*(MAX(A$60:A87)+1)","v":28},"Ravshanova Munisa Hasan qizi",0,"",null,null,"",""]
[{"$f":"SUBTOTAL(103,B89)*(B89<>\"\")*(MAX(A$60:A88)+1)","v":29},"Raximov Asliddin Raxmiddin oʻgʻli",0,"",null,null,"",""]
[{"$f":"SUBTOTAL(103,B90)*(B90<>\"\")*(MAX(A$60:A89)+1)","v":30},"Roʻziboev Elbek Abdufattoh oʻgʻli",0,"",null,null,"",""]
[{"$f":"A42","v":"JN va ON oʻtkazgan professor-oʻqituvchi imzosi"}]
["Jami talabalar soni:",null,{"$f":"COUNTIF(B60:B90,\"?*\")-1","v":30},"5 (aʻlo)",{"$f":"COUNTIF(D60:D90,\"5*\")","v":0}]
[null,null," ","4 (yaxshi)",{"$f":"COUNTIF(D60:D90,\"4*\")","v":0}]
[null,null,null,"3 (qoniqarli)",{"$f":"COUNTIF(D60:D90,\"3*\")","v":0}]
[null,null,null,"oʻzlashtira olmagan",{"$f":"COUNTIF(D60:D90,\"2*\")","v":0}]
[null,null,null,"kelmagan",{"$f":"COUNTIF(D60:D90,\"k*\")","v":0}]
[null,{"$f":"B48","v":"Fakultet dekani ____________ A.Absamatov"},null,{"$f":"D48","v":"Kafedra mudiri:__________________"}]
[null,{"$f":"B49","v":"        M.Oʻ.            Imzo                    F.I.SH."},null,{"$f":"D49","v":"         Imzo                    F.I.SH."}]
[null,null,null,null,"8b-shakl"]
[{"$f":"A51","v":"OʻZBEKISTON RESPUBLIKASI OLIY TAʻLIM, FAN VA INNOVATSIYALAR VAZIRLIGI"}]
[{"$f":"A52","v":"TERMIZ DAVLAT UNIVERSITETI"}]
[{"$f":"A4","v":"BAHOLASH QAYDNOMASI №___"}]
[{"$f":"A54","v":"IQTISODIYOT VA TURIZM FAKULTETI IQTISODIYOT TAʻLIM YOʻNALISHI 1-KURS 1-SEMESTR 101-GURUH"}]
[{"$f":"A55","v":"Mikroiqtisodiyot"}]
[{"$f":"A7","v":"Maʻruza oʻqituvchisi: "},null,null,{"$f":"+D7","v":"Amaliyot oʻqituvchisi: "}]
["YaN oʻtkazuvchi komissiya: "]
[{"$f":"A58","v":"Semestrda fanga ajratilgan umumiy soatlar:"},null,null,{"$f":"+D9","v":"YaN oʻtkazilgan sana: "}]
[]
[{"$f":"A60","v":"№"},{"$f":"B60","v":"Talabaning familiyasi, ismi, sharifi"},{"$f":"C60","v":"Reyting daftarchasining raqami"},{"$f":"D60","v":"YaN"},{"$f":"E60","v":"YaN oʻtkazuvchining imzosi"},"YaN"]
[{"$f":"SUBTOTAL(103,B110)*(B110<>\"\")*(MAX(A$109:A109)+1)","v":1},{"$f":"IF(D61<=\"2 (qoniqarsiz)\",B61,IF(D61=\"kelmagan\",B61,\"\"))","v":"Abdullaeva Dilfuza Bahodir qizi"},{"$f":"C12","v":0},{"$f":"H110","v":""},null,null,{"$f":"IF(D110=\"5 (a'lo)\",5,IF(AND(D110=\"4 (yaxshi)\"),4,IF(AND(D110=\"3 (qoniqarli)\"),3,IF(AND(D110=\"2 (qoniqarsiz)\"),2,IF(AND(D110=\"kelmagan\"),1,IF(AND(D110=\"\"), \"\",))))))","v":""},{"$f":"IF(F110=5,\"5 (a'lo)\",IF(AND(F110=4),\"4 (yaxshi)\",IF(AND(F110=3),\"3 (qoniqarli)\",IF(AND(F110=2),\"2 (qoniqarsiz)\",IF(AND(F110=1),\"kelmagan\",IF(AND(F110=\"\"),\"\",))))))","v":""}]
[{"$f":"SUBTOTAL(103,B111)*(B111<>\"\")*(MAX(A$109:A110)+1)","v":2},"Abduraimov Asilbek Eralievich",0,{"$f":"H111","v":""},null,null,{"$f":"IF(D111=\"5 (a'lo)\",5,IF(AND(D111=\"4 (yaxshi)\"),4,IF(AND(D111=\"3 (qoniqarli)\"),3,IF(AND(D111=\"2 (qoniqarsiz)\"),2,IF(AND(D111=\"kelmagan\"),1,IF(AND(D111=\"\"), \"\",))))))","v":""},{"$f":"IF(F111=5,\"5 (a'lo)\",IF(AND(F111=4),\"4 (yaxshi)\",IF(AND(F111=3),\"3 (qoniqarli)\",IF(AND(F111=2),\"2 (qoniqarsiz)\",IF(AND(F111=1),\"kelmagan\",IF(AND(F111=\"\"),\"\",))))))","v":""}]
[{"$f":"SUBTOTAL(103,B112)*(B112<>\"\")*(MAX(A$109:A111)+1)","v":3},"Abdurashidova Elnora Yoʻlchi qizi",0,"",null,null,"",""]
[{"$f":"SUBTOTAL(103,B113)*(B113<>\"\")*(MAX(A$109:A112)+1)","v":4},"Abdusattorov Baxtiyor Ibragim oʻgʻli",0,"",null,null,"",""]
[{"$f":"SUBTOTAL(103,B114)*(B114<>\"\")*(MAX(A$109:A113)+1)","v":5},"Avazov Mirzohid Akmal oʻgʻli",0,"",null,null,"",""]
[{"$f":"SUBTOTAL(103,B115)*(B115<>\"\")*(MAX(A$109:A114)+1)","v":6},"Adinaev Javohirbek Bahodir oʻgʻli",0,"",null,null,"",""]
[{"$f":"SUBTOTAL(103,B116)*(B116<>\"\")*(MAX(A$109:A115)+1)","v":7},"Allamurodov Bexruz Allamurod oʻgʻli",0,"",null,null,"",""]
[{"$f":"SUBTOTAL(103,B117)*(B117<>\"\")*(MAX(A$109:A116)+1)","v":8},"Axmedov Alisher Oʻktamboevich",0,"",null,null,"",""]
[{"$f":"SUBTOTAL(103,B118)*(B118<>\"\")*(MAX(A$109:A117)+1)","v":9},"Jamolov Bejan Xurshidovich",0,"",null,null,"",""]
[{"$f":"SUBTOTAL(103,B119)*(B119<>\"\")*(MAX(A$109:A118)+1)","v":10},"Jumaeva Nigina Baxtiyor qizi",0,"",null,null,"",""]
[{"$f":"SUBTOTAL(103,B120)*(B120<>\"\")*(MAX(A$109:A119)+1)","v":11},"Joʻraev Farrux Sobirovich",0,"",null,null,"",""]
[{"$f":"SUBTOTAL(103,B121)*(B121<>\"\")*(MAX(A$109:A120)+1)","v":12},"Joʻraqulov Tolibjon Oʻktamovich",0,"",null,null,"",""]
[{"$f":"SUBTOTAL(103,B122)*(B122<>\"\")*(MAX(A$109:A121)+1)","v":13},"Ibragimov Abbos Avaz oʻgʻli",0,"",null,null,"",""]
[{"$f":"SUBTOTAL(103,B123)*(B123<>\"\")*(MAX(A$109:A122)+1)","v":14},"Karajanov Nurmuxammed Abdireiimovich",0,"",null,null,"",""]
[{"$f":"SUBTOTAL(103,B124)*(B124<>\"\")*(MAX(A$109:A123)+1)","v":15},"Karimov Bozor Abdugʻapparovich",0,"",null,null,"",""]
[{"$f":"SUBTOTAL(103,B125)*(B125<>\"\")*(MAX(A$109:A124)+1)","v":16},"Karimova Maftuna Komiljon qizi",0,"",null,null,"",""]
[{"$f":"SUBTOTAL(103,B126)*(B126<>\"\")*(MAX(A$109:A125)+1)","v":17},"Qodirov Jahongir Turgʻun oʻgʻli",0,"",null,null,"",""]
[{"$f":"SUBTOTAL(103,B127)*(B127<>\"\")*(MAX(A$109:A126)+1)","v":18},"Qurbonov Azizbek Yoʻldosh oʻgʻli",0,"",null,null,"",""]
[{"$f":"SUBTOTAL(103,B128)*(B128<>\"\")*(MAX(A$109:A127)+1)","v":19},"Qurbonov Shahriyor Uralovich",0,"",null,null,"",""]
[{"$f":"SUBTOTAL(103,B129)*(B129<>\"\")*(MAX(A$109:A128)+1)","v":20},"Mamatqulova Muyassarxon Ashurmuhammadovna",0,"",null,null,"",""]
[{"$f":"SUBTOTAL(103,B130)*(B130<>\"\")*(MAX(A$109:A129)+1)","v":21},"Mamatqulova Sevara Faxriddin qizi",0,"",null,null,"",""]
[{"$f":"SUBTOTAL(103,B131)*(B131<>\"\")*(MAX(A$109:A130)+1)","v":22},"Mardonov Sirojiddin Abdivoxidovich",0,"",null,null,"",""]
[{"$f":"SUBTOTAL(103,B132)*(B132<>\"\")*(MAX(A$109:A131)+1)","v":23},"Mengliev Bekzod Hasan oʻgʻli",0,"",null,null,"",""]
[{"$f":"SUBTOTAL(103,B133)*(B133<>\"\")*(MAX(A$109:A132)+1)","v":24},"Muxamadiev Raximjon Farxodjon oʻgʻli",0,"",null,null,"",""]
[{"$f":"SUBTOTAL(103,B134)*(B134<>\"\")*(MAX(A$109:A133)+1)","v":25},"Normurodov Maxsudbek Yunusovich",0,"",null,null,"",""]
[{"$f":"SUBTOTAL(103,B135)*(B135<>\"\")*(MAX(A$109:A134)+1)","v":26},"Nurova Farogʻat Salohiddin qizi",0,"",null,null,"",""]
[{"$f":"SUBTOTAL(103,B136)*(B136<>\"\")*(MAX(A$109:A135)+1)","v":27},"Pardaev Shuhratjon Jahongirovich",0,"",null,null,"",""]
[{"$f":"SUBTOTAL(103,B137)*(B137<>\"\")*(MAX(A$109:A136)+1)","v":28},"Ravshanova Munisa Hasan qizi",0,"",null,null,"",""]
[{"$f":"SUBTOTAL(103,B138)*(B138<>\"\")*(MAX(A$109:A137)+1)","v":29},"Raximov Asliddin Raxmiddin oʻgʻli",0,"",null,null,"",""]
[{"$f":"SUBTOTAL(103,B139)*(B139<>\"\")*(MAX(A$109:A138)+1)","v":30},"Roʻziboev Elbek Abdufattoh oʻgʻli",0,"",null,null,"",""]
[{"$f":"A42","v":"JN va ON oʻtkazgan professor-oʻqituvchi imzosi"}]
[null,"Jami talabalar soni:",{"$f":"COUNTIF(B109:B139,\"?*\")-1","v":30},"5 (aʻlo)",{"$f":"COUNTIF(D109:D139,\"5*\")","v":0}]
[null,null," ","4 (yaxshi)",{"$f":"COUNTIF(D109:D139,\"4*\")","v":0}]
[null,null,null,"3 (qoniqarli)",{"$f":"COUNTIF(D109:D139,\"3*\")","v":0}]
[null,null,null,"oʻzlashtira olmagan",{"$f":"COUNTIF(D109:D139,\"2*\")","v":0}]
[null,null,null,"kelmagan",{"$f":"COUNTIF(D109:D139,\"k*\")","v":0}]
[]
[null,{"$f":"B48","v":"Fakultet dekani ____________ A.Absamatov"},null,{"$f":"D48","v":"Kafedra mudiri:__________________"}]
[null,{"$f":"B49","v":"        M.Oʻ.            Imzo                    F.I.SH."},null,{"$f":"D49","v":"         Imzo                    F.I.SH."}]

{"sheet":"Audit","index":9,"n_rows":148,"n_cols":8,"rows_kept":148,"cut":false,"hidden":false,"merged":[[1,0,1,4],[2,0,2,4],[3,0,3,4],[4,0,4,4],[5,0,5,4],[6,0,6,1],[7,0,7,4],[8,0,8,1],[41,0,41,2],[42,0,42,1],[48,1,48,2],[48,3,48,4],[50,0,50,4],[50,10,51,10],[51,0,51,4],[52,0,52,4],[52,10,53,10],[53,0,53,4],[54,0,54,4],[54,10,55,10],[55,0,55,2],[55,3,55,4],[56,0,56,4],[57,0,57,1],[57,3,57,4],[90,0,90,2],[91,0,91,1],[97,1,97,2],[97,3,97,4],[99,0,99,4],[100,0,100,4],[101,0,101,4],[102,0,102,4],[103,0,103,4],[104,0,104,2],[104,3,104,4],[105,0,105,4],[149,1,149,2],[149,3,149,4],[106,0,106,1],[106,3,106,4],[139,0,139,2],[147,1,147,2],[147,3,147,4],[148,3,148,4]]}
[null,null,null,null,"8-shakl"]
["OʻZBEKISTON RESPUBLIKASI OLIY TAʻLIM, FAN VA INNOVATSIYALAR VAZIRLIGI"]
["TERMIZ DAVLAT UNIVERSITETI"]
["BAHOLASH QAYDNOMASI №___"]
["IQTISODIYOT VA TURIZM FAKULTETI IQTISODIYOT TAʻLIM YOʻNALISHI 1-KURS 1-SEMESTR 101-GURUH"]
["Audit"]
["Maʻruza oʻqituvchisi: ",null,null,"Amaliyot oʻqituvchisi: "]
["YaN oʻtkazuvchi komissiya: "]
["Semestrda fanga ajratilgan umumiy soatlar:",null,null,"YaN oʻtkazilgan sana: "]
[]
["№","Talabaning familiyasi, ismi, sharifi","Reyting daftarchasining raqami","YaN","YaN oʻtkazuvchining imzosi","YaN"]
[1,"Abdullaeva Dilfuza Bahodir qizi",null,{"$f":"H12","v":""},null,null,{"$f":"IF(D12=\"5 (a'lo)\",5,IF(AND(D12=\"4 (yaxshi)\"),4,IF(AND(D12=\"3 (qoniqarli)\"),3,IF(AND(D12=\"2 (qoniqarsiz)\"),2,IF(AND(D12=\"kelmagan\"),1,IF(AND(D12=\"\"), \"\",))))))","v":""},{"$f":"IF(F12=5,\"5 (a'lo)\",IF(AND(F12=4),\"4 (yaxshi)\",IF(AND(F12=3),\"3 (qoniqarli)\",IF(AND(F12=2),\"2 (qoniqarsiz)\",IF(AND(F12=1),\"kelmagan\",IF(AND(F12=\"\"),\"\",))))))","v":""}]
[2,"Abduraimov Asilbek Eralievich",null,{"$f":"H13","v":""},null,null,{"$f":"IF(D13=\"5 (a'lo)\",5,IF(AND(D13=\"4 (yaxshi)\"),4,IF(AND(D13=\"3 (qoniqarli)\"),3,IF(AND(D13=\"2 (qoniqarsiz)\"),2,IF(AND(D13=\"kelmagan\"),1,IF(AND(D13=\"\"), \"\",))))))","v":""},{"$f":"IF(F13=5,\"5 (a'lo)\",IF(AND(F13=4),\"4 (yaxshi)\",IF(AND(F13=3),\"3 (qoniqarli)\",IF(AND(F13=2),\"2 (qoniqarsiz)\",IF(AND(F13=1),\"kelmagan\",IF(AND(F13=\"\"),\"\",))))))","v":""}]
[3,"Abdurashidova Elnora Yoʻlchi qizi",null,"",null,null,"",""]
[4,"Abdusattorov Baxtiyor Ibragim oʻgʻli",null,"",null,null,"",""]
[5,"Avazov Mirzohid Akmal oʻgʻli",null,"",null,null,"",""]
[6,"Adinaev Javohirbek Bahodir oʻgʻli",null,"",null,null,"",""]
[7,"Allamurodov Bexruz Allamurod oʻgʻli",null,"",null,null,"",""]
[8,"Axmedov Alisher Oʻktamboevich",null,"",null,null,"",""]
[9,"Jamolov Bejan Xurshidovich",null,"",null,null,"",""]
[10,"Jumaeva Nigina Baxtiyor qizi",null,"",null,null,"",""]
[11,"Joʻraev Farrux Sobirovich",null,"",null,null,"",""]
[12,"Joʻraqulov Tolibjon Oʻktamovich",null,"",null,null,"",""]
[13,"Ibragimov Abbos Avaz oʻgʻli",null,"",null,null,"",""]
[14,"Karajanov Nurmuxammed Abdireiimovich",null,"",null,null,"",""]
[15,"Karimov Bozor Abdugʻapparovich",null,"",null,null,"",""]
[16,"Karimova Maftuna Komiljon qizi",null,"",null,null,"",""]
[17,"Qodirov Jahongir Turgʻun oʻgʻli",null,"",null,null,"",""]
[18,"Qurbonov Azizbek Yoʻldosh oʻgʻli",null,"",null,null,"",""]
[19,"Qurbonov Shahriyor Uralovich",null,"",null,null,"",""]
[20,"Mamatqulova Muyassarxon Ashurmuhammadovna",null,"",null,null,"",""]
[21,"Mamatqulova Sevara Faxriddin qizi",null,"",null,null,"",""]
[22,"Mardonov Sirojiddin Abdivoxidovich",null,"",null,null,"",""]
[23,"Mengliev Bekzod Hasan oʻgʻli",null,"",null,null,"",""]
[24,"Muxamadiev Raximjon Farxodjon oʻgʻli",null,"",null,null,"",""]
[25,"Normurodov Maxsudbek Yunusovich",null,"",null,null,"",""]
[26,"Nurova Farogʻat Salohiddin qizi",null,"",null,null,"",""]
[27,"Pardaev Shuhratjon Jahongirovich",null,"",null,null,"",""]
[28,"Ravshanova Munisa Hasan qizi",null,"",null,null,"",""]
[29,"Raximov Asliddin Raxmiddin oʻgʻli",null,"",null,null,"",""]
[30,"Roʻziboev Elbek Abdufattoh oʻgʻli",null,{"$f":"H41","v":""},null,null,"",""]
["JN va ON oʻtkazgan professor-oʻqituvchi imzosi"]
["Jami talabalar soni:",null,{"$f":"COUNTIF(B11:B41,\"?*\")-1","v":30},"5 (aʻlo)",{"$f":"COUNTIF(D11:D41,\"5*\")","v":0}]
[null,null," ","4 (yaxshi)",{"$f":"COUNTIF(D11:D41,\"4*\")","v":0}]
[null,null,null,"3 (qoniqarli)",{"$f":"COUNTIF(D11:D41,\"3*\")","v":0}]
[null,null,null,"oʻzlashtira olmagan",{"$f":"COUNTIF(D11:D41,\"2*\")","v":0}]
[null,null,null,"kelmagan",{"$f":"COUNTIF(D11:D41,\"k*\")","v":0}]
[null,"Fakultet dekani ____________ A.Absamatov",null,"Kafedra mudiri:__________________"]
[null,"        M.Oʻ.            Imzo                    F.I.SH.",null,"         Imzo                    F.I.SH."]
[null,null,null,null,"8a-shakl"]
[{"$f":"A2","v":"OʻZBEKISTON RESPUBLIKASI OLIY TAʻLIM, FAN VA INNOVATSIYALAR VAZIRLIGI"}]
["TERMIZ DAVLAT UNIVERSITETI"]
["BAHOLASH QAYDNOMASI №___"]
["IQTISODIYOT VA TURIZM FAKULTETI IQTISODIYOT TAʻLIM YOʻNALISHI 1-KURS 1-SEMESTR 101-GURUH"]
["Audit"]
["Maʻruza oʻqituvchisi: ",null,null,{"$f":"+D7","v":"Amaliyot oʻqituvchisi: "}]
["YaN oʻtkazuvchi komissiya: "]
[{"$f":"A9","v":"Semestrda fanga ajratilgan umumiy soatlar:"},null,null,{"$f":"+D9","v":"YaN oʻtkazilgan sana: "}]
[]
[{"$f":"A11","v":"№"},{"$f":"B11","v":"Talabaning familiyasi, ismi, sharifi"},{"$f":"C11","v":"Reyting daftarchasining raqami"},{"$f":"D11","v":"YaN"},{"$f":"E11","v":"YaN oʻtkazuvchining imzosi"},"YaN"]
[{"$f":"SUBTOTAL(103,B61)*(B61<>\"\")*(MAX(A$60:A60)+1)","v":1},{"$f":"IF(D12<=\"2 (qoniqarsiz)\",B12,IF(D12=\"kelmagan\",B12,\"\"))","v":"Abdullaeva Dilfuza Bahodir qizi"},{"$f":"C12","v":0},{"$f":"H61","v":""},null,null,{"$f":"IF(D61=\"5 (a'lo)\",5,IF(AND(D61=\"4 (yaxshi)\"),4,IF(AND(D61=\"3 (qoniqarli)\"),3,IF(AND(D61=\"2 (qoniqarsiz)\"),2,IF(AND(D61=\"kelmagan\"),1,IF(AND(D61=\"\"), \"\",))))))","v":""},{"$f":"IF(F61=5,\"5 (a'lo)\",IF(AND(F61=4),\"4 (yaxshi)\",IF(AND(F61=3),\"3 (qoniqarli)\",IF(AND(F61=2),\"2 (qoniqarsiz)\",IF(AND(F61=1),\"kelmagan\",IF(AND(F61=\"\"),\"\",))))))","v":""}]
[{"$f":"SUBTOTAL(103,B62)*(B62<>\"\")*(MAX(A$60:A61)+1)","v":2},"Abduraimov Asilbek Eralievich",0,"",null,null,{"$f":"IF(D62=\"5 (a'lo)\",5,IF(AND(D62=\"4 (yaxshi)\"),4,IF(AND(D62=\"3 (qoniqarli)\"),3,IF(AND(D62=\"2 (qoniqarsiz)\"),2,IF(AND(D62=\"kelmagan\"),1,IF(AND(D62=\"\"), \"\",))))))","v":""},{"$f":"IF(F62=5,\"5 (a'lo)\",IF(AND(F62=4),\"4 (yaxshi)\",IF(AND(F62=3),\"3 (qoniqarli)\",IF(AND(F62=2),\"2 (qoniqarsiz)\",IF(AND(F62=1),\"kelmagan\",IF(AND(F62=\"\"),\"\",))))))","v":""}]
[{"$f":"SUBTOTAL(103,B63)*(B63<>\"\")*(MAX(A$60:A62)+1)","v":3},"Abdurashidova Elnora Yoʻlchi qizi",0,"",null,null,"",""]
[{"$f":"SUBTOTAL(103,B64)*(B64<>\"\")*(MAX(A$60:A63)+1)","v":4},"Abdusattorov Baxtiyor Ibragim oʻgʻli",0,"",null,null,"",""]
[{"$f":"SUBTOTAL(103,B65)*(B65<>\"\")*(MAX(A$60:A64)+1)","v":5},"Avazov Mirzohid Akmal oʻgʻli",0,"",null,null,"",""]
[{"$f":"SUBTOTAL(103,B66)*(B66<>\"\")*(MAX(A$60:A65)+1)","v":6},"Adinaev Javohirbek Bahodir oʻgʻli",0,"",null,null,"",""]
[{"$f":"SUBTOTAL(103,B67)*(B67<>\"\")*(MAX(A$60:A66)+1)","v":7},"Allamurodov Bexruz Allamurod oʻgʻli",0,"",null,null,"",""]
[{"$f":"SUBTOTAL(103,B68)*(B68<>\"\")*(MAX(A$60:A67)+1)","v":8},"Axmedov Alisher Oʻktamboevich",0,"",null,null,"",""]
[{"$f":"SUBTOTAL(103,B69)*(B69<>\"\")*(MAX(A$60:A68)+1)","v":9},"Jamolov Bejan Xurshidovich",0,"",null,null,"",""]
[{"$f":"SUBTOTAL(103,B70)*(B70<>\"\")*(MAX(A$60:A69)+1)","v":10},"Jumaeva Nigina Baxtiyor qizi",0,"",null,null,"",""]
[{"$f":"SUBTOTAL(103,B71)*(B71<>\"\")*(MAX(A$60:A70)+1)","v":11},"Joʻraev Farrux Sobirovich",0,"",null,null,"",""]
[{"$f":"SUBTOTAL(103,B72)*(B72<>\"\")*(MAX(A$60:A71)+1)","v":12},"Joʻraqulov Tolibjon Oʻktamovich",0,"",null,null,"",""]
[{"$f":"SUBTOTAL(103,B73)*(B73<>\"\")*(MAX(A$60:A72)+1)","v":13},"Ibragimov Abbos Avaz oʻgʻli",0,"",null,null,"",""]
[{"$f":"SUBTOTAL(103,B74)*(B74<>\"\")*(MAX(A$60:A73)+1)","v":14},"Karajanov Nurmuxammed Abdireiimovich",0,"",null,null,"",""]
[{"$f":"SUBTOTAL(103,B75)*(B75<>\"\")*(MAX(A$60:A74)+1)","v":15},"Karimov Bozor Abdugʻapparovich",0,"",null,null,"",""]
[{"$f":"SUBTOTAL(103,B76)*(B76<>\"\")*(MAX(A$60:A75)+1)","v":16},"Karimova Maftuna Komiljon qizi",0,"",null,null,"",""]
[{"$f":"SUBTOTAL(103,B77)*(B77<>\"\")*(MAX(A$60:A76)+1)","v":17},"Qodirov Jahongir Turgʻun oʻgʻli",0,"",null,null,"",""]
[{"$f":"SUBTOTAL(103,B78)*(B78<>\"\")*(MAX(A$60:A77)+1)","v":18},"Qurbonov Azizbek Yoʻldosh oʻgʻli",0,"",null,null,"",""]
[{"$f":"SUBTOTAL(103,B79)*(B79<>\"\")*(MAX(A$60:A78)+1)","v":19},"Qurbonov Shahriyor Uralovich",0,"",null,null,"",""]
[{"$f":"SUBTOTAL(103,B80)*(B80<>\"\")*(MAX(A$60:A79)+1)","v":20},"Mamatqulova Muyassarxon Ashurmuhammadovna",0,"",null,null,"",""]
[{"$f":"SUBTOTAL(103,B81)*(B81<>\"\")*(MAX(A$60:A80)+1)","v":21},"Mamatqulova Sevara Faxriddin qizi",0,"",null,null,"",""]
[{"$f":"SUBTOTAL(103,B82)*(B82<>\"\")*(MAX(A$60:A81)+1)","v":22},"Mardonov Sirojiddin Abdivoxidovich",0,"",null,null,"",""]
[{"$f":"SUBTOTAL(103,B83)*(B83<>\"\")*(MAX(A$60:A82)+1)","v":23},"Mengliev Bekzod Hasan oʻgʻli",0,"",null,null,"",""]
[{"$f":"SUBTOTAL(103,B84)*(B84<>\"\")*(MAX(A$60:A83)+1)","v":24},"Muxamadiev Raximjon Farxodjon oʻgʻli",0,"",null,null,"",""]
[{"$f":"SUBTOTAL(103,B85)*(B85<>\"\")*(MAX(A$60:A84)+1)","v":25},"Normurodov Maxsudbek Yunusovich",0,"",null,null,"",""]
[{"$f":"SUBTOTAL(103,B86)*(B86<>\"\")*(MAX(A$60:A85)+1)","v":26},"Nurova Farogʻat Salohiddin qizi",0,"",null,null,"",""]
[{"$f":"SUBTOTAL(103,B87)*(B87<>\"\")*(MAX(A$60:A86)+1)","v":27},"Pardaev Shuhratjon Jahongirovich",0,"",null,null,"",""]
[{"$f":"SUBTOTAL(103,B88)*(B88<>\"\")*(MAX(A$60:A87)+1)","v":28},"Ravshanova Munisa Hasan qizi",0,"",null,null,"",""]
[{"$f":"SUBTOTAL(103,B89)*(B89<>\"\")*(MAX(A$60:A88)+1)","v":29},"Raximov Asliddin Raxmiddin oʻgʻli",0,"",null,null,"",""]
[{"$f":"SUBTOTAL(103,B90)*(B90<>\"\")*(MAX(A$60:A89)+1)","v":30},"Roʻziboev Elbek Abdufattoh oʻgʻli",0,"",null,null,"",""]
[{"$f":"A42","v":"JN va ON oʻtkazgan professor-oʻqituvchi imzosi"}]
["Jami talabalar soni:",null,{"$f":"COUNTIF(B60:B90,\"?*\")-1","v":30},"5 (aʻlo)",{"$f":"COUNTIF(D60:D90,\"5*\")","v":0}]
[null,null," ","4 (yaxshi)",{"$f":"COUNTIF(D60:D90,\"4*\")","v":0}]
[null,null,null,"3 (qoniqarli)",{"$f":"COUNTIF(D60:D90,\"3*\")","v":0}]
[null,null,null,"oʻzlashtira olmagan",{"$f":"COUNTIF(D60:D90,\"2*\")","v":0}]
[null,null,null,"kelmagan",{"$f":"COUNTIF(D60:D90,\"k*\")","v":0}]
[null,{"$f":"B48","v":"Fakultet dekani ____________ A.Absamatov"},null,{"$f":"D48","v":"Kafedra mudiri:__________________"}]
[null,{"$f":"B49","v":"        M.Oʻ.            Imzo                    F.I.SH."},null,{"$f":"D49","v":"         Imzo                    F.I.SH."}]
[null,null,null,null,"8b-shakl"]
[{"$f":"A51","v":"OʻZBEKISTON RESPUBLIKASI OLIY TAʻLIM, FAN VA INNOVATSIYALAR VAZIRLIGI"}]
[{"$f":"A52","v":"TERMIZ DAVLAT UNIVERSITETI"}]
[{"$f":"A4","v":"BAHOLASH QAYDNOMASI №___"}]
[{"$f":"A54","v":"IQTISODIYOT VA TURIZM FAKULTETI IQTISODIYOT TAʻLIM YOʻNALISHI 1-KURS 1-SEMESTR 101-GURUH"}]
[{"$f":"A55","v":"Audit"}]
[{"$f":"A7","v":"Maʻruza oʻqituvchisi: "},null,null,{"$f":"+D7","v":"Amaliyot oʻqituvchisi: "}]
["YaN oʻtkazuvchi komissiya: "]
[{"$f":"A58","v":"Semestrda fanga ajratilgan umumiy soatlar:"},null,null,{"$f":"+D9","v":"YaN oʻtkazilgan sana: "}]
[]
[{"$f":"A60","v":"№"},{"$f":"B60","v":"Talabaning familiyasi, ismi, sharifi"},{"$f":"C60","v":"Reyting daftarchasining raqami"},{"$f":"D60","v":"YaN"},{"$f":"E60","v":"YaN oʻtkazuvchining imzosi"},"YaN"]
[{"$f":"SUBTOTAL(103,B110)*(B110<>\"\")*(MAX(A$109:A109)+1)","v":1},{"$f":"IF(D61<=\"2 (qoniqarsiz)\",B61,IF(D61=\"kelmagan\",B61,\"\"))","v":"Abdullaeva Dilfuza Bahodir qizi"},{"$f":"C12","v":0},{"$f":"H110","v":""},null,null,{"$f":"IF(D110=\"5 (a'lo)\",5,IF(AND(D110=\"4 (yaxshi)\"),4,IF(AND(D110=\"3 (qoniqarli)\"),3,IF(AND(D110=\"2 (qoniqarsiz)\"),2,IF(AND(D110=\"kelmagan\"),1,IF(AND(D110=\"\"), \"\",))))))","v":""},{"$f":"IF(F110=5,\"5 (a'lo)\",IF(AND(F110=4),\"4 (yaxshi)\",IF(AND(F110=3),\"3 (qoniqarli)\",IF(AND(F110=2),\"2 (qoniqarsiz)\",IF(AND(F110=1),\"kelmagan\",IF(AND(F110=\"\"),\"\",))))))","v":""}]
[{"$f":"SUBTOTAL(103,B111)*(B111<>\"\")*(MAX(A$109:A110)+1)","v":2},"Abduraimov Asilbek Eralievich",0,{"$f":"H111","v":""},null,null,{"$f":"IF(D111=\"5 (a'lo)\",5,IF(AND(D111=\"4 (yaxshi)\"),4,IF(AND(D111=\"3 (qoniqarli)\"),3,IF(AND(D111=\"2 (qoniqarsiz)\"),2,IF(AND(D111=\"kelmagan\"),1,IF(AND(D111=\"\"), \"\",))))))","v":""},{"$f":"IF(F111=5,\"5 (a'lo)\",IF(AND(F111=4),\"4 (yaxshi)\",IF(AND(F111=3),\"3 (qoniqarli)\",IF(AND(F111=2),\"2 (qoniqarsiz)\",IF(AND(F111=1),\"kelmagan\",IF(AND(F111=\"\"),\"\",))))))","v":""}]
[{"$f":"SUBTOTAL(103,B112)*(B112<>\"\")*(MAX(A$109:A111)+1)","v":3},"Abdurashidova Elnora Yoʻlchi qizi",0,"",null,null,"",""]
[{"$f":"SUBTOTAL(103,B113)*(B113<>\"\")*(MAX(A$109:A112)+1)","v":4},"Abdusattorov Baxtiyor Ibragim oʻgʻli",0,"",null,null,"",""]
[{"$f":"SUBTOTAL(103,B114)*(B114<>\"\")*(MAX(A$109:A113)+1)","v":5},"Avazov Mirzohid Akmal oʻgʻli",0,"",null,null,"",""]
[{"$f":"SUBTOTAL(103,B115)*(B115<>\"\")*(MAX(A$109:A114)+1)","v":6},"Adinaev Javohirbek Bahodir oʻgʻli",0,"",null,null,"",""]
[{"$f":"SUBTOTAL(103,B116)*(B116<>\"\")*(MAX(A$109:A115)+1)","v":7},"Allamurodov Bexruz Allamurod oʻgʻli",0,"",null,null,"",""]
[{"$f":"SUBTOTAL(103,B117)*(B117<>\"\")*(MAX(A$109:A116)+1)","v":8},"Axmedov Alisher Oʻktamboevich",0,"",null,null,"",""]
[{"$f":"SUBTOTAL(103,B118)*(B118<>\"\")*(MAX(A$109:A117)+1)","v":9},"Jamolov Bejan Xurshidovich",0,"",null,null,"",""]
[{"$f":"SUBTOTAL(103,B119)*(B119<>\"\")*(MAX(A$109:A118)+1)","v":10},"Jumaeva Nigina Baxtiyor qizi",0,"",null,null,"",""]
[{"$f":"SUBTOTAL(103,B120)*(B120<>\"\")*(MAX(A$109:A119)+1)","v":11},"Joʻraev Farrux Sobirovich",0,"",null,null,"",""]
[{"$f":"SUBTOTAL(103,B121)*(B121<>\"\")*(MAX(A$109:A120)+1)","v":12},"Joʻraqulov Tolibjon Oʻktamovich",0,"",null,null,"",""]
[{"$f":"SUBTOTAL(103,B122)*(B122<>\"\")*(MAX(A$109:A121)+1)","v":13},"Ibragimov Abbos Avaz oʻgʻli",0,"",null,null,"",""]
[{"$f":"SUBTOTAL(103,B123)*(B123<>\"\")*(MAX(A$109:A122)+1)","v":14},"Karajanov Nurmuxammed Abdireiimovich",0,"",null,null,"",""]
[{"$f":"SUBTOTAL(103,B124)*(B124<>\"\")*(MAX(A$109:A123)+1)","v":15},"Karimov Bozor Abdugʻapparovich",0,"",null,null,"",""]
[{"$f":"SUBTOTAL(103,B125)*(B125<>\"\")*(MAX(A$109:A124)+1)","v":16},"Karimova Maftuna Komiljon qizi",0,"",null,null,"",""]
[{"$f":"SUBTOTAL(103,B126)*(B126<>\"\")*(MAX(A$109:A125)+1)","v":17},"Qodirov Jahongir Turgʻun oʻgʻli",0,"",null,null,"",""]
[{"$f":"SUBTOTAL(103,B127)*(B127<>\"\")*(MAX(A$109:A126)+1)","v":18},"Qurbonov Azizbek Yoʻldosh oʻgʻli",0,"",null,null,"",""]
[{"$f":"SUBTOTAL(103,B128)*(B128<>\"\")*(MAX(A$109:A127)+1)","v":19},"Qurbonov Shahriyor Uralovich",0,"",null,null,"",""]
[{"$f":"SUBTOTAL(103,B129)*(B129<>\"\")*(MAX(A$109:A128)+1)","v":20},"Mamatqulova Muyassarxon Ashurmuhammadovna",0,"",null,null,"",""]
[{"$f":"SUBTOTAL(103,B130)*(B130<>\"\")*(MAX(A$109:A129)+1)","v":21},"Mamatqulova Sevara Faxriddin qizi",0,"",null,null,"",""]
[{"$f":"SUBTOTAL(103,B131)*(B131<>\"\")*(MAX(A$109:A130)+1)","v":22},"Mardonov Sirojiddin Abdivoxidovich",0,"",null,null,"",""]
[{"$f":"SUBTOTAL(103,B132)*(B132<>\"\")*(MAX(A$109:A131)+1)","v":23},"Mengliev Bekzod Hasan oʻgʻli",0,"",null,null,"",""]
[{"$f":"SUBTOTAL(103,B133)*(B133<>\"\")*(MAX(A$109:A132)+1)","v":24},"Muxamadiev Raximjon Farxodjon oʻgʻli",0,"",null,null,"",""]
[{"$f":"SUBTOTAL(103,B134)*(B134<>\"\")*(MAX(A$109:A133)+1)","v":25},"Normurodov Maxsudbek Yunusovich",0,"",null,null,"",""]
[{"$f":"SUBTOTAL(103,B135)*(B135<>\"\")*(MAX(A$109:A134)+1)","v":26},"Nurova Farogʻat Salohiddin qizi",0,"",null,null,"",""]
[{"$f":"SUBTOTAL(103,B136)*(B136<>\"\")*(MAX(A$109:A135)+1)","v":27},"Pardaev Shuhratjon Jahongirovich",0,"",null,null,"",""]
[{"$f":"SUBTOTAL(103,B137)*(B137<>\"\")*(MAX(A$109:A136)+1)","v":28},"Ravshanova Munisa Hasan qizi",0,"",null,null,"",""]
[{"$f":"SUBTOTAL(103,B138)*(B138<>\"\")*(MAX(A$109:A137)+1)","v":29},"Raximov Asliddin Raxmiddin oʻgʻli",0,"",null,null,"",""]
[{"$f":"SUBTOTAL(103,B139)*(B139<>\"\")*(MAX(A$109:A138)+1)","v":30},"Roʻziboev Elbek Abdufattoh oʻgʻli",0,"",null,null,"",""]
[{"$f":"A42","v":"JN va ON oʻtkazgan professor-oʻqituvchi imzosi"}]
[null,"Jami talabalar soni:",{"$f":"COUNTIF(B109:B139,\"?*\")-1","v":30},"5 (aʻlo)",{"$f":"COUNTIF(D109:D139,\"5*\")","v":0}]
[null,null," ","4 (yaxshi)",{"$f":"COUNTIF(D109:D139,\"4*\")","v":0}]
[null,null,null,"3 (qoniqarli)",{"$f":"COUNTIF(D109:D139,\"3*\")","v":0}]
[null,null,null,"oʻzlashtira olmagan",{"$f":"COUNTIF(D109:D139,\"2*\")","v":0}]
[null,null,null,"kelmagan",{"$f":"COUNTIF(D109:D139,\"k*\")","v":0}]
[]
[null,{"$f":"B48","v":"Fakultet dekani ____________ A.Absamatov"},null,{"$f":"D48","v":"Kafedra mudiri:__________________"}]
[null,{"$f":"B49","v":"        M.Oʻ.            Imzo                    F.I.SH."},null,{"$f":"D49","v":"         Imzo                    F.I.SH."}]

{"sheet":"SEMESTR QAYDNOMASI","index":10,"n_rows":44,"n_cols":15,"rows_kept":44,"cut":false,"hidden":false,"merged":[[37,0,38,14],[4,0,4,14],[5,0,5,14]]}
[]
[]
[]
[]
["Termiz davlat universiteti Iqtisodiyot va turizm fakulteti Iqtisodiyot ta'lim yo`nalishi 2020-2021 o`quv yili 1-semestrida 1-kurs 101-guruh o`zlashtirish ko`rsatkichlarining"]
["SEMESTR QAYDNOMASI"]
["№","Talabaning familiyasi, ismi, sharifi","Budjet / Kontrakt",{"$f":"MB!A6","v":"Moliya bozori"},{"$f":"Soliq!A6","v":"Soliq"},{"$f":"DB!$A6","v":"Davlat budjeti"},{"$f":"PI!$A6","v":"Pensiya ishi"},{"$f":"PVB!$A6","v":"Pul va banklar"},{"$f":"'Moliyaviy boshqaruv'!$A6","v":"Moliyaviy boshqaruv"},{"$f":"'Korporativ moliya'!$A6","v":"Korporativ moliya"},{"$f":"Statistika!$A6","v":"Statistika"},{"$f":"Mikroiqtisodiyot!$A6","v":"Mikroiqtisodiyot"},{"$f":"Audit!$A6","v":"Audit"},"Stipendiya\n2; 3; 4; 5;  ","Izoh: (qaysi oydan stipendiyaga tavsiya etilgan yoki chetlashtirilgan, buyruq nomeri va sanasi)"]
[1,{"$f":"MB!B12","v":"Abdullaeva Dilfuza Bahodir qizi"},"К",{"$f":"IF(LARGE(IF(MB!$B$12:$B$139=B8,MB!$F$12:$F$139,\"\"),1)=1,\"kelmagan\",LARGE(IF(MB!$B$12:$B$139=B8,MB!$F$12:$F$139,\"\"),1))","v":3},null,null,null,null,null,null,null,null,null,{"$f":"IFERROR(HLOOKUP(\"kelmagan\",D8:M8,1,),MIN(D8:M8))","v":3}]
[2,{"$f":"MB!B13","v":"Abduraimov Asilbek Eralievich"},"К",{"$f":"IF(LARGE(IF(MB!$B$12:$B$139=B9,MB!$F$12:$F$139,\"\"),1)=1,\"kelmagan\",LARGE(IF(MB!$B$12:$B$139=B9,MB!$F$12:$F$139,\"\"),1))","v":4},{"$f":"Soliq!G13","v":""},{"$f":"DB!G13","v":""},null,null,null,null,null,null,null,4]
[3,{"$f":"MB!B14","v":"Abdurashidova Elnora Yoʻlchi qizi"},"К",{"$f":"IF(LARGE(IF(MB!$B$12:$B$139=B10,MB!$F$12:$F$139,\"\"),1)=1,\"kelmagan\",LARGE(IF(MB!$B$12:$B$139=B10,MB!$F$12:$F$139,\"\"),1))","v":5},{"$f":"Soliq!G14","v":""},{"$f":"DB!G14","v":""},null,null,null,null,null,null,null,5]
[4,{"$f":"MB!B15","v":"Abdusattorov Baxtiyor Ibragim oʻgʻli"},"К",{"$f":"IF(LARGE(IF(MB!$B$12:$B$139=B11,MB!$F$12:$F$139,\"\"),1)=1,\"kelmagan\",LARGE(IF(MB!$B$12:$B$139=B11,MB!$F$12:$F$139,\"\"),1))","v":3},{"$f":"Soliq!G15","v":""},{"$f":"DB!G15","v":""},null,null,null,null,null,null,null,3]
[5,{"$f":"MB!B16","v":"Avazov Mirzohid Akmal oʻgʻli"},"К",{"$f":"IF(LARGE(IF(MB!$B$12:$B$139=B12,MB!$F$12:$F$139,\"\"),1)=1,\"kelmagan\",LARGE(IF(MB!$B$12:$B$139=B12,MB!$F$12:$F$139,\"\"),1))","v":3},{"$f":"Soliq!G16","v":""},{"$f":"DB!G16","v":""},null,null,null,null,null,null,null,3]
[6,{"$f":"MB!B17","v":"Adinaev Javohirbek Bahodir oʻgʻli"},"К",{"$f":"IF(LARGE(IF(MB!$B$12:$B$139=B13,MB!$F$12:$F$139,\"\"),1)=1,\"kelmagan\",LARGE(IF(MB!$B$12:$B$139=B13,MB!$F$12:$F$139,\"\"),1))","v":4},{"$f":"Soliq!G17","v":""},{"$f":"DB!G17","v":""},null,null,null,null,null,null,null,4]
[7,{"$f":"MB!B18","v":"Allamurodov Bexruz Allamurod oʻgʻli"},"К",{"$f":"IF(LARGE(IF(MB!$B$12:$B$139=B14,MB!$F$12:$F$139,\"\"),1)=1,\"kelmagan\",LARGE(IF(MB!$B$12:$B$139=B14,MB!$F$12:$F$139,\"\"),1))","v":5},{"$f":"Soliq!G18","v":""},{"$f":"DB!G18","v":""},null,null,null,null,null,null,null,5]
[8,{"$f":"MB!B19","v":"Axmedov Alisher Oʻktamboevich"},"К",{"$f":"IF(LARGE(IF(MB!$B$12:$B$139=B15,MB!$F$12:$F$139,\"\"),1)=1,\"kelmagan\",LARGE(IF(MB!$B$12:$B$139=B15,MB!$F$12:$F$139,\"\"),1))","v":2},{"$f":"Soliq!G19","v":""},{"$f":"DB!G19","v":""},null,null,null,null,null,null,null,2]
[9,{"$f":"MB!B20","v":"Jamolov Bejan Xurshidovich"},"К",{"$f":"IF(LARGE(IF(MB!$B$12:$B$139=B16,MB!$F$12:$F$139,\"\"),1)=1,\"kelmagan\",LARGE(IF(MB!$B$12:$B$139=B16,MB!$F$12:$F$139,\"\"),1))","v":5},{"$f":"Soliq!G20","v":""},{"$f":"DB!G20","v":""},null,null,null,null,null,null,null,5]
[10,{"$f":"MB!B21","v":"Jumaeva Nigina Baxtiyor qizi"},"К",{"$f":"IF(LARGE(IF(MB!$B$12:$B$139=B17,MB!$F$12:$F$139,\"\"),1)=1,\"kelmagan\",LARGE(IF(MB!$B$12:$B$139=B17,MB!$F$12:$F$139,\"\"),1))","v":4},{"$f":"Soliq!G21","v":""},{"$f":"DB!G21","v":""},null,null,null,null,null,null,null,4]
[11,{"$f":"MB!B22","v":"Joʻraev Farrux Sobirovich"},"К",{"$f":"IF(LARGE(IF(MB!$B$12:$B$139=B18,MB!$F$12:$F$139,\"\"),1)=1,\"kelmagan\",LARGE(IF(MB!$B$12:$B$139=B18,MB!$F$12:$F$139,\"\"),1))","v":3},{"$f":"Soliq!G22","v":""},{"$f":"DB!G22","v":""},null,null,null,null,null,null,null,3]
[12,{"$f":"MB!B23","v":"Joʻraqulov Tolibjon Oʻktamovich"},"К",{"$f":"IF(LARGE(IF(MB!$B$12:$B$139=B19,MB!$F$12:$F$139,\"\"),1)=1,\"kelmagan\",LARGE(IF(MB!$B$12:$B$139=B19,MB!$F$12:$F$139,\"\"),1))","v":3},{"$f":"Soliq!G23","v":""},{"$f":"DB!G23","v":""},null,null,null,null,null,null,null,3]
[13,{"$f":"MB!B24","v":"Ibragimov Abbos Avaz oʻgʻli"},"К",{"$f":"IF(LARGE(IF(MB!$B$12:$B$139=B20,MB!$F$12:$F$139,\"\"),1)=1,\"kelmagan\",LARGE(IF(MB!$B$12:$B$139=B20,MB!$F$12:$F$139,\"\"),1))","v":3},{"$f":"Soliq!G24","v":""},{"$f":"DB!G24","v":""},null,null,null,null,null,null,null,3]
[14,{"$f":"MB!B25","v":"Karajanov Nurmuxammed Abdireiimovich"},"К",{"$f":"IF(LARGE(IF(MB!$B$12:$B$139=B21,MB!$F$12:$F$139,\"\"),1)=1,\"kelmagan\",LARGE(IF(MB!$B$12:$B$139=B21,MB!$F$12:$F$139,\"\"),1))","v":3},{"$f":"Soliq!G25","v":""},{"$f":"DB!G25","v":""},null,null,null,null,null,null,null,3]
[15,{"$f":"MB!B26","v":"Karimov Bozor Abdugʻapparovich"},"К",{"$f":"IF(LARGE(IF(MB!$B$12:$B$139=B22,MB!$F$12:$F$139,\"\"),1)=1,\"kelmagan\",LARGE(IF(MB!$B$12:$B$139=B22,MB!$F$12:$F$139,\"\"),1))","v":3},{"$f":"Soliq!G26","v":""},{"$f":"DB!G26","v":""},null,null,null,null,null,null,null,3]
[16,{"$f":"MB!B27","v":"Karimova Maftuna Komiljon qizi"},"К",{"$f":"IF(LARGE(IF(MB!$B$12:$B$139=B23,MB!$F$12:$F$139,\"\"),1)=1,\"kelmagan\",LARGE(IF(MB!$B$12:$B$139=B23,MB!$F$12:$F$139,\"\"),1))","v":3},{"$f":"Soliq!G27","v":""},{"$f":"DB!G27","v":""},null,null,null,null,null,null,null,3]
[17,{"$f":"MB!B28","v":"Qodirov Jahongir Turgʻun oʻgʻli"},"К",{"$f":"IF(LARGE(IF(MB!$B$12:$B$139=B24,MB!$F$12:$F$139,\"\"),1)=1,\"kelmagan\",LARGE(IF(MB!$B$12:$B$139=B24,MB!$F$12:$F$139,\"\"),1))","v":3},{"$f":"Soliq!G28","v":""},{"$f":"DB!G28","v":""},null,null,null,null,null,null,null,3]
[18,{"$f":"MB!B29","v":"Qurbonov Azizbek Yoʻldosh oʻgʻli"},"К",{"$f":"IF(LARGE(IF(MB!$B$12:$B$139=B25,MB!$F$12:$F$139,\"\"),1)=1,\"kelmagan\",LARGE(IF(MB!$B$12:$B$139=B25,MB!$F$12:$F$139,\"\"),1))","v":3},{"$f":"Soliq!G29","v":""},{"$f":"DB!G29","v":""},null,null,null,null,null,null,null,3]
[19,{"$f":"MB!B30","v":"Qurbonov Shahriyor Uralovich"},"К",{"$f":"IF(LARGE(IF(MB!$B$12:$B$139=B26,MB!$F$12:$F$139,\"\"),1)=1,\"kelmagan\",LARGE(IF(MB!$B$12:$B$139=B26,MB!$F$12:$F$139,\"\"),1))","v":3},{"$f":"Soliq!G30","v":""},{"$f":"DB!G30","v":""},null,null,null,null,null,null,null,3]
[20,{"$f":"MB!B31","v":"Mamatqulova Muyassarxon Ashurmuhammadovna"},"К",{"$f":"IF(LARGE(IF(MB!$B$12:$B$139=B27,MB!$F$12:$F$139,\"\"),1)=1,\"kelmagan\",LARGE(IF(MB!$B$12:$B$139=B27,MB!$F$12:$F$139,\"\"),1))","v":3},{"$f":"Soliq!G31","v":""},{"$f":"DB!G31","v":""},null,null,null,null,null,null,null,3]
[21,{"$f":"MB!B32","v":"Mamatqulova Sevara Faxriddin qizi"},"К",{"$f":"IF(LARGE(IF(MB!$B$12:$B$139=B28,MB!$F$12:$F$139,\"\"),1)=1,\"kelmagan\",LARGE(IF(MB!$B$12:$B$139=B28,MB!$F$12:$F$139,\"\"),1))","v":3},{"$f":"Soliq!G32","v":""},{"$f":"DB!G32","v":""},null,null,null,null,null,null,null,3]
[22,{"$f":"MB!B33","v":"Mardonov Sirojiddin Abdivoxidovich"},"К",{"$f":"IF(LARGE(IF(MB!$B$12:$B$139=B29,MB!$F$12:$F$139,\"\"),1)=1,\"kelmagan\",LARGE(IF(MB!$B$12:$B$139=B29,MB!$F$12:$F$139,\"\"),1))","v":3},{"$f":"Soliq!G33","v":""},{"$f":"DB!G33","v":""},null,null,null,null,null,null,null,3]
[23,{"$f":"MB!B34","v":"Mengliev Bekzod Hasan oʻgʻli"},"К",{"$f":"IF(LARGE(IF(MB!$B$12:$B$139=B30,MB!$F$12:$F$139,\"\"),1)=1,\"kelmagan\",LARGE(IF(MB!$B$12:$B$139=B30,MB!$F$12:$F$139,\"\"),1))","v":3},{"$f":"Soliq!G34","v":""},{"$f":"DB!G34","v":""},null,null,null,null,null,null,null,3]
[24,{"$f":"MB!B35","v":"Muxamadiev Raximjon Farxodjon oʻgʻli"},"К",{"$f":"IF(LARGE(IF(MB!$B$12:$B$139=B31,MB!$F$12:$F$139,\"\"),1)=1,\"kelmagan\",LARGE(IF(MB!$B$12:$B$139=B31,MB!$F$12:$F$139,\"\"),1))","v":3},{"$f":"Soliq!G35","v":""},{"$f":"DB!G35","v":""},null,null,null,null,null,null,null,3]
[25,{"$f":"MB!B36","v":"Normurodov Maxsudbek Yunusovich"},"К",{"$f":"IF(LARGE(IF(MB!$B$12:$B$139=B32,MB!$F$12:$F$139,\"\"),1)=1,\"kelmagan\",LARGE(IF(MB!$B$12:$B$139=B32,MB!$F$12:$F$139,\"\"),1))","v":3},{"$f":"Soliq!G36","v":""},null,null,null,null,null,null,null,null,3]
[26,{"$f":"MB!B37","v":"Nurova Farogʻat Salohiddin qizi"},"К",{"$f":"IF(LARGE(IF(MB!$B$12:$B$139=B33,MB!$F$12:$F$139,\"\"),1)=1,\"kelmagan\",LARGE(IF(MB!$B$12:$B$139=B33,MB!$F$12:$F$139,\"\"),1))","v":"kelmagan"},{"$f":"Soliq!G37","v":""},null,null,null,null,null,null,null,null,{"$f":"IFERROR(HLOOKUP(\"kelmagan\",D33:M33,1,),MIN(D33:M33))","v":"kelmagan"}]
[27,{"$f":"MB!B38","v":"Pardaev Shuhratjon Jahongirovich"},"К",{"$f":"IF(LARGE(IF(MB!$B$12:$B$139=B34,MB!$F$12:$F$139,\"\"),1)=1,\"kelmagan\",LARGE(IF(MB!$B$12:$B$139=B34,MB!$F$12:$F$139,\"\"),1))","v":3},{"$f":"Soliq!G38","v":""},{"$f":"DB!G38","v":""},null,null,null,null,null,null,null,{"$f":"IFERROR(HLOOKUP(\"kelmagan\",D34:M34,1,),MIN(D34:M34))","v":3}]
[28,{"$f":"MB!B39","v":"Ravshanova Munisa Hasan qizi"},"К",{"$f":"IF(LARGE(IF(MB!$B$12:$B$139=B35,MB!$F$12:$F$139,\"\"),1)=1,\"kelmagan\",LARGE(IF(MB!$B$12:$B$139=B35,MB!$F$12:$F$139,\"\"),1))","v":3},{"$f":"Soliq!G39","v":""},{"$f":"DB!G39","v":""},null,null,null,null,null,null,null,3]
[29,{"$f":"MB!B40","v":"Raximov Asliddin Raxmiddin oʻgʻli"},"К",{"$f":"IF(LARGE(IF(MB!$B$12:$B$139=B36,MB!$F$12:$F$139,\"\"),1)=1,\"kelmagan\",LARGE(IF(MB!$B$12:$B$139=B36,MB!$F$12:$F$139,\"\"),1))","v":3},{"$f":"Soliq!G40","v":""},{"$f":"DB!G40","v":""},null,null,null,null,null,null,null,3]
[30,{"$f":"MB!B41","v":"Roʻziboev Elbek Abdufattoh oʻgʻli"},"К",{"$f":"IF(LARGE(IF(MB!$B$12:$B$139=B37,MB!$F$12:$F$139,\"\"),1)=1,\"kelmagan\",LARGE(IF(MB!$B$12:$B$139=B37,MB!$F$12:$F$139,\"\"),1))","v":3},{"$f":"Soliq!G41","v":""},{"$f":"DB!G41","v":""},null,null,null,null,null,null,null,3]
["           Fakultet dekani:                                                                                              A.Absamatov"]
[]
[null,"Guruh bo`yicha o`zlashtirish"]
[null,"\" 5 \"",{"$f":"COUNTIF(N7:N37,\"5*\")","v":0}]
[null,"\" 4 \" ",{"$f":"COUNTIF(N7:N37,\"4*\")","v":0}]
[null,"\" 3 \"",{"$f":"COUNTIF(N7:N37,\"3*\")","v":0}]
[null,"\" 2 \"",{"$f":"COUNTIF(N7:N37,\"k*\")","v":1}]