{"text_format":"1","workbook":"xlsx","n_sheets":7,"sheets":["Акты в монтаж 30092021","РЭСы","Стоимости щитов","Дог.","Накладная","АПП ПИРнов","Титул"],"not_rendered":{"charts":0,"images":0,"macros":1,"external_links":20,"defined_names":546,"comments":1,"pivot_tables":0},"unopened":[],"bounds":{"document_bytes":16777216,"sheet_cells":100000,"rows_first":2000,"rows_last":500,"rows_between":2000,"halvings":0,"cell_chars":16384,"cell_head_chars":4096},"cells_cut":0,"cells_raw":0,"read":"whole","date_system":"1900"}

{"sheet":"Акты в монтаж 30092021","index":0,"n_rows":907,"n_cols":95,"rows_kept":907,"cut":false,"hidden":true,"merged":[]}
[null,null,null,null,null,null,null,null,null,null,null,null,null,null,null,null,null,null,null,null,null,"Замечания / к исправлению"]
[null,null,null,null,null,null,null,null,null,null,null,null,null,null,null,null,null,null,null,null,null,"Акты в стадии оформления",null,null,"Акты в стадии оформления"]
[null,null,null,null,null,null,null,null,null,null,null,null,null,null,null,null,null,null,null,null,null,"Оформленные Акты. Наш экземпляр получен",null,null,"Оформленные Акты. Наш экземпляр получен"]
[1,1,2,3,4,5,6,7,8,9,10,11,12,13,14,15,16,17,18,19,20,21,22,23,24,25,26,27,28,29,30,31,32,33]
["№","Титул","№ ТЗ","№ ТУ","Заявитель","Кадастровый номер","Населенный пункт","Улица","РЭС","Дата монтажа","№ Линии","№ Опоры","№ ТП","Тип счетчика","№ счетчика","№ пломбы","Дата выпуска счетчика","IP номер","№ Sim-карты","№ договора","Дата договора","№ Акта в монтаж","Дата Акта в монтаж","Стоимость ТМЦ","№ Акта о завершении монтажа (не=КС-3)","Дата Акта о завершении монтажа","№ КС-3","Дата КС-3","Столбец для проверки2","Столбец для проверки ещё3","Столбец для проверки ещё и ещё","Столбец2","Столбец1","Комментарий"]
[1,"Организация системы учета электроэнергии (ВЛ 0,4 кВ от ТП 006-48) в пос. Ушаково Гурьевского р-она","Z/СЭРС/014834/2021-25","Z-7111/20","Калинка НН","39:03:080809:113","Ушаково",null,"Мамоновский","20210616","3","6","006-48","CE308 S34.746.OG QYUVLFZ GS01 SPDS","012294163297983",1803029,"20210512",null,"+79114530421","231/СП","2021-07-19",103,"19.07.2021",17650.830000000002,{"$f":"Таблица1[[#This Row],[№ Акта в монтаж]]","v":103},{"$f":"Таблица1[[#This Row],[Дата КС-3]]","v":"31.08.2021"},1,"31.08.2021"]
[2,"Организация системы учета электроэнергии (ВЛ 0,4 кВ от ТП 006-62) по пер. VII Казачий в пос. Голубево Гурьевского р-она","Z/СЭРС/014936/2021-25","Z-7311/20","Кауркин КЮ","39:03:080817:2959","Голубево","пер Казачий VII 6","Мамоновский","20210616","1","16/1/3","006-62","CE308 S34.746.OG QYUVLFZ GS01 SPDS","012294163297843",1881183,"20210512",null,"+79114530464","231/СП","2021-07-19","154","19.07.2021",17650.830000000002,{"$f":"Таблица1[[#This Row],[№ Акта в монтаж]]","v":"154"},{"$f":"Таблица1[[#This Row],[Дата КС-3]]","v":"31.08.2021"},1,"31.08.2021"]
[3,"Организация системы учета электроэнергии ВЛ 0,4 кВ от ТП 025-31 в п. Рыбное, ул. Березовая Гурьевский район","Z/СЭРС/013301/2021-20","Z-4329/20","Януш МВ","39:03:091109:221","Рыбное","Берёзовая","Гурьевский","20210617","2","21","025-31","CE308 S34.746.OG QYUVLFZ GS01 SPDS","012294162223755",1817085,"20210409",null,"+79114530722","231/СП","2021-07-19",95,"19.07.2021",18078.59,{"$f":"Таблица1[[#This Row],[№ Акта в монтаж]]","v":95},{"$f":"Таблица1[[#This Row],[Дата КС-3]]","v":"31.08.2021"},1,"31.08.2021"]
[4,"Организация системы учета электроэнергии ВЛ 0,4 кВ от ТП 148-38 севернее п. Заозерье Гурьевского района","Z/СЭРС/013373/2021-20","Z-4707/20","Лосева ИА","39:03:060011:2071","Заозерье",null,"Гурьевский","20210617","1","24","148-38","CE308 S34.746.OG QYUVLFZ GS01 SPDS","012294163297907",1837678,"20210512",null,"+79114530365","231/СП","2021-07-19",99,"19.07.2021",17650.830000000002,{"$f":"Таблица1[[#This Row],[№ Акта в монтаж]]","v":99},{"$f":"Таблица1[[#This Row],[Дата КС-3]]","v":"31.08.2021"},1,"31.08.2021"]
[5,"Организация системы учета электроэнергии ВЛ 0,4 кВ от ТП 148-34 в п. Заозерье, ул. Чистопрудная Гурьевский район","Z/СЭРС/013406/2021-20","Z-4800/20","Кретинин ОО","39:03:060012:440","Заозерье","Чистпрудная 7","Гурьевский","20210617","3","5","148-34","CE308 S34.746.OG QYUVLFZ GS01 SPDS","012294162223752",1817092,"20210409",null,"+79114530599","231/СП","2021-07-19",98,"19.07.2021",18078.59,{"$f":"Таблица1[[#This Row],[№ Акта в монтаж]]","v":98},{"$f":"Таблица1[[#This Row],[Дата КС-3]]","v":"31.08.2021"},1,"31.08.2021"]
[6,"Организация системы учета электроэнергии ВЛ 0,4 кВ от ТП 025-02 в п. Рыбное, ул. Счастливая Гурьевского района","Z/СЭРС/013511/2021-20","Z-5259/20","Турецская ТВ","39:03:091109:105","Рыбное","Счастливая","Гурьевский","20210617","6","13","025-02","CE308 S34.746.OG QYUVLFZ GS01 SPDS","012294163298089",1836234,"20210512",null,"+79114530438","231/СП","2021-07-19",94,"19.07.2021",17650.830000000002,{"$f":"Таблица1[[#This Row],[№ Акта в монтаж]]","v":94},{"$f":"Таблица1[[#This Row],[Дата КС-3]]","v":"31.08.2021"},1,"31.08.2021"]
[7,"Организация системы учета электроэнергии  ВЛ 0,4 кВ от ТП 262-28 в п. Заозерье, ул. Каштановка Гурьевского района","Z/СЭРС/013709/2021-20","Z-5067/20","Зайко ВН","39:03:060011:2400","Заозерье","Каштановка","Гурьевский","20210617","2","11","262-28","CE308 S34.746.OG QYUVLFZ GS01 SPDS","012294162223758",1793626,"20210409",null,"+79114530576","231/СП","2021-07-19",92,"19.07.2021",17661.78,{"$f":"Таблица1[[#This Row],[№ Акта в монтаж]]","v":92},{"$f":"Таблица1[[#This Row],[Дата КС-3]]","v":"31.08.2021"},1,"31.08.2021"]
[8,"Организация системы учета электроэнергии  ВЛ 0,4 кВ от ТП 148-38 севернее п. Заозерье Гурьевский район","Z/СЭРС/013797/2021-20","Z-4708/20","Зелёная АЮ","39:03:060011:1956","Заозерье",null,"Гурьевский","20210617","1","17/1/4","148-38","CE308 S34.746.OG QYUVLFZ GS01 SPDS","012294163297832",1849723,"20210512",null,"+79114530503","231/СП","2021-07-19",87,"19.07.2021",17650.830000000002,{"$f":"Таблица1[[#This Row],[№ Акта в монтаж]]","v":87},{"$f":"Таблица1[[#This Row],[Дата КС-3]]","v":"31.08.2021"},1,"31.08.2021"]
[9,"Организация системы учета электроэнергии  ВЛ 0,4 кВ от ТП 025-31 в п. Рыбное, ул. Березовая Гурьевский район","Z/СЭРС/013973/2021-20","Z-4758/20","Афонасьев АВ","39:03:091109:220","Рыбное","Березовая 32","Гурьевский","20210617","2","22","025-31","CE308 S34.746.OG QYUVLFZ GS01 SPDS","012294163297723",1878343,"20210512",null,"+79114530566","231/СП","2021-07-19",78,"19.07.2021",17650.830000000002,{"$f":"Таблица1[[#This Row],[№ Акта в монтаж]]","v":78},{"$f":"Таблица1[[#This Row],[Дата КС-3]]","v":"31.08.2021"},1,"31.08.2021"]
[10,"Организация системы учета электроэнергии  ВЛ 0,4 кВ от ТП 025-31 в п. Рыбное, ул. Солнечная Гурьевский район","Z/СЭРС/014216/2021-20","Z-5704/20","Тюрин КС","39:03:091109:177","Рыбное","Солнечная","Гурьевский","20210617","4","17-2","025-31","CE308 S34.746.OG QYUVLFZ GS01 SPDS","012294163297833",1836180,"20210512",null,"+79114530526","231/СП","2021-07-19",79,"19.07.2021",17650.830000000002,{"$f":"Таблица1[[#This Row],[№ Акта в монтаж]]","v":79},{"$f":"Таблица1[[#This Row],[Дата КС-3]]","v":"31.08.2021"},1,"31.08.2021"]
[11,"Организация системы учета электроэнергии  ВЛ 0,4 кВ от ТП 262-26 северо-восточнее п. Заозерье Гурьевского района","Z/СЭРС/015291/2021-20","Z-7755/20","Белункина ЕА","39:03:060012:478","Заозерье",null,"Гурьевский","20210617","1","20/10/23","262-26","CE308 S34.746.OG QYUVLFZ GS01 SPDS","012294163297982",1803620,"20210512",null,"+79114530483","231/СП","2021-07-19",91,"19.07.2021",17650.830000000002,{"$f":"Таблица1[[#This Row],[№ Акта в монтаж]]","v":91},{"$f":"Таблица1[[#This Row],[Дата КС-3]]","v":"31.08.2021"},1,"31.08.2021"]
[12,"Организация системы учета электроэнергии  ВЛ 0,4 кВ от ТП 148-43 в п. Заозерье, ул. Бирюзовая Гурьевского района","Z/СЭРС/016084/2021-20","Z-991/21","Кориенко НВ","39:03:060012:762","Заозерье","Бирюзовая 32","Гурьевский","20210617","2","16","148-43","CE308 S34.746.OG QYUVLFZ GS01 SPDS","012294162223742",1817090,"20210409",null,"+79114530490","231/СП","2021-07-19",88,"19.07.2021",17661.78,{"$f":"Таблица1[[#This Row],[№ Акта в монтаж]]","v":88},{"$f":"Таблица1[[#This Row],[Дата КС-3]]","v":"31.08.2021"},1,"31.08.2021"]
[13,"Организация системы учета электроэнергии ВЛ 0,4 кВ от ТП 262-20 в п. Большое Исаково, ул. Мира Гурьевского района","Z/СЭРС/013287/2021-20","Z-4041/20","Мурадян ГА","39:03:020006:256","Б. Исаково","Мира ","Гурьевский","20210618","1","7","262-20","CE308 S34.746.OG QYUVLFZ GS01 SPDS","012294162223757",1817096,"20210409",null,"+79114530522","231/СП","2021-07-19",102,"19.07.2021",17661.78,{"$f":"Таблица1[[#This Row],[№ Акта в монтаж]]","v":102},{"$f":"Таблица1[[#This Row],[Дата КС-3]]","v":"31.08.2021"},1,"31.08.2021"]
[14,"Организация системы учета электроэнергии ВЛ 0,4 кВ от ТП 148-25 в п. Родники, ул. Марьина Гурьевский район","Z/СЭРС/013326/2021-20","Z-5097/20","Щербаков ОВ","39:03:060305:463","Родники","Марьина 12","Гурьевский","20210618","1","17","148-25","CE308 S34.746.OG QYUVLFZ GS01 SPDS","012294163297984",1874164,"20210430",null,"+79114530588","231/СП","2021-07-19",97,"19.07.2021",17650.830000000002,{"$f":"Таблица1[[#This Row],[№ Акта в монтаж]]","v":97},{"$f":"Таблица1[[#This Row],[Дата КС-3]]","v":"31.08.2021"},1,"31.08.2021"]
[15,"Организация системы учета электроэнергии ВЛ 0,4 кВ от ТП 148-07 в п. Родники, ул. Огородная Гурьевский район","Z/СЭРС/013399/2021","Z-4805/20","Коновалов МС","39:03:060305:435","Родники","Огородная","Гурьевский","20210618","10","6","148-07","CE308 S34.746.OG QYUVLFZ GS01 SPDS","012294162223751",1817091,"20210409",null,"+79114530354","236/СП","2021-08-03",96,"06.08.2021",17661.78,null,null,null,null,null,null,null,null,null,"Перепечатать! изменился № договора"]
{"$rows_left_out":888}
{"sheet":"РЭСы","index":1,"n_rows":21,"n_cols":5,"rows_kept":21,"cut":false,"hidden":true,"merged":[]}
["ЗЭС/ВЭС","№","РЭС","Должность","ФИО"]
["ЗЭС","Z18","Багратионовский РЭС","Начальник Западного РЭС","Лошкарев К.П."]
["ЗЭС","Z19","Гвардейский РЭС","Начальник Центрального РЭС","Костырин А.В."]
["ЗЭС","Z20","Гурьевский РЭС","Начальник Западного РЭС","Лошкарев К.П."]
["ЗЭС","Z21","Полесский РЭС","Начальник Центрального РЭС","Костырин А.В."]
["ЗЭС","Z22","Правдинский РЭС","Начальник Центрального РЭС","Костырин А.В."]
["ЗЭС","Z23","Светлогорский РЭС","Начальник Приморского РЭС","Ляхов А.А."]
["ЗЭС","Z24","Зеленоградский РЭС","Начальник Приморского РЭС","Ляхов А.А."]
["ЗЭС","Z25","Мамоновский РЭС","Начальник Западного РЭС","Лошкарев К.П."]
["ЗЭС","Z26","Светловский РЭС","Начальник Приморского РЭС","Ляхов А.А."]
["ЗЭС","Z27","Железнодорожный УЭС","Начальник Центрального РЭС","Костырин А.В."]
["ВЭС","V20","Советский РЭС","Начальник Восточного РЭС","Чвокин В.А."]
["ВЭС","V21","Краснознаменский РЭС","Начальник Восточного РЭС","Чвокин В.А."]
["ВЭС","V22","Неманский РЭС","Начальник Восточного РЭС","Чвокин В.А."]
["ВЭС","V23","Славский РЭС","Начальник Восточного РЭС","Чвокин В.А."]
["ВЭС","V24","Большаковский РЭС","Начальник Восточного РЭС","Чвокин В.А."]
["ВЭС","V30","Черняховский РЭС","Начальник Южного РЭС","Булычев С.В."]
["ВЭС","V31","Гусевский РЭС","Начальник Южного РЭС","Булычев С.В."]
["ВЭС","V32","нестеровский РЭС","Начальник Южного РЭС","Булычев С.В."]
["ВЭС","V33","Озерский РЭС","Начальник Южного РЭС","Булычев С.В."]
{"$rows_left_out":2}
{"sheet":"Стоимости щитов","index":2,"n_rows":9,"n_cols":4,"rows_kept":9,"cut":false,"hidden":false,"merged":[]}
["№ пп","Наименование","Стоимость без НДС","Основание"]
[1,"3ф ПВ на оп. 25А",19057.240000000002,"Калькуляция №1"]
[2,"1ф ПВ на оп. 25А",9687.73,"Калькуляция №2"]
[3,"3ф ТТ150 на оп. ",28346.27,"Калькуляция №3"]
[4,"3ф ПВ на оп. 80А",22041.26,"Калькуляция №4"]
[5,"3ф ПВ на оп. 180А",22577.52,"Калькуляция №5"]
[6,"3ф ПВ на оп. 100А",23960.23,"Калькуляция №6"]
[7,"3ф ПВ на оп. 25А договор",21886,"Договор 25А"]
[8,"1ф ПВ на оп. 25А договор",13608.67,"Договор 25А"]

{"sheet":"Дог.","index":3,"n_rows":8,"n_cols":101,"rows_kept":8,"cut":false,"hidden":false,"merged":[[2,33,2,34],[2,20,2,21],[1,6,1,12]]}
[null,null,null,null,null,null,1,2,3,4,5,6,7,8,9,10,11,12,13,14,15,16,17,18,19,20,21,22,23,24,25,26,27,28,29,30,31,32,33,34,35,36,37,38,39,40,41,42,43,44,45,46,47,48,49,50,51,52,53,54,55,56,57,58,59,60,61,62,63,64,65,66,67,68,69,70,71,72,73,74,75,76,77,78,79,80,81,82,83,84,85,86,87,88,89,90,91,92,93,94,95]
["№ дог.","231/СП","от","2021-07-19",null,"Кт=","Дог. № 267/СП от 09.12.2021 (373 шт.)",null,null,null,null,null,null,null,null,null,null,null,null,null,782,null,null,null,null,null,null,null,null,null,null,null,null,782]
["Лот:",null,null,null,null,null,null,null,null,null,null,null,null,null,null,null,null,null,null,null,{"$f":"U4+V4","v":0},null,null,null,null,null,null,null,null,null,null,null,null,{"$f":"AH4+AI4","v":0}]
["Кол-во:",{"$f":"COUNTA(F6:F1063)","v":2},null,null,null,null,null,null,null,null,null,null,null,null,null,{"$f":"SUM(P6:P7)","v":2900},{"$f":"SUM(Q6:Q7)","v":17442},{"$f":"SUM(R6:R7)","v":20342},null,null,{"$f":"U8","v":0},{"$f":"V8","v":0},0,0,0,0,0,0,0,0,0,0,0,0,0,0,0,0,0,0,0,0,0,0,0,0,0,0,0,0,0,0,0,0,0,0,0,0,0,0,0,0,0,0,0,0,0,0,0,0,0,0,0,0,0,0,0,0,0,0,0,0,0,0,0,{"$f":"CH8","v":0},0,0,0]
["№ п/п","ПИР                   СМР             ПИР+СМР","Юрики / Льготники","Квартал","МТП СТП КТП ТМ ВЛ0,4 ВЛ15 КЛ0,4 КЛ15 Прок Благ. Врдор Выруб","Краткое наименование","№ пп в договоре","Наименование в договоре","Наименование в ТЗ","№ ТЗ в договоре","Правильное ТЗ","Код РЭСа","№ ТУ","Шифр проекта","Шифр проекта","ПИР                Стоимость без НДС","СМР             Стоимость без НДС","ПИР+СМР стоимость без НДС","№ ТЗ сокр","Фазность","Щит КДЕ-3","Щит КДЕ-1","Выключатель нагр. ВН-32 3п\n32А","Выключатель нагр. ВН-32 1п\n32А","Выкл. Авт. ВА 47-29 \n3п \n25 А","Выкл. Авт. ВА 47-29 \n2п \n25 А","Выкл. Авт. ВА 47-29 \n1п \n25 А","Выкл. Авт. ВА 47-29 \n1п\n16 А","Выкл. Авт. ВА 47-29 \n1п \n6 А","Выкл. Авт. ВА 77 400В 150А","ИКК","Шина нулевая","Шина заземления","Счетчик СЕ308","Счетчик СЕ208","ТТ \n150/5","Нулевая колодка","Провод ВВГ 1*6","Зажим ОР645","Скрепа","Лента бандажная","Фиксатор диас. ВIC120","СИП 4*16","Стяжка UV 7,2*300","Труба ПНД гофр UV диам.32","Труба ПНД гофр UV диам.50","СИП 2*16","АВБбШв 4*16","АВБбШв 4*25","Труба копофлекс диам. 40","Труба копофлекс диам. 50","Ж/б столб 2с 24","Труба мет. Диам. 50","Вставка плавк. ПН-2 25А","Рубильник РПС 160","Выкл. Авт. ВА 47-29 \n25 А","Наконечник мед. НШВИ 6-12","Кабель АВВГ 4*25","Кабель АВВГ 4*16","Кабель АВВГ 2*25","Кабель АВВГ 2*16","Кабель АВВГ 2*10","Кабель АВВГ 4*50","Муфта конц. 4ПКТп-1-35/70","Муфта конц. 4ПКТп-1-16/25","Наконечник мед. ТМ 6-6-4","Наконечник ТМЛ 16-10-8","Выкл.нагр. ВН-32 100А 3п","Выкл.авт. ВА 47-29 80А 3п","Провод ВВГ 1*10","СИП 4*25","Труба ПНД гофр. UV диам. 40","Выкл.нагр. ВН-32 63А 3п","Выкл.авт. ВА 47-29 50А 3п",null,null,null,null,null,null,null,null,null,null,null,null,null,null,null,"Тип","Стоимость щита","Источник цены","№ акта в монтаж","Дата акта в монтаж","Стоимость щита в акте монтажа","Дата КС2","Должность","ФИО","Стоимость СМР в КС3 без НДС","Стоимость ПНР в КС3 без НДС","Стоимость всего без НДС"]
["133","ПИР+СМР",null,"2-2021",null,{"$f":"CONCATENATE(\"ЩУ-\",\"231-\",#REF!,\" из 135-\",S6)","v":{"$error":"#REF!"}},"001","Организация системы учета электроэнергии (СП-238, РП-XV) по Гвардейскому проспекту в г. Калининграде",null,"Z/019196/2021-21","Г/019192/2021","G","Г-7116/21",null,{"$f":"CONCATENATE(\"ШИФР: \",M6)","v":"ШИФР: Г-7116/21"},1450,8721,{"$f":"P6+Q6","v":10171},19192,null,null,null,null,null,null,null,null,null,null,null,null,null,null,null,null,null,null,null,null,null,null,null,null,null,null,null,null,null,null,null,null,null,null,null,null,null,null,null,null,null,null,null,null,null,null,null,null,null,null,null,null,null,null,null,null,null,null,null,null,null,null,null,null,null,null,null,null,null,null,null,{"$f":"VLOOKUP(T6,'Стоимости щитов'!$B$2:$D$30,2,0)","v":{"$error":"#N/A"}},{"$f":"VLOOKUP(T6,'Стоимости щитов'!$B$2:$D$30,3,0)","v":{"$error":"#N/A"}},{"$f":"VLOOKUP(K6,'Акты в монтаж 30092021'!$B$6:$AH$5541,20,0)","v":{"$error":"#N/A"}},{"$f":"VLOOKUP(K6,'Акты в монтаж 30092021'!$C$6:$AH$5541,21,0)","v":{"$error":"#N/A"}},{"$f":"VLOOKUP(K6,'Акты в монтаж 30092021'!$C$6:$AH$5000,22,0)","v":{"$error":"#N/A"}},{"$f":"IF(K6=Титул!$AO$1,#REF!,0)","v":{"$error":"#N/A"}},null,null,{"$f":"IF(K6=Титул!$AO$1,#REF!,0)","v":{"$error":"#N/A"}},{"$f":"IF(K6=Титул!$AO$1,#REF!,0)","v":{"$error":"#N/A"}},{"$f":"CU6+CV6","v":{"$error":"#N/A"}}]
["134","ПИР+СМР",null,"2-2021",null,{"$f":"CONCATENATE(\"ЩУ-\",\"231-\",#REF!,\" из 135-\",S7)","v":{"$error":"#REF!"}},"002","Организация системы учета электроэнергии по ул. Генерала Павлова (ТП-713) в г. Калининграде",null,"Z/019198/2021-21","Г/019288/2021","G","Г-7500/21",null,{"$f":"CONCATENATE(\"ШИФР: \",M7)","v":"ШИФР: Г-7500/21"},1450,8721,{"$f":"P7+Q7","v":10171},19288,null,null,null,null,null,null,null,null,null,null,null,null,null,null,null,null,null,null,null,null,null,null,null,null,null,null,null,null,null,null,null,null,null,null,null,null,null,null,null,null,null,null,null,null,null,null,null,null,null,null,null,null,null,null,null,null,null,null,null,null,null,null,null,null,null,null,null,null,null,null,null,{"$f":"VLOOKUP(T7,'Стоимости щитов'!$B$2:$D$30,2,0)","v":{"$error":"#N/A"}},{"$f":"VLOOKUP(T7,'Стоимости щитов'!$B$2:$D$30,3,0)","v":{"$error":"#N/A"}},{"$f":"VLOOKUP(K7,'Акты в монтаж 30092021'!$B$6:$AH$5541,20,0)","v":{"$error":"#N/A"}},{"$f":"VLOOKUP(K7,'Акты в монтаж 30092021'!$C$6:$AH$5541,21,0)","v":{"$error":"#N/A"}},{"$f":"VLOOKUP(K7,'Акты в монтаж 30092021'!$C$6:$AH$5000,22,0)","v":{"$error":"#N/A"}},{"$f":"IF(K7=Титул!$AO$1,#REF!,0)","v":{"$error":"#N/A"}},null,null,{"$f":"IF(K7=Титул!$AO$1,#REF!,0)","v":{"$error":"#N/A"}},{"$f":"IF(K7=Титул!$AO$1,#REF!,0)","v":{"$error":"#N/A"}},{"$f":"CU7+CV7","v":{"$error":"#N/A"}}]
[null,null,null,null,null,null,null,null,null,null,null,null,null,null,null,null,null,null,null,null,{"$f":"SUM(U6:U7)","v":0},0,0,0,0,0,0,0,0,0,0,0,0,0,0,0,0,0,0,0,0,0,0,0,0,0,0,0,0,0,0,0,{"$f":"SUM(BA6:BA7)","v":0},0,0,0,0,0,0,0,0,0,0,0,0,0,0,0,0,0,0,0,0,0,0,0,0,0,0,0,0,0,0,0,{"$f":"SUM(CG6:CG7)","v":0},0,0,0,0]

{"sheet":"Накладная","index":4,"n_rows":40,"n_cols":34,"rows_kept":40,"cut":false,"hidden":false,"merged":[[13,0,13,36],[20,0,20,3],[20,4,20,36],[23,0,23,3],[23,4,23,28],[23,29,23,32],[23,33,23,36],[21,0,21,3],[21,4,21,36],[24,0,24,3],[24,4,24,28],[24,29,24,32],[24,33,24,36],[25,0,25,3],[25,4,25,28],[25,29,25,32],[25,33,25,36],[39,0,39,36],[26,0,26,3],[26,4,26,28],[26,29,26,32],[26,33,26,36],[31,0,31,36],[35,0,35,36],[30,0,30,36]]}
[]
[]
[]
[]
[]
[]
[]
[null,null,null,null,"№"]
[]
[]
[]
[]
[]
[{"$f":"CONCATENATE(\"Накладная № \",Титул!AP10,\" / \",Титул!AO6)","v":"Накладная № 267 / 363"}]
[]
[]
["Кому:"]
[null,null,null,"(наименование организации)"]
["От кого:"]
[null,null,null,null,"(наименование организации)"]
{"$rows_left_out":21}
{"sheet":"АПП ПИРнов","index":5,"n_rows":30,"n_cols":12,"rows_kept":30,"cut":false,"hidden":false,"merged":[[11,0,11,10],[12,0,12,10],[13,0,13,10],[14,0,14,10],[17,0,17,10],[15,0,15,11],[18,0,18,10],[19,0,19,10],[20,0,20,10],[23,1,23,6],[23,8,23,9],[24,1,24,6],[24,8,24,9],[25,1,25,6],[25,8,25,9],[26,0,26,1],[26,3,26,10],[27,0,27,3],[27,5,27,10],[31,0,31,3],[32,0,32,3],[33,8,33,10],[31,8,31,10],[32,8,32,10]]}
[]
[]
[]
[]
[]
[]
[]
[]
[]
[]
[]
["АКТ от \"___\" ________________ 2021г."]
["сдачи-приемки выполненных проектно-изыскательских работ"]
[]
[{"$f":"CONCATENATE(\"\"\"\",Титул!AO4,\"\"\"\")","v":{"$error":"#N/A"}}]
[{"$f":"CONCATENATE(\"(ТЗ № \",Накладная!E22,\")\")","v":{"$error":"#N/A"}}]
[]
[{"$f":"CONCATENATE(\"Мы, ниже подписавшиеся,\",\" представитель \",\"\"\"\",\"Заказчика\",\"\"\"\",\": \",Титул!AO2)","v":{"$error":"#N/A"}}]
[{"$f":"CONCATENATE(\"АО \",CHAR(34),\"Россети Янтарь\",CHAR(34),\" \",Титул!AO3,\" с одной стороны, и \",\"представитель \",CHAR(34),\"Подрядчика\",CHAR(34),\" в лице\")","v":{"$error":"#N/A"}}]
["Генерального директора АО \"Россети Янтарьсервис\" Лукьянца Ю.И., с другой"]
{"$rows_left_out":11}
{"sheet":"Титул","index":6,"n_rows":51,"n_cols":43,"rows_kept":51,"cut":false,"hidden":false,"merged":[[14,42,14,56],[0,33,0,36],[13,2,14,36],[25,2,26,36],[28,2,29,36],[17,3,21,35],[128,0,134,0],[128,1,134,1],[102,3,102,4],[154,15,156,34],[154,35,154,36],[155,3,155,4],[155,5,155,9],[155,10,155,12],[155,13,155,14],[155,35,156,36],[156,3,156,4],[156,5,156,9],[156,10,156,12],[154,13,154,14],[156,13,156,14],[135,0,139,0],[135,1,139,1],[140,0,144,0],[140,1,144,1],[145,0,151,0],[145,1,151,1],[152,0,156,0],[152,1,156,1],[154,3,154,4],[154,5,154,9],[154,10,154,12],[102,35,102,36],[103,3,103,4],[103,5,103,9],[103,10,103,12],[103,13,103,14],[103,35,104,36],[104,13,104,14],[102,5,102,9],[102,10,102,12],[104,3,104,4],[104,5,104,9],[104,10,104,12],[102,13,102,14],[102,15,104,34],[88,0,92,0],[88,1,92,1],[93,0,99,0],[93,1,99,1],[100,0,104,0],[100,1,104,1],[76,0,82,0],[76,1,82,1],[83,0,87,0],[83,1,87,1],[40,0,46,0],[48,0,52,0],[48,1,52,1],[48,2,49,36],[50,2,51,36],[40,1,47,1],[23,0,29,0],[23,1,29,1],[30,0,34,0],[30,1,34,1],[35,0,39,0],[35,1,39,1],[36,2,37,36]]}
[null,null,null,null,null,null,null,null,null,null,null,null,null,null,null,null,null,null,null,null,null,null,null,null,null,null,null,null,null,null,null,null,null,{"$f":"CONCATENATE(AP10,\"/\",AO6)","v":"267/363"},null,null,null,null,"ТЗ",null,{"$f":"VLOOKUP($AO$6,Дог.!$G$6:$CW$7,5,0)","v":{"$error":"#N/A"}},{"$f":"VLOOKUP($AO$6,Дог.!$G$6:$CW$7,13,0)","v":{"$error":"#N/A"}}]
[null,null,null,null,null,null,null,null,null,null,null,null,null,null,null,null,null,null,null,null,null,null,null,null,null,null,null,null,null,null,null,null,null,null,null,null,null,null,"Должность",null,{"$f":"VLOOKUP($AO$6,Дог.!$G$6:$CW$7,91,0)","v":{"$error":"#N/A"}}]
[null,null,null,null,null,null,null,null,null,null,null,null,null,null,null,null,null,null,null,null,null,null,null,null,null,null,null,null,null,null,null,null,null,null,null,null,null,null,"ФИО",null,{"$f":"VLOOKUP($AO$6,Дог.!$G$6:$CW$7,92,0)","v":{"$error":"#N/A"}}]
[null,null,null,null,null,null,null,null,null,null,null,null,null,null,null,null,null,null,null,null,null,null,null,null,null,null,null,null,null,null,null,null,null,null,null,null,null,null,"Титул",null,{"$f":"VLOOKUP($AO$6,Дог.!$G$6:$CW$7,2,0)","v":{"$error":"#N/A"}}]
[null,null,null,null,null,null,null,null,null,null,null,null,null,null,null,null,null,null,null,null,null,null,null,null,null,null,null,null,null,null,null,null,null,null,null,null,null,null,"Шифр",null,{"$f":"VLOOKUP($AO$6,Дог.!$G$6:$CW$7,9,0)","v":{"$error":"#N/A"}}]
[null,null,null,null,null,null,null,null,null,null,null,null,null,null,null,null,null,null,null,null,null,null,null,null,null,null,null,null,null,null,null,null,null,null,null,null,null,null,"№пп",null,363]
[null,null,null,null,null,null,null,null,null,null,null,null,null,null,null,null,null,null,null,null,null,null,null,null,null,null,null,null,null,null,null,null,null,null,null,null,null,null,"Стоим.ПИР в дог",null,{"$f":"VLOOKUP($AO$6,Дог.!$G$6:$CW$7,10,0)","v":{"$error":"#N/A"}},{"$f":"#REF!","v":{"$error":"#REF!"}}]
[null,null,null,null,null,null,null,null,null,null,null,null,null,null,null,null,null,null,null,null,null,null,null,null,null,null,null,null,null,null,null,null,null,null,null,null,null,null,"Стоим.щита",null,{"$f":"VLOOKUP($AO$6,Дог.!$G$6:$CW$7,85,0)","v":{"$error":"#N/A"}}]
[null,null,null,null,null,null,null,null,null,null,null,null,null,null,null,null,null,null,null,null,null,null,null,null,null,null,null,null,null,null,null,null,null,null,null,null,null,null,null,null,{"$f":"Дог.!G2","v":"Дог. № 267/СП от 09.12.2021 (373 шт.)"}]
[null,null,null,null,null,null,null,null,null,null,null,null,null,null,null,null,null,null,null,null,null,null,null,null,null,null,null,null,null,null,null,null,null,null,null,null,null,null,"Дог",null,"267/СП",267]
[null,null,null,null,null,null,null,null,null,null,null,null,null,null,null,null,null,null,null,null,null,null,null,null,null,null,null,null,null,null,null,null,null,null,null,null,null,null,"Дата",null,"2021-12-09"]
[null,null,null,null,null,null,null,null,null,null,null,null,null,null,null,null,null,null,null,null,null,null,null,null,null,null,null,null,null,null,null,null,null,null,null,null,null,null,"Квартал",null,"4 кв. 2021г."]
[null,null,null,null,null,null,null,null,null,null,null,null,null,null,null,null,null,null,null,null,null,null,null,null,null,null,null,null,null,null,null,null,null,null,null,null,null,null,"Инд.ПИР",null,4.75]
[null,null,"РАБОЧАЯ ДОКУМЕНТАЦИЯ",null,null,null,null,null,null,null,null,null,null,null,null,null,null,null,null,null,null,null,null,null,null,null,null,null,null,null,null,null,null,null,null,null,null,null,"Письмо",null,"25.10.2021 N 46012-ИФ/09"]
[null,null,null,null,null,null,null,null,null,null,null,null,null,null,null,null,null,null,null,null,null,null,null,null,null,null,null,null,null,null,null,null,null,null,null,null,null,null,"СМР в договоре",null,{"$f":"VLOOKUP($AO$6,Дог.!$G$6:$CW$7,11,0)","v":{"$error":"#N/A"}},{"$f":"#REF!+#REF!","v":{"$error":"#REF!"}},{"$f":"AO15/AP15","v":{"$error":"#N/A"}}]
[null,null,null,null,null,null,null,null,null,null,null,null,null,null,null,null,null,null,null,null,null,null,null,null,null,null,null,null,null,null,null,null,null,null,null,null,null,null,null,null,null,"в кс3"]
[]
[null,null,null,{"$f":"AO4","v":{"$error":"#N/A"}}]
[]
[]
{"$rows_left_out":31}