{"text_format":"1","workbook":"xlsx","n_sheets":2,"sheets":["ВПР","Отработанные дни"],"not_rendered":{"charts":0,"images":0,"macros":1,"external_links":1,"defined_names":1,"comments":0,"pivot_tables":0},"unopened":[],"bounds":{"document_bytes":16777216,"sheet_cells":100000,"rows_first":2000,"rows_last":500,"rows_between":2000,"halvings":0,"cell_chars":16384,"cell_head_chars":4096},"cells_cut":0,"cells_raw":0,"read":"whole","date_system":"1900"}

{"sheet":"ВПР","index":0,"n_rows":23,"n_cols":14,"rows_kept":23,"cut":false,"hidden":false,"merged":[[1,1,8,1],[0,0,8,0],[0,3,2,13],[3,3,8,3],[3,4,8,4],[3,9,8,9],[3,11,8,11],[3,12,8,12],[3,13,8,13],[3,5,8,5],[3,6,8,6],[3,7,8,7],[3,8,8,8],[3,10,8,10]]}
["№ п/п","Входящий",null,"Сводка № (даты проведения)"]
[null,"№"]
[]
[null,null,null,0,1,2,3,4,5,6,7,8,9,10]
[]
[]
[]
[]
[]
[]
[1,"216.12"]
[2,"219.12"]
[3,"001.13",{"$f":"IF(LEN(D13)>3,REPLACE(D13,4,1,\".\"),D13)","v":"001"},{"$f":"MID(B13,1,LEN(B13)-3)","v":"001"},{"$f":"VLOOKUP(C13,'Отработанные дни'!$A$1:$K$24,2,1)","v":{"$error":"#N/A"}},{"$f":"VLOOKUP(C13,'Отработанные дни'!$A$1:$K$24,3,1)","v":{"$error":"#N/A"}},{"$f":"VLOOKUP(C13,'Отработанные дни'!$A$1:$K$24,4,1)","v":{"$error":"#N/A"}}]
[4,"001/1.13",{"$f":"IF(LEN(D14)>3,REPLACE(D14,4,1,\".\"),D14)","v":"001.1"},{"$f":"MID(B14,1,LEN(B14)-3)","v":"001/1"},{"$f":"VLOOKUP(C14,'Отработанные дни'!$A$1:$K$24,2,1)","v":"04.01.2013"},{"$f":"VLOOKUP(C14,'Отработанные дни'!$A$1:$K$24,3,1)","v":"05.01.2013"},{"$f":"VLOOKUP(C14,'Отработанные дни'!$A$1:$K$24,4,1)","v":"06.01.2013"}]
[5,"005.13","005","005",{"$f":"VLOOKUP(C15,'Отработанные дни'!$A$1:$K$24,2,1)","v":"10.01.2013"},{"$f":"VLOOKUP(C15,'Отработанные дни'!$A$1:$K$24,3,1)","v":"11.01.2013"},{"$f":"VLOOKUP(C15,'Отработанные дни'!$A$1:$K$24,4,1)","v":""}]
[6,"006.13","006","006",{"$f":"VLOOKUP(C16,'Отработанные дни'!$A$1:$K$24,2,1)","v":"11.01.2013"},{"$f":"VLOOKUP(C16,'Отработанные дни'!$A$1:$K$24,3,1)","v":"14.01.2013"},{"$f":"VLOOKUP(C16,'Отработанные дни'!$A$1:$K$24,4,1)","v":"15.01.2013"}]
[7,"008.13","008","008",{"$f":"VLOOKUP(C17,'Отработанные дни'!$A$1:$K$24,2,1)","v":"15.01.2013"},{"$f":"VLOOKUP(C17,'Отработанные дни'!$A$1:$K$24,3,1)","v":"16.01.2013"},{"$f":"VLOOKUP(C17,'Отработанные дни'!$A$1:$K$24,4,1)","v":"17.01.2013"}]
[8,"009.13","009","009",{"$f":"VLOOKUP(C18,'Отработанные дни'!$A$1:$K$24,2,1)","v":"16.01.2013"},{"$f":"VLOOKUP(C18,'Отработанные дни'!$A$1:$K$24,3,1)","v":""},{"$f":"VLOOKUP(C18,'Отработанные дни'!$A$1:$K$24,4,1)","v":""}]
[9,"012.13","012","012",{"$f":"VLOOKUP(C19,'Отработанные дни'!$A$1:$K$24,2,1)","v":"20.01.2013"},{"$f":"VLOOKUP(C19,'Отработанные дни'!$A$1:$K$24,3,1)","v":""},{"$f":"VLOOKUP(C19,'Отработанные дни'!$A$1:$K$24,4,1)","v":""}]
[10,"013.13","013","013",{"$f":"VLOOKUP(C20,'Отработанные дни'!$A$1:$K$24,2,1)","v":"22.01.2013"},{"$f":"VLOOKUP(C20,'Отработанные дни'!$A$1:$K$24,3,1)","v":"23.01.2013"},{"$f":"VLOOKUP(C20,'Отработанные дни'!$A$1:$K$24,4,1)","v":"24.01.2013"}]
[11,"016.13","016","016",{"$f":"VLOOKUP(C21,'Отработанные дни'!$A$1:$K$24,2,1)","v":"29.01.2013"},{"$f":"VLOOKUP(C21,'Отработанные дни'!$A$1:$K$24,3,1)","v":"30.01.2013"},{"$f":"VLOOKUP(C21,'Отработанные дни'!$A$1:$K$24,4,1)","v":"31.01.2013"}]
[12,"017.13","017","017",{"$f":"VLOOKUP(C22,'Отработанные дни'!$A$1:$K$24,2,1)","v":"29.01.2013"},{"$f":"VLOOKUP(C22,'Отработанные дни'!$A$1:$K$24,3,1)","v":"30.01.2013"},{"$f":"VLOOKUP(C22,'Отработанные дни'!$A$1:$K$24,4,1)","v":"31.01.2013"}]
[13,"018.13","018","018",{"$f":"VLOOKUP(C23,'Отработанные дни'!$A$1:$K$24,2,1)","v":"29.01.2013"},{"$f":"VLOOKUP(C23,'Отработанные дни'!$A$1:$K$24,3,1)","v":"30.01.2013"},{"$f":"VLOOKUP(C23,'Отработанные дни'!$A$1:$K$24,4,1)","v":"31.01.2013"}]

{"sheet":"Отработанные дни","index":1,"n_rows":303,"n_cols":19,"rows_kept":303,"cut":false,"hidden":false,"merged":[]}
[]
[{"$f":"[1]Итог!B3","v":"001 "},{"$f":"[1]Итог!D3","v":"04.01.2013"},{"$f":"[1]Итог!E3","v":"05.01.2013"},{"$f":"[1]Итог!F3","v":"06.01.2013"},{"$f":"[1]Итог!G3","v":""},{"$f":"[1]Итог!H3","v":""},{"$f":"[1]Итог!I3","v":""},{"$f":"[1]Итог!J3","v":""},{"$f":"[1]Итог!K3","v":""},{"$f":"[1]Итог!L3","v":""},{"$f":"[1]Итог!M3","v":""},null,null,null,null,{"$f":"A2","v":"001 "},{"$f":"VLOOKUP(A2,$A$2:$K$24,2,0)","v":"04.01.2013"},{"$f":"VLOOKUP(A2,$A$2:$K$24,3,0)","v":"05.01.2013"},{"$f":"VLOOKUP(A2,$A$2:$K$24,4,0)","v":"06.01.2013"}]
[{"$f":"[1]Итог!B4","v":"001.1 "},{"$f":"[1]Итог!D4","v":"07.01.2013"},{"$f":"[1]Итог!E4","v":"08.01.2013"},{"$f":"[1]Итог!F4","v":"09.01.2013"},{"$f":"[1]Итог!G4","v":"10.01.2013"},{"$f":"[1]Итог!H4","v":""},{"$f":"[1]Итог!I4","v":""},{"$f":"[1]Итог!J4","v":""},{"$f":"[1]Итог!K4","v":""},{"$f":"[1]Итог!L4","v":""},{"$f":"[1]Итог!M4","v":""},null,null,null,null,{"$f":"A3","v":"001.1 "},{"$f":"VLOOKUP(A3,$A$2:$K$24,2,0)","v":"07.01.2013"},{"$f":"VLOOKUP(A3,$A$2:$K$24,3,0)","v":"08.01.2013"},{"$f":"VLOOKUP(A3,$A$2:$K$24,4,0)","v":"09.01.2013"}]
[{"$f":"[1]Итог!B5","v":"002 "},{"$f":"[1]Итог!D5","v":"09.01.2013"},{"$f":"[1]Итог!E5","v":"10.01.2013"},{"$f":"[1]Итог!F5","v":""},{"$f":"[1]Итог!G5","v":""},{"$f":"[1]Итог!H5","v":""},{"$f":"[1]Итог!I5","v":""},{"$f":"[1]Итог!J5","v":""},{"$f":"[1]Итог!K5","v":""},{"$f":"[1]Итог!L5","v":""},{"$f":"[1]Итог!M5","v":""},null,null,null,null,"002 ","09.01.2013","10.01.2013",""]
[{"$f":"[1]Итог!B6","v":"003 "},{"$f":"[1]Итог!D6","v":"10.01.2013"},{"$f":"[1]Итог!E6","v":"14.01.2013"},{"$f":"[1]Итог!F6","v":"15.01.2013"},{"$f":"[1]Итог!G6","v":"17.01.2013"},{"$f":"[1]Итог!H6","v":"21.01.2013"},{"$f":"[1]Итог!I6","v":"22.01.2013"},{"$f":"[1]Итог!J6","v":"24.01.2013"},{"$f":"[1]Итог!K6","v":"28.01.2013"},{"$f":"[1]Итог!L6","v":"29.01.2013"},{"$f":"[1]Итог!M6","v":"31.01.2013"},null,null,null,null,"003 ","10.01.2013","14.01.2013","15.01.2013"]
[{"$f":"[1]Итог!B7","v":"003.1 "},{"$f":"[1]Итог!D7","v":"04.02.2013"},{"$f":"[1]Итог!E7","v":"05.02.2013"},{"$f":"[1]Итог!F7","v":"07.02.2013"},{"$f":"[1]Итог!G7","v":"11.02.2013"},{"$f":"[1]Итог!H7","v":"14.02.2013"},{"$f":"[1]Итог!I7","v":"18.02.2013"},{"$f":"[1]Итог!J7","v":"19.02.2013"},{"$f":"[1]Итог!K7","v":"21.02.2013"},{"$f":"[1]Итог!L7","v":"25.02.2013"},{"$f":"[1]Итог!M7","v":"26.02.2013"},null,null,null,null,"003.1 ","04.02.2013","05.02.2013","07.02.2013"]
[{"$f":"[1]Итог!B8","v":"003.2 "},{"$f":"[1]Итог!D8","v":"28.02.2013"},{"$f":"[1]Итог!E8","v":"04.03.2013"},{"$f":"[1]Итог!F8","v":"05.03.2013"},{"$f":"[1]Итог!G8","v":"07.03.2013"},{"$f":"[1]Итог!H8","v":"11.03.2013"},{"$f":"[1]Итог!I8","v":"12.03.2013"},{"$f":"[1]Итог!J8","v":"14.03.2013"},{"$f":"[1]Итог!K8","v":"18.03.2013"},{"$f":"[1]Итог!L8","v":"19.03.2013"},{"$f":"[1]Итог!M8","v":"21.03.2013"},null,null,null,null,"003.2 ","28.02.2013","04.03.2013","05.03.2013"]
[{"$f":"[1]Итог!B9","v":"003.3 "},{"$f":"[1]Итог!D9","v":"25.03.2013"},{"$f":"[1]Итог!E9","v":"26.03.2013"},{"$f":"[1]Итог!F9","v":"01.04.2013"},{"$f":"[1]Итог!G9","v":"02.04.2013"},{"$f":"[1]Итог!H9","v":"04.04.2013"},{"$f":"[1]Итог!I9","v":"08.04.2013"},{"$f":"[1]Итог!J9","v":"09.04.2013"},{"$f":"[1]Итог!K9","v":"11.04.2013"},{"$f":"[1]Итог!L9","v":"15.04.2013"},{"$f":"[1]Итог!M9","v":"16.04.2013"},null,null,null,null,"003.3 ","25.03.2013","26.03.2013","01.04.2013"]
[{"$f":"[1]Итог!B10","v":"003.4 "},{"$f":"[1]Итог!D10","v":"18.04.2013"},{"$f":"[1]Итог!E10","v":"25.04.2013"},{"$f":"[1]Итог!F10","v":"29.04.2013"},{"$f":"[1]Итог!G10","v":"30.04.2013"},{"$f":"[1]Итог!H10","v":"13.05.2013"},{"$f":"[1]Итог!I10","v":"16.05.2013"},{"$f":"[1]Итог!J10","v":"23.05.2013"},{"$f":"[1]Итог!K10","v":"27.05.2013"},{"$f":"[1]Итог!L10","v":"28.05.2013"},{"$f":"[1]Итог!M10","v":"30.05.2013"},null,null,null,null,"003.4 ","18.04.2013","25.04.2013","29.04.2013"]
[{"$f":"[1]Итог!B11","v":"003.5 "},{"$f":"[1]Итог!D11","v":"03.06.2013"},{"$f":"[1]Итог!E11","v":"04.06.2013"},{"$f":"[1]Итог!F11","v":"11.06.2013"},{"$f":"[1]Итог!G11","v":"11.06.2013"},{"$f":"[1]Итог!H11","v":"13.06.2013"},{"$f":"[1]Итог!I11","v":"17.06.2013"},{"$f":"[1]Итог!J11","v":"18.06.2013"},{"$f":"[1]Итог!K11","v":"20.06.2013"},{"$f":"[1]Итог!L11","v":"24.06.2013"},{"$f":"[1]Итог!M11","v":"27.06.2013"},null,null,null,null,"003.5 ","03.06.2013","04.06.2013","11.06.2013"]
[{"$f":"[1]Итог!B12","v":"004 "},{"$f":"[1]Итог!D12","v":"10.01.2013"},{"$f":"[1]Итог!E12","v":"11.01.2013"},{"$f":"[1]Итог!F12","v":""},{"$f":"[1]Итог!G12","v":""},{"$f":"[1]Итог!H12","v":""},{"$f":"[1]Итог!I12","v":""},{"$f":"[1]Итог!J12","v":""},{"$f":"[1]Итог!K12","v":""},{"$f":"[1]Итог!L12","v":""},{"$f":"[1]Итог!M12","v":""},null,null,null,null,"004 ","10.01.2013","11.01.2013",""]
[{"$f":"[1]Итог!B13","v":"005 "},{"$f":"[1]Итог!D13","v":"11.01.2013"},{"$f":"[1]Итог!E13","v":"14.01.2013"},{"$f":"[1]Итог!F13","v":"15.01.2013"},{"$f":"[1]Итог!G13","v":""},{"$f":"[1]Итог!H13","v":"17.01.2013"},{"$f":"[1]Итог!I13","v":"19.01.2013"},{"$f":"[1]Итог!J13","v":"21.01.2013"},{"$f":"[1]Итог!K13","v":""},{"$f":"[1]Итог!L13","v":""},{"$f":"[1]Итог!M13","v":""},null,null,null,null,"005 ","11.01.2013","14.01.2013","15.01.2013"]
[{"$f":"[1]Итог!B14","v":"006 "},{"$f":"[1]Итог!D14","v":"11.01.2013"},{"$f":"[1]Итог!E14","v":"14.01.2013"},{"$f":"[1]Итог!F14","v":"15.01.2013"},{"$f":"[1]Итог!G14","v":"16.01.2013"},{"$f":"[1]Итог!H14","v":"17.01.2013"},{"$f":"[1]Итог!I14","v":""},{"$f":"[1]Итог!J14","v":""},{"$f":"[1]Итог!K14","v":""},{"$f":"[1]Итог!L14","v":""},{"$f":"[1]Итог!M14","v":""},null,null,null,null,"006 ","11.01.2013","14.01.2013","15.01.2013"]
[{"$f":"[1]Итог!B15","v":"007 "},{"$f":"[1]Итог!D15","v":"15.01.2013"},{"$f":"[1]Итог!E15","v":"16.01.2013"},{"$f":"[1]Итог!F15","v":"17.01.2013"},{"$f":"[1]Итог!G15","v":"18.01.2013"},{"$f":"[1]Итог!H15","v":"21.01.2013"},{"$f":"[1]Итог!I15","v":"22.01.2013"},{"$f":"[1]Итог!J15","v":"23.01.2013"},{"$f":"[1]Итог!K15","v":"24.01.2013"},{"$f":"[1]Итог!L15","v":"25.01.2013"},{"$f":"[1]Итог!M15","v":"28.01.2013"},null,null,null,null,"007 ","15.01.2013","16.01.2013","17.01.2013"]
[{"$f":"[1]Итог!B16","v":"008 "},{"$f":"[1]Итог!D16","v":"16.01.2013"},{"$f":"[1]Итог!E16","v":""},{"$f":"[1]Итог!F16","v":""},{"$f":"[1]Итог!G16","v":""},{"$f":"[1]Итог!H16","v":""},{"$f":"[1]Итог!I16","v":""},{"$f":"[1]Итог!J16","v":""},{"$f":"[1]Итог!K16","v":""},{"$f":"[1]Итог!L16","v":""},{"$f":"[1]Итог!M16","v":""},null,null,null,null,"008 ","16.01.2013","",""]
[{"$f":"[1]Итог!B17","v":"009 "},{"$f":"[1]Итог!D17","v":"18.01.2013"},{"$f":"[1]Итог!E17","v":"21.01.2013"},{"$f":"[1]Итог!F17","v":""},{"$f":"[1]Итог!G17","v":""},{"$f":"[1]Итог!H17","v":""},{"$f":"[1]Итог!I17","v":""},{"$f":"[1]Итог!J17","v":""},{"$f":"[1]Итог!K17","v":""},{"$f":"[1]Итог!L17","v":""},{"$f":"[1]Итог!M17","v":""},null,null,null,null,"009 ","18.01.2013","21.01.2013",""]
[{"$f":"[1]Итог!B18","v":"010 "},{"$f":"[1]Итог!D18","v":"18.01.2013"},{"$f":"[1]Итог!E18","v":"21.01.2013"},{"$f":"[1]Итог!F18","v":"22.01.2013"},{"$f":"[1]Итог!G18","v":"23.01.2013"},{"$f":"[1]Итог!H18","v":"24.01.2013"},{"$f":"[1]Итог!I18","v":"25.01.2013"},{"$f":"[1]Итог!J18","v":"28.01.2013"},{"$f":"[1]Итог!K18","v":""},{"$f":"[1]Итог!L18","v":""},{"$f":"[1]Итог!M18","v":""},null,null,null,null,"010 ","18.01.2013","21.01.2013","22.01.2013"]
[{"$f":"[1]Итог!B19","v":"011 "},{"$f":"[1]Итог!D19","v":"20.01.2013"},{"$f":"[1]Итог!E19","v":""},{"$f":"[1]Итог!F19","v":""},{"$f":"[1]Итог!G19","v":""},{"$f":"[1]Итог!H19","v":""},{"$f":"[1]Итог!I19","v":""},{"$f":"[1]Итог!J19","v":""},{"$f":"[1]Итог!K19","v":""},{"$f":"[1]Итог!L19","v":""},{"$f":"[1]Итог!M19","v":""},null,null,null,null,"011 ","20.01.2013","",""]
[{"$f":"[1]Итог!B20","v":"012 "},{"$f":"[1]Итог!D20","v":"22.01.2013"},{"$f":"[1]Итог!E20","v":"23.01.2013"},{"$f":"[1]Итог!F20","v":"24.01.2013"},{"$f":"[1]Итог!G20","v":"25.01.2013"},{"$f":"[1]Итог!H20","v":"28.01.2013"},{"$f":"[1]Итог!I20","v":""},{"$f":"[1]Итог!J20","v":""},{"$f":"[1]Итог!K20","v":""},{"$f":"[1]Итог!L20","v":""},{"$f":"[1]Итог!M20","v":""},null,null,null,null,"012 ","22.01.2013","23.01.2013","24.01.2013"]
[{"$f":"[1]Итог!B21","v":"013 "},{"$f":"[1]Итог!D21","v":"22.01.2013"},{"$f":"[1]Итог!E21","v":"23.01.2013"},{"$f":"[1]Итог!F21","v":"24.01.2013"},{"$f":"[1]Итог!G21","v":"25.01.2013"},{"$f":"[1]Итог!H21","v":"28.01.2013"},{"$f":"[1]Итог!I21","v":""},{"$f":"[1]Итог!J21","v":""},{"$f":"[1]Итог!K21","v":""},{"$f":"[1]Итог!L21","v":""},{"$f":"[1]Итог!M21","v":""},null,null,null,null,"013 ","22.01.2013","23.01.2013","24.01.2013"]
[{"$f":"[1]Итог!B22","v":"014 "},{"$f":"[1]Итог!D22","v":"28.01.2013"},{"$f":"[1]Итог!E22","v":"29.01.2013"},{"$f":"[1]Итог!F22","v":"30.01.2013"},{"$f":"[1]Итог!G22","v":"31.01.2013"},{"$f":"[1]Итог!H22","v":""},{"$f":"[1]Итог!I22","v":""},{"$f":"[1]Итог!J22","v":""},{"$f":"[1]Итог!K22","v":""},{"$f":"[1]Итог!L22","v":""},{"$f":"[1]Итог!M22","v":""},null,null,null,null,"014 ","28.01.2013","29.01.2013","30.01.2013"]
[{"$f":"[1]Итог!B23","v":"015 "},{"$f":"[1]Итог!D23","v":"29.01.2013"},{"$f":"[1]Итог!E23","v":"30.01.2013"},{"$f":"[1]Итог!F23","v":"31.01.2013"},{"$f":"[1]Итог!G23","v":"01.02.2013"},{"$f":"[1]Итог!H23","v":"04.02.2013"},{"$f":"[1]Итог!I23","v":""},{"$f":"[1]Итог!J23","v":""},{"$f":"[1]Итог!K23","v":""},{"$f":"[1]Итог!L23","v":""},{"$f":"[1]Итог!M23","v":""}]
[{"$f":"[1]Итог!B24","v":"016 "},{"$f":"[1]Итог!D24","v":"29.01.2013"},{"$f":"[1]Итог!E24","v":"30.01.2013"},{"$f":"[1]Итог!F24","v":"31.01.2013"},{"$f":"[1]Итог!G24","v":"01.02.2013"},{"$f":"[1]Итог!H24","v":"05.02.2013"},{"$f":"[1]Итог!I24","v":""},{"$f":"[1]Итог!J24","v":""},{"$f":"[1]Итог!K24","v":""},{"$f":"[1]Итог!L24","v":""},{"$f":"[1]Итог!M24","v":""}]
[{"$f":"[1]Итог!B25","v":"017 "},{"$f":"[1]Итог!D25","v":"29.01.2013"},{"$f":"[1]Итог!E25","v":"30.01.2013"},{"$f":"[1]Итог!F25","v":"31.01.2013"},{"$f":"[1]Итог!G25","v":"01.02.2013"},{"$f":"[1]Итог!H25","v":"05.02.2013"},{"$f":"[1]Итог!I25","v":"06.02.2013"},{"$f":"[1]Итог!J25","v":"07.02.2013"},{"$f":"[1]Итог!K25","v":"08.02.2013"},{"$f":"[1]Итог!L25","v":"11.02.2013"},{"$f":"[1]Итог!M25","v":"12.02.2013"}]
[{"$f":"[1]Итог!B225","v":""},{"$f":"[1]Итог!D225","v":""},{"$f":"[1]Итог!E225","v":""},{"$f":"[1]Итог!F225","v":""},{"$f":"[1]Итог!G225","v":""},{"$f":"[1]Итог!H225","v":""},{"$f":"[1]Итог!I225","v":""},{"$f":"[1]Итог!J225","v":""},{"$f":"[1]Итог!K225","v":""},{"$f":"[1]Итог!L225","v":""},{"$f":"[1]Итог!M225","v":""}]
[{"$f":"[1]Итог!B226","v":""},{"$f":"[1]Итог!D226","v":""},{"$f":"[1]Итог!E226","v":""},{"$f":"[1]Итог!F226","v":""},{"$f":"[1]Итог!G226","v":""},{"$f":"[1]Итог!H226","v":""},{"$f":"[1]Итог!I226","v":""},{"$f":"[1]Итог!J226","v":""},{"$f":"[1]Итог!K226","v":""},{"$f":"[1]Итог!L226","v":""},{"$f":"[1]Итог!M226","v":""}]
[{"$f":"[1]Итог!B227","v":""},{"$f":"[1]Итог!D227","v":""},{"$f":"[1]Итог!E227","v":""},{"$f":"[1]Итог!F227","v":""},{"$f":"[1]Итог!G227","v":""},{"$f":"[1]Итог!H227","v":""},{"$f":"[1]Итог!I227","v":""},{"$f":"[1]Итог!J227","v":""},{"$f":"[1]Итог!K227","v":""},{"$f":"[1]Итог!L227","v":""},{"$f":"[1]Итог!M227","v":""}]
[{"$f":"[1]Итог!B228","v":""},{"$f":"[1]Итог!D228","v":""},{"$f":"[1]Итог!E228","v":""},{"$f":"[1]Итог!F228","v":""},{"$f":"[1]Итог!G228","v":""},{"$f":"[1]Итог!H228","v":""},{"$f":"[1]Итог!I228","v":""},{"$f":"[1]Итог!J228","v":""},{"$f":"[1]Итог!K228","v":""},{"$f":"[1]Итог!L228","v":""},{"$f":"[1]Итог!M228","v":""}]
[{"$f":"[1]Итог!B229","v":""},{"$f":"[1]Итог!D229","v":""},{"$f":"[1]Итог!E229","v":""},{"$f":"[1]Итог!F229","v":""},{"$f":"[1]Итог!G229","v":""},{"$f":"[1]Итог!H229","v":""},{"$f":"[1]Итог!I229","v":""},{"$f":"[1]Итог!J229","v":""},{"$f":"[1]Итог!K229","v":""},{"$f":"[1]Итог!L229","v":""},{"$f":"[1]Итог!M229","v":""}]
[{"$f":"[1]Итог!B230","v":""},{"$f":"[1]Итог!D230","v":""},{"$f":"[1]Итог!E230","v":""},{"$f":"[1]Итог!F230","v":""},{"$f":"[1]Итог!G230","v":""},{"$f":"[1]Итог!H230","v":""},{"$f":"[1]Итог!I230","v":""},{"$f":"[1]Итог!J230","v":""},{"$f":"[1]Итог!K230","v":""},{"$f":"[1]Итог!L230","v":""},{"$f":"[1]Итог!M230","v":""}]
[{"$f":"[1]Итог!B231","v":""},{"$f":"[1]Итог!D231","v":""},{"$f":"[1]Итог!E231","v":""},{"$f":"[1]Итог!F231","v":""},{"$f":"[1]Итог!G231","v":""},{"$f":"[1]Итог!H231","v":""},{"$f":"[1]Итог!I231","v":""},{"$f":"[1]Итог!J231","v":""},{"$f":"[1]Итог!K231","v":""},{"$f":"[1]Итог!L231","v":""},{"$f":"[1]Итог!M231","v":""}]
[{"$f":"[1]Итог!B232","v":""},{"$f":"[1]Итог!D232","v":""},{"$f":"[1]Итог!E232","v":""},{"$f":"[1]Итог!F232","v":""},{"$f":"[1]Итог!G232","v":""},{"$f":"[1]Итог!H232","v":""},{"$f":"[1]Итог!I232","v":""},{"$f":"[1]Итог!J232","v":""},{"$f":"[1]Итог!K232","v":""},{"$f":"[1]Итог!L232","v":""},{"$f":"[1]Итог!M232","v":""}]
[{"$f":"[1]Итог!B233","v":""},{"$f":"[1]Итог!D233","v":""},{"$f":"[1]Итог!E233","v":""},{"$f":"[1]Итог!F233","v":""},{"$f":"[1]Итог!G233","v":""},{"$f":"[1]Итог!H233","v":""},{"$f":"[1]Итог!I233","v":""},{"$f":"[1]Итог!J233","v":""},{"$f":"[1]Итог!K233","v":""},{"$f":"[1]Итог!L233","v":""},{"$f":"[1]Итог!M233","v":""}]
[{"$f":"[1]Итог!B234","v":""},{"$f":"[1]Итог!D234","v":""},{"$f":"[1]Итог!E234","v":""},{"$f":"[1]Итог!F234","v":""},{"$f":"[1]Итог!G234","v":""},{"$f":"[1]Итог!H234","v":""},{"$f":"[1]Итог!I234","v":""},{"$f":"[1]Итог!J234","v":""},{"$f":"[1]Итог!K234","v":""},{"$f":"[1]Итог!L234","v":""},{"$f":"[1]Итог!M234","v":""}]
[{"$f":"[1]Итог!B235","v":""},{"$f":"[1]Итог!D235","v":""},{"$f":"[1]Итог!E235","v":""},{"$f":"[1]Итог!F235","v":""},{"$f":"[1]Итог!G235","v":""},{"$f":"[1]Итог!H235","v":""},{"$f":"[1]Итог!I235","v":""},{"$f":"[1]Итог!J235","v":""},{"$f":"[1]Итог!K235","v":""},{"$f":"[1]Итог!L235","v":""},{"$f":"[1]Итог!M235","v":""}]
[{"$f":"[1]Итог!B236","v":""},{"$f":"[1]Итог!D236","v":""},{"$f":"[1]Итог!E236","v":""},{"$f":"[1]Итог!F236","v":""},{"$f":"[1]Итог!G236","v":""},{"$f":"[1]Итог!H236","v":""},{"$f":"[1]Итог!I236","v":""},{"$f":"[1]Итог!J236","v":""},{"$f":"[1]Итог!K236","v":""},{"$f":"[1]Итог!L236","v":""},{"$f":"[1]Итог!M236","v":""}]
[{"$f":"[1]Итог!B237","v":""},{"$f":"[1]Итог!D237","v":""},{"$f":"[1]Итог!E237","v":""},{"$f":"[1]Итог!F237","v":""},{"$f":"[1]Итог!G237","v":""},{"$f":"[1]Итог!H237","v":""},{"$f":"[1]Итог!I237","v":""},{"$f":"[1]Итог!J237","v":""},{"$f":"[1]Итог!K237","v":""},{"$f":"[1]Итог!L237","v":""},{"$f":"[1]Итог!M237","v":""}]
[{"$f":"[1]Итог!B238","v":""},{"$f":"[1]Итог!D238","v":""},{"$f":"[1]Итог!E238","v":""},{"$f":"[1]Итог!F238","v":""},{"$f":"[1]Итог!G238","v":""},{"$f":"[1]Итог!H238","v":""},{"$f":"[1]Итог!I238","v":""},{"$f":"[1]Итог!J238","v":""},{"$f":"[1]Итог!K238","v":""},{"$f":"[1]Итог!L238","v":""},{"$f":"[1]Итог!M238","v":""}]
[{"$f":"[1]Итог!B239","v":""},{"$f":"[1]Итог!D239","v":""},{"$f":"[1]Итог!E239","v":""},{"$f":"[1]Итог!F239","v":""},{"$f":"[1]Итог!G239","v":""},{"$f":"[1]Итог!H239","v":""},{"$f":"[1]Итог!I239","v":""},{"$f":"[1]Итог!J239","v":""},{"$f":"[1]Итог!K239","v":""},{"$f":"[1]Итог!L239","v":""},{"$f":"[1]Итог!M239","v":""}]
[{"$f":"[1]Итог!B240","v":""},{"$f":"[1]Итог!D240","v":""},{"$f":"[1]Итог!E240","v":""},{"$f":"[1]Итог!F240","v":""},{"$f":"[1]Итог!G240","v":""},{"$f":"[1]Итог!H240","v":""},{"$f":"[1]Итог!I240","v":""},{"$f":"[1]Итог!J240","v":""},{"$f":"[1]Итог!K240","v":""},{"$f":"[1]Итог!L240","v":""},{"$f":"[1]Итог!M240","v":""}]
[{"$f":"[1]Итог!B241","v":""},{"$f":"[1]Итог!D241","v":""},{"$f":"[1]Итог!E241","v":""},{"$f":"[1]Итог!F241","v":""},{"$f":"[1]Итог!G241","v":""},{"$f":"[1]Итог!H241","v":""},{"$f":"[1]Итог!I241","v":""},{"$f":"[1]Итог!J241","v":""},{"$f":"[1]Итог!K241","v":""},{"$f":"[1]Итог!L241","v":""},{"$f":"[1]Итог!M241","v":""}]
[{"$f":"[1]Итог!B242","v":""},{"$f":"[1]Итог!D242","v":""},{"$f":"[1]Итог!E242","v":""},{"$f":"[1]Итог!F242","v":""},{"$f":"[1]Итог!G242","v":""},{"$f":"[1]Итог!H242","v":""},{"$f":"[1]Итог!I242","v":""},{"$f":"[1]Итог!J242","v":""},{"$f":"[1]Итог!K242","v":""},{"$f":"[1]Итог!L242","v":""},{"$f":"[1]Итог!M242","v":""}]
[{"$f":"[1]Итог!B243","v":""},{"$f":"[1]Итог!D243","v":""},{"$f":"[1]Итог!E243","v":""},{"$f":"[1]Итог!F243","v":""},{"$f":"[1]Итог!G243","v":""},{"$f":"[1]Итог!H243","v":""},{"$f":"[1]Итог!I243","v":""},{"$f":"[1]Итог!J243","v":""},{"$f":"[1]Итог!K243","v":""},{"$f":"[1]Итог!L243","v":""},{"$f":"[1]Итог!M243","v":""}]
[{"$f":"[1]Итог!B244","v":""},{"$f":"[1]Итог!D244","v":""},{"$f":"[1]Итог!E244","v":""},{"$f":"[1]Итог!F244","v":""},{"$f":"[1]Итог!G244","v":""},{"$f":"[1]Итог!H244","v":""},{"$f":"[1]Итог!I244","v":""},{"$f":"[1]Итог!J244","v":""},{"$f":"[1]Итог!K244","v":""},{"$f":"[1]Итог!L244","v":""},{"$f":"[1]Итог!M244","v":""}]
[{"$f":"[1]Итог!B245","v":""},{"$f":"[1]Итог!D245","v":""},{"$f":"[1]Итог!E245","v":""},{"$f":"[1]Итог!F245","v":""},{"$f":"[1]Итог!G245","v":""},{"$f":"[1]Итог!H245","v":""},{"$f":"[1]Итог!I245","v":""},{"$f":"[1]Итог!J245","v":""},{"$f":"[1]Итог!K245","v":""},{"$f":"[1]Итог!L245","v":""},{"$f":"[1]Итог!M245","v":""}]
[{"$f":"[1]Итог!B246","v":""},{"$f":"[1]Итог!D246","v":""},{"$f":"[1]Итог!E246","v":""},{"$f":"[1]Итог!F246","v":""},{"$f":"[1]Итог!G246","v":""},{"$f":"[1]Итог!H246","v":""},{"$f":"[1]Итог!I246","v":""},{"$f":"[1]Итог!J246","v":""},{"$f":"[1]Итог!K246","v":""},{"$f":"[1]Итог!L246","v":""},{"$f":"[1]Итог!M246","v":""}]
[{"$f":"[1]Итог!B247","v":""},{"$f":"[1]Итог!D247","v":""},{"$f":"[1]Итог!E247","v":""},{"$f":"[1]Итог!F247","v":""},{"$f":"[1]Итог!G247","v":""},{"$f":"[1]Итог!H247","v":""},{"$f":"[1]Итог!I247","v":""},{"$f":"[1]Итог!J247","v":""},{"$f":"[1]Итог!K247","v":""},{"$f":"[1]Итог!L247","v":""},{"$f":"[1]Итог!M247","v":""}]
[{"$f":"[1]Итог!B248","v":""},{"$f":"[1]Итог!D248","v":""},{"$f":"[1]Итог!E248","v":""},{"$f":"[1]Итог!F248","v":""},{"$f":"[1]Итог!G248","v":""},{"$f":"[1]Итог!H248","v":""},{"$f":"[1]Итог!I248","v":""},{"$f":"[1]Итог!J248","v":""},{"$f":"[1]Итог!K248","v":""},{"$f":"[1]Итог!L248","v":""},{"$f":"[1]Итог!M248","v":""}]
[{"$f":"[1]Итог!B249","v":""},{"$f":"[1]Итог!D249","v":""},{"$f":"[1]Итог!E249","v":""},{"$f":"[1]Итог!F249","v":""},{"$f":"[1]Итог!G249","v":""},{"$f":"[1]Итог!H249","v":""},{"$f":"[1]Итог!I249","v":""},{"$f":"[1]Итог!J249","v":""},{"$f":"[1]Итог!K249","v":""},{"$f":"[1]Итог!L249","v":""},{"$f":"[1]Итог!M249","v":""}]
[{"$f":"[1]Итог!B250","v":""},{"$f":"[1]Итог!D250","v":""},{"$f":"[1]Итог!E250","v":""},{"$f":"[1]Итог!F250","v":""},{"$f":"[1]Итог!G250","v":""},{"$f":"[1]Итог!H250","v":""},{"$f":"[1]Итог!I250","v":""},{"$f":"[1]Итог!J250","v":""},{"$f":"[1]Итог!K250","v":""},{"$f":"[1]Итог!L250","v":""},{"$f":"[1]Итог!M250","v":""}]
[{"$f":"[1]Итог!B251","v":""},{"$f":"[1]Итог!D251","v":""},{"$f":"[1]Итог!E251","v":""},{"$f":"[1]Итог!F251","v":""},{"$f":"[1]Итог!G251","v":""},{"$f":"[1]Итог!H251","v":""},{"$f":"[1]Итог!I251","v":""},{"$f":"[1]Итог!J251","v":""},{"$f":"[1]Итог!K251","v":""},{"$f":"[1]Итог!L251","v":""},{"$f":"[1]Итог!M251","v":""}]
[{"$f":"[1]Итог!B252","v":""},{"$f":"[1]Итог!D252","v":""},{"$f":"[1]Итог!E252","v":""},{"$f":"[1]Итог!F252","v":""},{"$f":"[1]Итог!G252","v":""},{"$f":"[1]Итог!H252","v":""},{"$f":"[1]Итог!I252","v":""},{"$f":"[1]Итог!J252","v":""},{"$f":"[1]Итог!K252","v":""},{"$f":"[1]Итог!L252","v":""},{"$f":"[1]Итог!M252","v":""}]
[{"$f":"[1]Итог!B253","v":""},{"$f":"[1]Итог!D253","v":""},{"$f":"[1]Итог!E253","v":""},{"$f":"[1]Итог!F253","v":""},{"$f":"[1]Итог!G253","v":""},{"$f":"[1]Итог!H253","v":""},{"$f":"[1]Итог!I253","v":""},{"$f":"[1]Итог!J253","v":""},{"$f":"[1]Итог!K253","v":""},{"$f":"[1]Итог!L253","v":""},{"$f":"[1]Итог!M253","v":""}]
[{"$f":"[1]Итог!B254","v":""},{"$f":"[1]Итог!D254","v":""},{"$f":"[1]Итог!E254","v":""},{"$f":"[1]Итог!F254","v":""},{"$f":"[1]Итог!G254","v":""},{"$f":"[1]Итог!H254","v":""},{"$f":"[1]Итог!I254","v":""},{"$f":"[1]Итог!J254","v":""},{"$f":"[1]Итог!K254","v":""},{"$f":"[1]Итог!L254","v":""},{"$f":"[1]Итог!M254","v":""}]
[{"$f":"[1]Итог!B255","v":""},{"$f":"[1]Итог!D255","v":""},{"$f":"[1]Итог!E255","v":""},{"$f":"[1]Итог!F255","v":""},{"$f":"[1]Итог!G255","v":""},{"$f":"[1]Итог!H255","v":""},{"$f":"[1]Итог!I255","v":""},{"$f":"[1]Итог!J255","v":""},{"$f":"[1]Итог!K255","v":""},{"$f":"[1]Итог!L255","v":""},{"$f":"[1]Итог!M255","v":""}]
[{"$f":"[1]Итог!B256","v":""},{"$f":"[1]Итог!D256","v":""},{"$f":"[1]Итог!E256","v":""},{"$f":"[1]Итог!F256","v":""},{"$f":"[1]Итог!G256","v":""},{"$f":"[1]Итог!H256","v":""},{"$f":"[1]Итог!I256","v":""},{"$f":"[1]Итог!J256","v":""},{"$f":"[1]Итог!K256","v":""},{"$f":"[1]Итог!L256","v":""},{"$f":"[1]Итог!M256","v":""}]
[{"$f":"[1]Итог!B257","v":""},{"$f":"[1]Итог!D257","v":""},{"$f":"[1]Итог!E257","v":""},{"$f":"[1]Итог!F257","v":""},{"$f":"[1]Итог!G257","v":""},{"$f":"[1]Итог!H257","v":""},{"$f":"[1]Итог!I257","v":""},{"$f":"[1]Итог!J257","v":""},{"$f":"[1]Итог!K257","v":""},{"$f":"[1]Итог!L257","v":""},{"$f":"[1]Итог!M257","v":""}]
[{"$f":"[1]Итог!B258","v":""},{"$f":"[1]Итог!D258","v":""},{"$f":"[1]Итог!E258","v":""},{"$f":"[1]Итог!F258","v":""},{"$f":"[1]Итог!G258","v":""},{"$f":"[1]Итог!H258","v":""},{"$f":"[1]Итог!I258","v":""},{"$f":"[1]Итог!J258","v":""},{"$f":"[1]Итог!K258","v":""},{"$f":"[1]Итог!L258","v":""},{"$f":"[1]Итог!M258","v":""}]
[{"$f":"[1]Итог!B259","v":""},{"$f":"[1]Итог!D259","v":""},{"$f":"[1]Итог!E259","v":""},{"$f":"[1]Итог!F259","v":""},{"$f":"[1]Итог!G259","v":""},{"$f":"[1]Итог!H259","v":""},{"$f":"[1]Итог!I259","v":""},{"$f":"[1]Итог!J259","v":""},{"$f":"[1]Итог!K259","v":""},{"$f":"[1]Итог!L259","v":""},{"$f":"[1]Итог!M259","v":""}]
[{"$f":"[1]Итог!B260","v":""},{"$f":"[1]Итог!D260","v":""},{"$f":"[1]Итог!E260","v":""},{"$f":"[1]Итог!F260","v":""},{"$f":"[1]Итог!G260","v":""},{"$f":"[1]Итог!H260","v":""},{"$f":"[1]Итог!I260","v":""},{"$f":"[1]Итог!J260","v":""},{"$f":"[1]Итог!K260","v":""},{"$f":"[1]Итог!L260","v":""},{"$f":"[1]Итог!M260","v":""}]
{"$rows_left_out":243}