{"text_format":"1","workbook":"xlsx","n_sheets":10,"sheets":["ТРУБА","ЛИСТ","ПРОВОЛОКА","ПВХ","Д-труба","Д-лист","Д-проволока","Д-пвх","\"З\"","Лист2"],"not_rendered":{"charts":0,"images":0,"macros":1,"external_links":0,"defined_names":5,"comments":2,"pivot_tables":0},"unopened":[],"bounds":{"document_bytes":16777216,"sheet_cells":100000,"rows_first":2000,"rows_last":500,"rows_between":2000,"halvings":0,"cell_chars":16384,"cell_head_chars":4096},"cells_cut":0,"cells_raw":0,"read":"whole","date_system":"1900"}

{"sheet":"ТРУБА","index":0,"n_rows":148,"n_cols":42,"rows_kept":148,"cut":false,"hidden":false,"merged":[[117,8,117,9],[117,14,117,16],[58,6,59,6],[58,7,59,7],[58,8,59,8],[58,9,59,9],[58,11,59,11],[58,16,58,17],[58,15,59,15],[117,27,117,30],[117,24,117,26],[117,18,117,20],[58,24,59,24],[58,22,59,22],[58,19,58,20],[58,18,59,18],[58,21,59,21],[58,23,59,23],[1,13,1,14],[58,1,59,1],[58,2,59,2],[58,3,59,3],[58,4,59,4],[58,5,59,5],[2,7,2,9],[3,2,3,13],[58,12,59,12],[58,13,58,14],[5,1,5,5],[5,13,6,13]]}
["z",null,null,null,null,null,null,null,null,null,"z","z","z",null,null,null,null,null,null,null,null,null,null,"z","z","z","z","z","z","z","z","z","z","z","z","z","z","z","z","z","z","z"]
[null,null,null,null,null,"            Приложение № 2 к ЛЗК ___",null,null,null,null,null,null,null,{"$f":"TODAY()","v":"2023-07-27"}]
[null,null,null,null,null,null,null,{"$f":"CONCATENATE(\"НЕ СОВПАДЕНИЕ \",ROUND(M6-M7,3),\" кг.\")","v":"НЕ СОВПАДЕНИЕ 22,196 кг."}]
[null,null,"(19137.022.20.9016) Кронштейн 240 "]
[null,null,{"$f":"CONCATENATE(\"Изделие из: \",IF(ТРУБА!M7>0,\"ТРУБА, \",\"\"),IF(ЛИСТ!L7>0,\"ЛИСТ, \",\"\"),IF(ПРОВОЛОКА!R83>0,\"ПРОВОЛОКА, \",\"\"),IF(ПВХ!I60>0,\"ПВХ \",\"\"))","v":"Изделие из: ТРУБА, ЛИСТ, ПРОВОЛОКА, ПВХ "},null,null,null,null,null,null,null,null,"Коэфициент ","Маса "]
[null,"См. Косые резы и выполнять согласно чертежа",null,null,null,null,null,null,"План / шт",110,null,null,{"$f":"SUM(Таблица1[Столбец19])","v":162.91440272331238},"\"дырки\""]
[null,"№ п/п","Длина ","Ширина (условная расчет программы)","Кол-во\nна\nизделие","Вращение детали\n1 - да\n0 - нет","Толщина","Материал\n(профиль трубы)","Наименование \nдетали","кол-во на план","ГОСТ",{"$f":"SUM(J8:J57)","v":1430},{"$f":"SUM(M8:M57)","v":140.71805000000001},null,null,null,null,null,"номерация"]
[{"$f":"IF(E8=0,\"z\",\"\")","v":""},{"$f":"IF(J8=0,\"\",S8)","v":1},425,500,2,0,{"$f":"IF(K8=\"\",\"\",VLOOKUP(K8,Таблица1[[#All],[ГОСТ]:[точка]],8,0))","v":"1"},{"$f":"IF(K8=\"\",\"\",VLOOKUP(K8,Таблица1[[#All],[ГОСТ]:[точка]],2,0))","v":"Труба 10х10"},"перемычка",{"$f":"E8*$J$6","v":220},"Труба 10х10х1",{"$f":"IF(K8=\"\",\"\",VLOOKUP(K8,Таблица1[[#All],[ГОСТ]:[коэф]],9,0))","v":0.54},{"$f":"IFERROR(C8*D8*J8*L8/1000000-IF(E8=0,0,N8),\"\")","v":25.245000000000001},0,null,null,null,null,{"$f":"IF(J8=0,0,1)","v":1}]
[{"$f":"IF(E9=0,\"z\",\"\")","v":""},2,280,500,2,0,{"$f":"IF(K9=\"\",\"\",VLOOKUP(K9,Таблица1[[#All],[ГОСТ]:[точка]],8,0))","v":"12"},{"$f":"IF(K9=\"\",\"\",VLOOKUP(K9,Таблица1[[#All],[ГОСТ]:[точка]],2,0))","v":"Круг 12"},"основа",{"$f":"E9*$J$6","v":220},"Круг 12",{"$f":"IF(K9=\"\",\"\",VLOOKUP(K9,Таблица1[[#All],[ГОСТ]:[коэф]],9,0))","v":1.776},{"$f":"IFERROR(C9*D9*J9*L9/1000000-IF(E9=0,0,N9),\"\")","v":54.700800000000001},0,null,null,null,null,{"$f":"IF(J9=0,S8,S8+1)","v":2}]
["",3,273,500,1,0,{"$f":"IF(K10=\"\",\"\",VLOOKUP(K10,Таблица1[[#All],[ГОСТ]:[точка]],8,0))","v":"1.2"},{"$f":"IF(K10=\"\",\"\",VLOOKUP(K10,Таблица1[[#All],[ГОСТ]:[точка]],2,0))","v":"Труба 25х25"},"херня",110,"Труба 25х25х1,2",{"$f":"IF(K10=\"\",\"\",VLOOKUP(K10,Таблица1[[#All],[ГОСТ]:[коэф]],9,0))","v":1.75},26.276250000000001,null,null,null,null,null,3]
["z","",null,500,null,0,{"$f":"IF(K11=\"\",\"\",VLOOKUP(K11,Таблица1[[#All],[ГОСТ]:[точка]],8,0))","v":"1"},{"$f":"IF(K11=\"\",\"\",VLOOKUP(K11,Таблица1[[#All],[ГОСТ]:[точка]],2,0))","v":"Труба 25х25"},null,0,"Труба 25х25х1",{"$f":"IF(K11=\"\",\"\",VLOOKUP(K11,Таблица1[[#All],[ГОСТ]:[коэф]],9,0))","v":1.48},0,null,null,null,null,null,3]
["z","",null,500,null,0,{"$f":"IF(K12=\"\",\"\",VLOOKUP(K12,Таблица1[[#All],[ГОСТ]:[точка]],8,0))","v":""},{"$f":"IF(K12=\"\",\"\",VLOOKUP(K12,Таблица1[[#All],[ГОСТ]:[точка]],2,0))","v":""},null,0,null,{"$f":"IF(K12=\"\",\"\",VLOOKUP(K12,Таблица1[[#All],[ГОСТ]:[коэф]],9,0))","v":""},"",null,null,null,null,null,3]
["z","",null,500,null,0,{"$f":"IF(K13=\"\",\"\",VLOOKUP(K13,Таблица1[[#All],[ГОСТ]:[точка]],8,0))","v":""},{"$f":"IF(K13=\"\",\"\",VLOOKUP(K13,Таблица1[[#All],[ГОСТ]:[точка]],2,0))","v":""},null,0,null,{"$f":"IF(K13=\"\",\"\",VLOOKUP(K13,Таблица1[[#All],[ГОСТ]:[коэф]],9,0))","v":""},"",null,null,null,null,null,3]
[{"$f":"IF(E14=0,\"z\",\"\")","v":"z"},{"$f":"IF(J14=0,\"\",S14)","v":""},null,500,null,0,{"$f":"IF(K14=\"\",\"\",VLOOKUP(K14,Таблица1[[#All],[ГОСТ]:[точка]],8,0))","v":""},{"$f":"IF(K14=\"\",\"\",VLOOKUP(K14,Таблица1[[#All],[ГОСТ]:[точка]],2,0))","v":""},null,{"$f":"E14*$J$6","v":0},null,{"$f":"IF(K14=\"\",\"\",VLOOKUP(K14,Таблица1[[#All],[ГОСТ]:[коэф]],9,0))","v":""},{"$f":"IFERROR(C14*D14*J14*L14/1000000-IF(E14=0,0,N14),\"\")","v":""},null,null,null,null,null,{"$f":"IF(J14=0,S13,S13+1)","v":3}]
["z","",null,500,null,0,{"$f":"IF(K15=\"\",\"\",VLOOKUP(K15,Таблица1[[#All],[ГОСТ]:[точка]],8,0))","v":""},{"$f":"IF(K15=\"\",\"\",VLOOKUP(K15,Таблица1[[#All],[ГОСТ]:[точка]],2,0))","v":""},null,0,null,{"$f":"IF(K15=\"\",\"\",VLOOKUP(K15,Таблица1[[#All],[ГОСТ]:[коэф]],9,0))","v":""},"",null,null,null,null,null,3]
["z","",null,500,null,0,{"$f":"IF(K16=\"\",\"\",VLOOKUP(K16,Таблица1[[#All],[ГОСТ]:[точка]],8,0))","v":""},{"$f":"IF(K16=\"\",\"\",VLOOKUP(K16,Таблица1[[#All],[ГОСТ]:[точка]],2,0))","v":""},null,0,null,{"$f":"IF(K16=\"\",\"\",VLOOKUP(K16,Таблица1[[#All],[ГОСТ]:[коэф]],9,0))","v":""},"",null,null,null,null,null,3]
["z","",null,500,null,0,{"$f":"IF(K17=\"\",\"\",VLOOKUP(K17,Таблица1[[#All],[ГОСТ]:[точка]],8,0))","v":""},{"$f":"IF(K17=\"\",\"\",VLOOKUP(K17,Таблица1[[#All],[ГОСТ]:[точка]],2,0))","v":""},null,0,null,{"$f":"IF(K17=\"\",\"\",VLOOKUP(K17,Таблица1[[#All],[ГОСТ]:[коэф]],9,0))","v":""},"",null,null,null,null,null,3]
["z","",null,500,null,0,{"$f":"IF(K18=\"\",\"\",VLOOKUP(K18,Таблица1[[#All],[ГОСТ]:[точка]],8,0))","v":""},{"$f":"IF(K18=\"\",\"\",VLOOKUP(K18,Таблица1[[#All],[ГОСТ]:[точка]],2,0))","v":""},null,0,null,{"$f":"IF(K18=\"\",\"\",VLOOKUP(K18,Таблица1[[#All],[ГОСТ]:[коэф]],9,0))","v":""},"",null,null,null,null,null,3]
["z","",null,500,null,0,{"$f":"IF(K19=\"\",\"\",VLOOKUP(K19,Таблица1[[#All],[ГОСТ]:[точка]],8,0))","v":""},{"$f":"IF(K19=\"\",\"\",VLOOKUP(K19,Таблица1[[#All],[ГОСТ]:[точка]],2,0))","v":""},null,0,null,{"$f":"IF(K19=\"\",\"\",VLOOKUP(K19,Таблица1[[#All],[ГОСТ]:[коэф]],9,0))","v":""},"",null,null,null,null,null,3]
["z","",null,500,null,0,{"$f":"IF(K20=\"\",\"\",VLOOKUP(K20,Таблица1[[#All],[ГОСТ]:[точка]],8,0))","v":""},{"$f":"IF(K20=\"\",\"\",VLOOKUP(K20,Таблица1[[#All],[ГОСТ]:[точка]],2,0))","v":""},null,0,null,{"$f":"IF(K20=\"\",\"\",VLOOKUP(K20,Таблица1[[#All],[ГОСТ]:[коэф]],9,0))","v":""},"",null,null,null,null,null,3]
["z","",null,500,null,0,{"$f":"IF(K21=\"\",\"\",VLOOKUP(K21,Таблица1[[#All],[ГОСТ]:[точка]],8,0))","v":""},{"$f":"IF(K21=\"\",\"\",VLOOKUP(K21,Таблица1[[#All],[ГОСТ]:[точка]],2,0))","v":""},null,0,null,{"$f":"IF(K21=\"\",\"\",VLOOKUP(K21,Таблица1[[#All],[ГОСТ]:[коэф]],9,0))","v":""},"",null,null,null,null,null,3]
["z","",null,500,null,0,{"$f":"IF(K22=\"\",\"\",VLOOKUP(K22,Таблица1[[#All],[ГОСТ]:[точка]],8,0))","v":""},{"$f":"IF(K22=\"\",\"\",VLOOKUP(K22,Таблица1[[#All],[ГОСТ]:[точка]],2,0))","v":""},null,0,null,{"$f":"IF(K22=\"\",\"\",VLOOKUP(K22,Таблица1[[#All],[ГОСТ]:[коэф]],9,0))","v":""},"",null,null,null,null,null,3]
["z","",null,500,null,0,{"$f":"IF(K23=\"\",\"\",VLOOKUP(K23,Таблица1[[#All],[ГОСТ]:[точка]],8,0))","v":""},{"$f":"IF(K23=\"\",\"\",VLOOKUP(K23,Таблица1[[#All],[ГОСТ]:[точка]],2,0))","v":""},null,0,null,{"$f":"IF(K23=\"\",\"\",VLOOKUP(K23,Таблица1[[#All],[ГОСТ]:[коэф]],9,0))","v":""},"",null,null,null,null,null,3]
["z","",null,500,null,0,{"$f":"IF(K24=\"\",\"\",VLOOKUP(K24,Таблица1[[#All],[ГОСТ]:[точка]],8,0))","v":""},{"$f":"IF(K24=\"\",\"\",VLOOKUP(K24,Таблица1[[#All],[ГОСТ]:[точка]],2,0))","v":""},null,0,null,{"$f":"IF(K24=\"\",\"\",VLOOKUP(K24,Таблица1[[#All],[ГОСТ]:[коэф]],9,0))","v":""},"",null,null,null,null,null,3]
["",4,56,500,8,0,{"$f":"IF(K25=\"\",\"\",VLOOKUP(K25,Таблица1[[#All],[ГОСТ]:[точка]],8,0))","v":"1.2"},{"$f":"IF(K25=\"\",\"\",VLOOKUP(K25,Таблица1[[#All],[ГОСТ]:[точка]],2,0))","v":"Труба пл.ов. 30х15"},null,880,"Труба пл.ов. 30х15х1,2",{"$f":"IF(K25=\"\",\"\",VLOOKUP(K25,Таблица1[[#All],[ГОСТ]:[коэф]],9,0))","v":1.4},34.496000000000002,null,null,null,null,null,4]
["z","",null,500,null,0,{"$f":"IF(K26=\"\",\"\",VLOOKUP(K26,Таблица1[[#All],[ГОСТ]:[точка]],8,0))","v":""},{"$f":"IF(K26=\"\",\"\",VLOOKUP(K26,Таблица1[[#All],[ГОСТ]:[точка]],2,0))","v":""},null,0,null,{"$f":"IF(K26=\"\",\"\",VLOOKUP(K26,Таблица1[[#All],[ГОСТ]:[коэф]],9,0))","v":""},"",null,null,null,null,null,4]
["z","",null,500,null,0,{"$f":"IF(K27=\"\",\"\",VLOOKUP(K27,Таблица1[[#All],[ГОСТ]:[точка]],8,0))","v":""},{"$f":"IF(K27=\"\",\"\",VLOOKUP(K27,Таблица1[[#All],[ГОСТ]:[точка]],2,0))","v":""},null,0,null,{"$f":"IF(K27=\"\",\"\",VLOOKUP(K27,Таблица1[[#All],[ГОСТ]:[коэф]],9,0))","v":""},"",null,null,null,null,null,4]
["z","",null,500,null,0,{"$f":"IF(K28=\"\",\"\",VLOOKUP(K28,Таблица1[[#All],[ГОСТ]:[точка]],8,0))","v":""},{"$f":"IF(K28=\"\",\"\",VLOOKUP(K28,Таблица1[[#All],[ГОСТ]:[точка]],2,0))","v":""},null,0,null,{"$f":"IF(K28=\"\",\"\",VLOOKUP(K28,Таблица1[[#All],[ГОСТ]:[коэф]],9,0))","v":""},"",null,null,null,null,null,4]
["z","",null,500,null,0,{"$f":"IF(K29=\"\",\"\",VLOOKUP(K29,Таблица1[[#All],[ГОСТ]:[точка]],8,0))","v":""},{"$f":"IF(K29=\"\",\"\",VLOOKUP(K29,Таблица1[[#All],[ГОСТ]:[точка]],2,0))","v":""},null,0,null,{"$f":"IF(K29=\"\",\"\",VLOOKUP(K29,Таблица1[[#All],[ГОСТ]:[коэф]],9,0))","v":""},"",null,null,null,null,null,4]
["z","",null,500,null,0,{"$f":"IF(K30=\"\",\"\",VLOOKUP(K30,Таблица1[[#All],[ГОСТ]:[точка]],8,0))","v":""},{"$f":"IF(K30=\"\",\"\",VLOOKUP(K30,Таблица1[[#All],[ГОСТ]:[точка]],2,0))","v":""},null,0,null,{"$f":"IF(K30=\"\",\"\",VLOOKUP(K30,Таблица1[[#All],[ГОСТ]:[коэф]],9,0))","v":""},"",null,null,null,null,null,4]
["z","",null,500,null,0,{"$f":"IF(K31=\"\",\"\",VLOOKUP(K31,Таблица1[[#All],[ГОСТ]:[точка]],8,0))","v":""},{"$f":"IF(K31=\"\",\"\",VLOOKUP(K31,Таблица1[[#All],[ГОСТ]:[точка]],2,0))","v":""},null,0,null,{"$f":"IF(K31=\"\",\"\",VLOOKUP(K31,Таблица1[[#All],[ГОСТ]:[коэф]],9,0))","v":""},"",null,null,null,null,null,4]
["z","",null,500,null,0,{"$f":"IF(K32=\"\",\"\",VLOOKUP(K32,Таблица1[[#All],[ГОСТ]:[точка]],8,0))","v":""},{"$f":"IF(K32=\"\",\"\",VLOOKUP(K32,Таблица1[[#All],[ГОСТ]:[точка]],2,0))","v":""},null,0,null,{"$f":"IF(K32=\"\",\"\",VLOOKUP(K32,Таблица1[[#All],[ГОСТ]:[коэф]],9,0))","v":""},"",null,null,null,null,null,4]
[{"$f":"IF(E33=0,\"z\",\"\")","v":"z"},{"$f":"IF(J33=0,\"\",S33)","v":""},null,500,null,0,{"$f":"IF(K33=\"\",\"\",VLOOKUP(K33,Таблица1[[#All],[ГОСТ]:[точка]],8,0))","v":""},{"$f":"IF(K33=\"\",\"\",VLOOKUP(K33,Таблица1[[#All],[ГОСТ]:[точка]],2,0))","v":""},null,{"$f":"E33*$J$6","v":0},null,{"$f":"IF(K33=\"\",\"\",VLOOKUP(K33,Таблица1[[#All],[ГОСТ]:[коэф]],9,0))","v":""},{"$f":"IFERROR(C33*D33*J33*L33/1000000-IF(E33=0,0,N33),\"\")","v":""},null,null,null,null,null,{"$f":"IF(J33=0,S32,S32+1)","v":4}]
["z","",null,500,null,0,{"$f":"IF(K34=\"\",\"\",VLOOKUP(K34,Таблица1[[#All],[ГОСТ]:[точка]],8,0))","v":""},{"$f":"IF(K34=\"\",\"\",VLOOKUP(K34,Таблица1[[#All],[ГОСТ]:[точка]],2,0))","v":""},null,0,null,{"$f":"IF(K34=\"\",\"\",VLOOKUP(K34,Таблица1[[#All],[ГОСТ]:[коэф]],9,0))","v":""},"",null,null,null,null,null,4]
["z","",null,500,null,0,{"$f":"IF(K35=\"\",\"\",VLOOKUP(K35,Таблица1[[#All],[ГОСТ]:[точка]],8,0))","v":""},{"$f":"IF(K35=\"\",\"\",VLOOKUP(K35,Таблица1[[#All],[ГОСТ]:[точка]],2,0))","v":""},null,0,null,{"$f":"IF(K35=\"\",\"\",VLOOKUP(K35,Таблица1[[#All],[ГОСТ]:[коэф]],9,0))","v":""},"",null,null,null,null,null,4]
["z","",null,500,null,0,{"$f":"IF(K36=\"\",\"\",VLOOKUP(K36,Таблица1[[#All],[ГОСТ]:[точка]],8,0))","v":""},{"$f":"IF(K36=\"\",\"\",VLOOKUP(K36,Таблица1[[#All],[ГОСТ]:[точка]],2,0))","v":""},null,0,null,{"$f":"IF(K36=\"\",\"\",VLOOKUP(K36,Таблица1[[#All],[ГОСТ]:[коэф]],9,0))","v":""},"",null,null,null,null,null,4]
["z","",null,500,null,0,{"$f":"IF(K37=\"\",\"\",VLOOKUP(K37,Таблица1[[#All],[ГОСТ]:[точка]],8,0))","v":""},{"$f":"IF(K37=\"\",\"\",VLOOKUP(K37,Таблица1[[#All],[ГОСТ]:[точка]],2,0))","v":""},null,0,null,{"$f":"IF(K37=\"\",\"\",VLOOKUP(K37,Таблица1[[#All],[ГОСТ]:[коэф]],9,0))","v":""},"",null,null,null,null,null,4]
["z","",null,500,null,0,{"$f":"IF(K38=\"\",\"\",VLOOKUP(K38,Таблица1[[#All],[ГОСТ]:[точка]],8,0))","v":"1"},{"$f":"IF(K38=\"\",\"\",VLOOKUP(K38,Таблица1[[#All],[ГОСТ]:[точка]],2,0))","v":"Труба 20х20"},null,0,"Труба 20х20х1",{"$f":"IF(K38=\"\",\"\",VLOOKUP(K38,Таблица1[[#All],[ГОСТ]:[коэф]],9,0))","v":1.248},0,null,null,null,null,null,4]
["z","",null,500,null,0,{"$f":"IF(K39=\"\",\"\",VLOOKUP(K39,Таблица1[[#All],[ГОСТ]:[точка]],8,0))","v":""},{"$f":"IF(K39=\"\",\"\",VLOOKUP(K39,Таблица1[[#All],[ГОСТ]:[точка]],2,0))","v":""},null,0,null,{"$f":"IF(K39=\"\",\"\",VLOOKUP(K39,Таблица1[[#All],[ГОСТ]:[коэф]],9,0))","v":""},"",null,null,null,null,null,4]
["z","",null,500,null,0,{"$f":"IF(K40=\"\",\"\",VLOOKUP(K40,Таблица1[[#All],[ГОСТ]:[точка]],8,0))","v":""},{"$f":"IF(K40=\"\",\"\",VLOOKUP(K40,Таблица1[[#All],[ГОСТ]:[точка]],2,0))","v":""},null,0,null,{"$f":"IF(K40=\"\",\"\",VLOOKUP(K40,Таблица1[[#All],[ГОСТ]:[коэф]],9,0))","v":""},"",null,null,null,null,null,4]
["z","",null,500,null,0,{"$f":"IF(K41=\"\",\"\",VLOOKUP(K41,Таблица1[[#All],[ГОСТ]:[точка]],8,0))","v":""},{"$f":"IF(K41=\"\",\"\",VLOOKUP(K41,Таблица1[[#All],[ГОСТ]:[точка]],2,0))","v":""},null,0,null,{"$f":"IF(K41=\"\",\"\",VLOOKUP(K41,Таблица1[[#All],[ГОСТ]:[коэф]],9,0))","v":""},"",null,null,null,null,null,4]
["z","",null,500,null,0,{"$f":"IF(K42=\"\",\"\",VLOOKUP(K42,Таблица1[[#All],[ГОСТ]:[точка]],8,0))","v":""},{"$f":"IF(K42=\"\",\"\",VLOOKUP(K42,Таблица1[[#All],[ГОСТ]:[точка]],2,0))","v":""},null,0,null,{"$f":"IF(K42=\"\",\"\",VLOOKUP(K42,Таблица1[[#All],[ГОСТ]:[коэф]],9,0))","v":""},"",null,null,null,null,null,4]
["z","",null,500,null,0,{"$f":"IF(K43=\"\",\"\",VLOOKUP(K43,Таблица1[[#All],[ГОСТ]:[точка]],8,0))","v":"1.2"},{"$f":"IF(K43=\"\",\"\",VLOOKUP(K43,Таблица1[[#All],[ГОСТ]:[точка]],2,0))","v":"Труба 25х25"},null,0,"Труба 25х25х1,2",{"$f":"IF(K43=\"\",\"\",VLOOKUP(K43,Таблица1[[#All],[ГОСТ]:[коэф]],9,0))","v":1.75},0,null,null,null,null,null,4]
["z","",null,500,null,0,{"$f":"IF(K44=\"\",\"\",VLOOKUP(K44,Таблица1[[#All],[ГОСТ]:[точка]],8,0))","v":""},{"$f":"IF(K44=\"\",\"\",VLOOKUP(K44,Таблица1[[#All],[ГОСТ]:[точка]],2,0))","v":""},null,0,null,{"$f":"IF(K44=\"\",\"\",VLOOKUP(K44,Таблица1[[#All],[ГОСТ]:[коэф]],9,0))","v":""},"",null,null,null,null,null,4]
["z","",null,500,null,0,{"$f":"IF(K45=\"\",\"\",VLOOKUP(K45,Таблица1[[#All],[ГОСТ]:[точка]],8,0))","v":""},{"$f":"IF(K45=\"\",\"\",VLOOKUP(K45,Таблица1[[#All],[ГОСТ]:[точка]],2,0))","v":""},null,0,null,{"$f":"IF(K45=\"\",\"\",VLOOKUP(K45,Таблица1[[#All],[ГОСТ]:[коэф]],9,0))","v":""},"",null,null,null,null,null,4]
["z","",null,500,null,0,{"$f":"IF(K46=\"\",\"\",VLOOKUP(K46,Таблица1[[#All],[ГОСТ]:[точка]],8,0))","v":""},{"$f":"IF(K46=\"\",\"\",VLOOKUP(K46,Таблица1[[#All],[ГОСТ]:[точка]],2,0))","v":""},null,0,null,{"$f":"IF(K46=\"\",\"\",VLOOKUP(K46,Таблица1[[#All],[ГОСТ]:[коэф]],9,0))","v":""},"",null,null,null,null,null,4]
["z","",null,500,null,0,{"$f":"IF(K47=\"\",\"\",VLOOKUP(K47,Таблица1[[#All],[ГОСТ]:[точка]],8,0))","v":""},{"$f":"IF(K47=\"\",\"\",VLOOKUP(K47,Таблица1[[#All],[ГОСТ]:[точка]],2,0))","v":""},null,0,null,{"$f":"IF(K47=\"\",\"\",VLOOKUP(K47,Таблица1[[#All],[ГОСТ]:[коэф]],9,0))","v":""},"",null,null,null,null,null,4]
["z","",null,500,null,0,{"$f":"IF(K48=\"\",\"\",VLOOKUP(K48,Таблица1[[#All],[ГОСТ]:[точка]],8,0))","v":""},{"$f":"IF(K48=\"\",\"\",VLOOKUP(K48,Таблица1[[#All],[ГОСТ]:[точка]],2,0))","v":""},null,0,null,{"$f":"IF(K48=\"\",\"\",VLOOKUP(K48,Таблица1[[#All],[ГОСТ]:[коэф]],9,0))","v":""},"",null,null,null,null,null,4]
["z","",null,500,null,0,{"$f":"IF(K49=\"\",\"\",VLOOKUP(K49,Таблица1[[#All],[ГОСТ]:[точка]],8,0))","v":""},{"$f":"IF(K49=\"\",\"\",VLOOKUP(K49,Таблица1[[#All],[ГОСТ]:[точка]],2,0))","v":""},null,0,null,{"$f":"IF(K49=\"\",\"\",VLOOKUP(K49,Таблица1[[#All],[ГОСТ]:[коэф]],9,0))","v":""},"",null,null,null,null,null,4]
["z","",null,500,null,0,{"$f":"IF(K50=\"\",\"\",VLOOKUP(K50,Таблица1[[#All],[ГОСТ]:[точка]],8,0))","v":""},{"$f":"IF(K50=\"\",\"\",VLOOKUP(K50,Таблица1[[#All],[ГОСТ]:[точка]],2,0))","v":""},null,0,null,{"$f":"IF(K50=\"\",\"\",VLOOKUP(K50,Таблица1[[#All],[ГОСТ]:[коэф]],9,0))","v":""},"",null,null,null,null,null,4]
["z","",null,500,null,0,{"$f":"IF(K51=\"\",\"\",VLOOKUP(K51,Таблица1[[#All],[ГОСТ]:[точка]],8,0))","v":""},{"$f":"IF(K51=\"\",\"\",VLOOKUP(K51,Таблица1[[#All],[ГОСТ]:[точка]],2,0))","v":""},null,0,null,{"$f":"IF(K51=\"\",\"\",VLOOKUP(K51,Таблица1[[#All],[ГОСТ]:[коэф]],9,0))","v":""},"",null,null,null,null,null,4]
["z","",null,500,null,0,{"$f":"IF(K52=\"\",\"\",VLOOKUP(K52,Таблица1[[#All],[ГОСТ]:[точка]],8,0))","v":""},{"$f":"IF(K52=\"\",\"\",VLOOKUP(K52,Таблица1[[#All],[ГОСТ]:[точка]],2,0))","v":""},null,0,null,{"$f":"IF(K52=\"\",\"\",VLOOKUP(K52,Таблица1[[#All],[ГОСТ]:[коэф]],9,0))","v":""},"",null,null,null,null,null,4]
["z","",null,500,null,0,{"$f":"IF(K53=\"\",\"\",VLOOKUP(K53,Таблица1[[#All],[ГОСТ]:[точка]],8,0))","v":""},{"$f":"IF(K53=\"\",\"\",VLOOKUP(K53,Таблица1[[#All],[ГОСТ]:[точка]],2,0))","v":""},null,0,null,{"$f":"IF(K53=\"\",\"\",VLOOKUP(K53,Таблица1[[#All],[ГОСТ]:[коэф]],9,0))","v":""},"",null,null,null,null,null,4]
["z","",null,500,null,0,{"$f":"IF(K54=\"\",\"\",VLOOKUP(K54,Таблица1[[#All],[ГОСТ]:[точка]],8,0))","v":""},{"$f":"IF(K54=\"\",\"\",VLOOKUP(K54,Таблица1[[#All],[ГОСТ]:[точка]],2,0))","v":""},null,0,null,{"$f":"IF(K54=\"\",\"\",VLOOKUP(K54,Таблица1[[#All],[ГОСТ]:[коэф]],9,0))","v":""},"",null,null,null,null,null,4]
["z","",null,500,null,0,{"$f":"IF(K55=\"\",\"\",VLOOKUP(K55,Таблица1[[#All],[ГОСТ]:[точка]],8,0))","v":""},{"$f":"IF(K55=\"\",\"\",VLOOKUP(K55,Таблица1[[#All],[ГОСТ]:[точка]],2,0))","v":""},null,0,null,{"$f":"IF(K55=\"\",\"\",VLOOKUP(K55,Таблица1[[#All],[ГОСТ]:[коэф]],9,0))","v":""},"",null,null,null,null,null,4]
["z","",null,500,null,0,{"$f":"IF(K56=\"\",\"\",VLOOKUP(K56,Таблица1[[#All],[ГОСТ]:[точка]],8,0))","v":""},{"$f":"IF(K56=\"\",\"\",VLOOKUP(K56,Таблица1[[#All],[ГОСТ]:[точка]],2,0))","v":""},null,0,null,{"$f":"IF(K56=\"\",\"\",VLOOKUP(K56,Таблица1[[#All],[ГОСТ]:[коэф]],9,0))","v":""},"",null,null,null,null,null,4]
["z","",null,500,null,0,{"$f":"IF(K57=\"\",\"\",VLOOKUP(K57,Таблица1[[#All],[ГОСТ]:[точка]],8,0))","v":""},{"$f":"IF(K57=\"\",\"\",VLOOKUP(K57,Таблица1[[#All],[ГОСТ]:[точка]],2,0))","v":""},null,0,null,{"$f":"IF(K57=\"\",\"\",VLOOKUP(K57,Таблица1[[#All],[ГОСТ]:[коэф]],9,0))","v":""},"",null,null,null,null,null,4]
[]
[null,"Карта \nраскроя\n№","Длина, мм","Ширина, мм","Толщина, мм","Марка материала","Кол-во","Площадь остатков всего, кв.м","Площадь деталей всего, кв.м","Количество деталей",null,"Округление\nтолщины","Коэфициент ","Трубы/остатка со склада масса (кг)",null,"Получил","Деловой остаток на склад (кг)",null,"Получил \nкладовщик","Масса деталей (кг)",null,"Количество деталей","Получил","Расход (кг)","ЛОМ (кг)"]
[null,null,null,null,null,null,null,null,null,null,null,null,null,"теория","факт",null,"теория","факт",null,"теория","факт",null,null,null,null,null,null,null,"z","z","z","z","z","z"]
[{"$f":"IF(G61=0,\"z\",\"\")","v":""},1,1495,500,1.2,"Труба 30х20, 1.2 мм, тр3020",1,0,0.70500001311302185,4,1,{"$f":"ROUND(E61,2)","v":1.2},{"$f":"IFERROR(VLOOKUP(F61,Таблица1[[#All],[АСТРА]:[коэф]],7,0),\"0\")","v":1.76},{"$f":"C61*D61*G61*M61/1000000","v":1.3156000000000001},null,null,{"$f":"H61*M61","v":0},null,null,{"$f":"I61*M61","v":1.2408000230789185},null,null,null,{"$f":"N61-Q61","v":1.3156000000000001},{"$f":"X61-T61","v":7.4799976921081646E-2},null,null,null,{"$f":"SUMIFS(J8:J57,H8:H57,\"=Труба 15х15 чм, 1.0 мм\")","v":0},"Труба 15х15х1",null,1,0.85199999999999998,0.47599999999999998]
[{"$f":"IF(G62=0,\"z\",\"\")","v":""},2,6000,500,1.2,"Труба 30х20, 1.2 мм, тр3020",10,0,29.365000128746033,21,2,{"$f":"ROUND(E62,2)","v":1.2},{"$f":"IFERROR(VLOOKUP(F62,Таблица1[[#All],[АСТРА]:[коэф]],7,0),\"0\")","v":1.76},52.8,null,null,0,null,null,51.682400226593018,null,null,null,52.8,{"$f":"X62-T62","v":1.1175997734069796},null,null,null,{"$f":"J8","v":220},"Труба ø 16х1",null,1,0.74,0.37]
["",3,6000,500,1.2,"Труба 30х20, 1.2 мм, тр3020",1,0,2.9260000139474869,21,3,1.2,{"$f":"IFERROR(VLOOKUP(F63,Таблица1[[#All],[АСТРА]:[коэф]],7,0),\"0\")","v":1.76},5.28,null,null,0,null,null,5.149760024547577,null,null,null,5.28,0.13023997545242327,null,null,null,{"$f":"SUMIFS(J8:J57,H8:H57,\"=Труба 17х17 чм, 2,0\")","v":0},"Труба 17х17х2",null,2,1.88,0.94]
["",4,6000,500,1.2,"Труба 30х20, 1.2 мм, тр3020",1,0,2.9025000780820847,14,4,1.2,{"$f":"IFERROR(VLOOKUP(F64,Таблица1[[#All],[АСТРА]:[коэф]],7,0),\"0\")","v":1.76},5.28,null,null,0,null,null,5.1084001374244687,null,null,null,5.28,0.1715998625755315,null,null,null,{"$f":"SUMIFS(J8:J57,H8:H57,\"=Труба 20х20 чм, 0.8 мм\")","v":0},"Труба 20х20х0,8",null,0.8,1.006,0.503]
["",5,6000,500,1.2,"Труба 30х20, 1.2 мм, тр3020",15,0,43.485001176595688,14,5,1.2,{"$f":"IFERROR(VLOOKUP(F65,Таблица1[[#All],[АСТРА]:[коэф]],7,0),\"0\")","v":1.76},79.2,null,null,0,null,null,76.533602070808413,null,null,null,79.2,2.6663979291915894,null,null,null,{"$f":"SUMIFS(J8:J57,H8:H57,\"=Труба 20х20 чм, 1.0 мм\")","v":0},"Труба 20х20 чм, 1.0 мм",null,1,1.248,0.624]
["",6,6000,500,1.2,"Труба 30х20, 1.2 мм, тр3020",1,0,2.9440000653266907,16,6,1.2,{"$f":"IFERROR(VLOOKUP(F66,Таблица1[[#All],[АСТРА]:[коэф]],7,0),\"0\")","v":1.76},5.28,null,null,0,null,null,5.1814401149749756,null,null,null,5.28,9.8559885025024663E-2,null,null,null,{"$f":"SUMIFS(J8:J57,H8:H57,\"=Труба 20х20 чм, 1.5 мм\")","v":0},"Труба 20х20х1,5",null,1.5,1.8720000000000001,0.93600000000000005]
["",7,6000,500,1.2,"Труба 30х20, 1.2 мм, тр3020",3,0,8.5995000600814819,21,7,1.2,{"$f":"IFERROR(VLOOKUP(F67,Таблица1[[#All],[АСТРА]:[коэф]],7,0),\"0\")","v":1.76},15.84,null,null,0,null,null,15.135120105743407,null,null,null,15.84,0.70487989425659237,null,null,null,{"$f":"SUMIFS(J8:J57,H8:H57,\"=Труба 20х20 чм, 2.0 мм\")","v":0},"Труба 20х20х2",null,2,2.2519999999999998,1.1259999999999999]
["",8,6000,500,1.2,"Труба 30х20, 1.2 мм, тр3020",1,1.3320000171661377,1.6380000114440918,12,8,1.2,{"$f":"IFERROR(VLOOKUP(F68,Таблица1[[#All],[АСТРА]:[коэф]],7,0),\"0\")","v":1.76},5.28,null,null,2.3443200302124025,null,null,2.8828800201416014,null,null,null,2.9356799697875977,5.2799949645996325E-2,null,null,null,{"$f":"SUMIFS(J8:J57,H8:H57,\"=Труба 25х25 чм, 0.8 мм\")","v":0},"Труба 25х25х0,8",null,0.8,1.2383999999999999,0.61919999999999997]
["z",null,null,null,null,null,null,null,null,null,9,0,{"$f":"IFERROR(VLOOKUP(F69,Таблица1[[#All],[АСТРА]:[коэф]],7,0),\"0\")","v":"0"},0,null,null,0,null,null,0,null,null,null,0,0,null,null,null,{"$f":"SUMIFS(J8:J57,H8:H57,\"=Труба 25х25 чм, 1.0 мм\")","v":0},"Труба 25х25х1",null,1,1.548,0.77400000000000002]
["z",null,null,null,null,null,null,null,null,null,10,0,{"$f":"IFERROR(VLOOKUP(F70,Таблица1[[#All],[АСТРА]:[коэф]],7,0),\"0\")","v":"0"},0,null,null,0,null,null,0,null,null,null,0,0,null,null,null,{"$f":"SUMIFS(J8:J57,H8:H57,\"=Труба 25х25 чм, 1.2 мм\")","v":0},"Труба 25х25х1,2",null,1.2,1.8575999999999999,0.92879999999999996]
[{"$f":"IF(G71=0,\"z\",\"\")","v":"z"},null,null,null,null,null,null,null,null,null,11,{"$f":"ROUND(E71,2)","v":0},{"$f":"IFERROR(VLOOKUP(F71,Таблица1[[#All],[АСТРА]:[коэф]],7,0),\"0\")","v":"0"},{"$f":"C71*D71*G71*M71/1000000","v":0},null,null,{"$f":"H71*M71","v":0},null,null,{"$f":"I71*M71","v":0},null,null,null,{"$f":"N71-Q71","v":0},{"$f":"X71-T71","v":0}]
["z",null,null,null,null,null,null,null,null,null,12,0,{"$f":"IFERROR(VLOOKUP(F72,Таблица1[[#All],[АСТРА]:[коэф]],7,0),\"0\")","v":"0"},0,null,null,0,null,null,0,null,null,null,0,0]
["z",null,null,null,null,null,null,null,null,null,13,0,{"$f":"IFERROR(VLOOKUP(F73,Таблица1[[#All],[АСТРА]:[коэф]],7,0),\"0\")","v":"0"},0,null,null,0,null,null,0,null,null,null,0,0]
["z",null,null,null,null,null,null,null,null,null,14,0,{"$f":"IFERROR(VLOOKUP(F74,Таблица1[[#All],[АСТРА]:[коэф]],7,0),\"0\")","v":"0"},0,null,null,0,null,null,0,null,null,null,0,0]
["z",null,null,null,null,null,null,null,null,null,15,0,{"$f":"IFERROR(VLOOKUP(F75,Таблица1[[#All],[АСТРА]:[коэф]],7,0),\"0\")","v":"0"},0,null,null,0,null,null,0,null,null,null,0,0]
["z",null,null,null,null,null,null,null,null,null,16,0,{"$f":"IFERROR(VLOOKUP(F76,Таблица1[[#All],[АСТРА]:[коэф]],7,0),\"0\")","v":"0"},0,null,null,0,null,null,0,null,null,null,0,0]
["z",null,null,null,null,null,null,null,null,null,17,0,{"$f":"IFERROR(VLOOKUP(F77,Таблица1[[#All],[АСТРА]:[коэф]],7,0),\"0\")","v":"0"},0,null,null,0,null,null,0,null,null,null,0,0]
["z",null,null,null,null,null,null,null,null,null,18,0,{"$f":"IFERROR(VLOOKUP(F78,Таблица1[[#All],[АСТРА]:[коэф]],7,0),\"0\")","v":"0"},0,null,null,0,null,null,0,null,null,null,0,0]
["z",null,null,null,null,null,null,null,null,null,19,0,{"$f":"IFERROR(VLOOKUP(F79,Таблица1[[#All],[АСТРА]:[коэф]],7,0),\"0\")","v":"0"},0,null,null,0,null,null,0,null,null,null,0,0]
["z",null,null,null,null,null,null,null,null,null,20,0,{"$f":"IFERROR(VLOOKUP(F80,Таблица1[[#All],[АСТРА]:[коэф]],7,0),\"0\")","v":"0"},0,null,null,0,null,null,0,null,null,null,0,0]
["z",null,null,null,null,null,null,null,null,null,21,0,{"$f":"IFERROR(VLOOKUP(F81,Таблица1[[#All],[АСТРА]:[коэф]],7,0),\"0\")","v":"0"},0,null,null,0,null,null,0,null,null,null,0,0]
["z",null,null,null,null,null,null,null,null,null,22,0,{"$f":"IFERROR(VLOOKUP(F82,Таблица1[[#All],[АСТРА]:[коэф]],7,0),\"0\")","v":"0"},0,null,null,0,null,null,0,null,null,null,0,0]
["z",null,null,null,null,null,null,null,null,null,23,0,{"$f":"IFERROR(VLOOKUP(F83,Таблица1[[#All],[АСТРА]:[коэф]],7,0),\"0\")","v":"0"},0,null,null,0,null,null,0,null,null,null,0,0]
["z",null,null,null,null,null,null,null,null,null,24,0,{"$f":"IFERROR(VLOOKUP(F84,Таблица1[[#All],[АСТРА]:[коэф]],7,0),\"0\")","v":"0"},0,null,null,0,null,null,0,null,null,null,0,0]
["z",null,null,null,null,null,null,null,null,null,25,0,{"$f":"IFERROR(VLOOKUP(F85,Таблица1[[#All],[АСТРА]:[коэф]],7,0),\"0\")","v":"0"},0,null,null,0,null,null,0,null,null,null,0,0]
["z",null,null,null,null,null,null,null,null,null,26,0,{"$f":"IFERROR(VLOOKUP(F86,Таблица1[[#All],[АСТРА]:[коэф]],7,0),\"0\")","v":"0"},0,null,null,0,null,null,0,null,null,null,0,0]
["z",null,null,null,null,null,null,null,null,null,27,0,{"$f":"IFERROR(VLOOKUP(F87,Таблица1[[#All],[АСТРА]:[коэф]],7,0),\"0\")","v":"0"},0,null,null,0,null,null,0,null,null,null,0,0]
["z",null,null,null,null,null,null,null,null,null,28,0,{"$f":"IFERROR(VLOOKUP(F88,Таблица1[[#All],[АСТРА]:[коэф]],7,0),\"0\")","v":"0"},0,null,null,0,null,null,0,null,null,null,0,0]
["z",null,null,null,null,null,null,null,null,null,29,0,{"$f":"IFERROR(VLOOKUP(F89,Таблица1[[#All],[АСТРА]:[коэф]],7,0),\"0\")","v":"0"},0,null,null,0,null,null,0,null,null,null,0,0]
["z",null,null,null,null,null,null,null,null,null,30,0,{"$f":"IFERROR(VLOOKUP(F90,Таблица1[[#All],[АСТРА]:[коэф]],7,0),\"0\")","v":"0"},0,null,null,0,null,null,0,null,null,null,0,0]
["z",null,null,null,null,null,null,null,null,null,31,0,{"$f":"IFERROR(VLOOKUP(F91,Таблица1[[#All],[АСТРА]:[коэф]],7,0),\"0\")","v":"0"},0,null,null,0,null,null,0,null,null,null,0,0]
["z",null,null,null,null,null,null,null,null,null,32,0,{"$f":"IFERROR(VLOOKUP(F92,Таблица1[[#All],[АСТРА]:[коэф]],7,0),\"0\")","v":"0"},0,null,null,0,null,null,0,null,null,null,0,0]
["z",null,null,null,null,null,null,null,null,null,33,0,{"$f":"IFERROR(VLOOKUP(F93,Таблица1[[#All],[АСТРА]:[коэф]],7,0),\"0\")","v":"0"},0,null,null,0,null,null,0,null,null,null,0,0]
["z",null,null,null,null,null,null,null,null,null,34,0,{"$f":"IFERROR(VLOOKUP(F94,Таблица1[[#All],[АСТРА]:[коэф]],7,0),\"0\")","v":"0"},0,null,null,0,null,null,0,null,null,null,0,0]
["z",null,null,null,null,null,null,null,null,null,35,0,{"$f":"IFERROR(VLOOKUP(F95,Таблица1[[#All],[АСТРА]:[коэф]],7,0),\"0\")","v":"0"},0,null,null,0,null,null,0,null,null,null,0,0,null,null,null,{"$f":"SUMIFS(J8:J57,H8:H57,\"=Труба 25х25 чм, 1.5 мм\")","v":0},"Труба 25х25х1,5",null,1.5,2.2200000000000002,1.1100000000000001]
["z",null,null,null,null,null,null,null,null,null,36,0,{"$f":"IFERROR(VLOOKUP(F96,Таблица1[[#All],[АСТРА]:[коэф]],7,0),\"0\")","v":"0"},0,null,null,0,null,null,0,null,null,null,0,0,null,null,null,{"$f":"SUMIFS(J8:J57,H8:H57,\"=Труба 25х25 чм, 2.0 мм\")","v":0},"Труба 25х25х2",null,2,3.0960000000000001,1.548]
["z",null,null,null,null,null,null,null,null,null,37,0,{"$f":"IFERROR(VLOOKUP(F97,Таблица1[[#All],[АСТРА]:[коэф]],7,0),\"0\")","v":"0"},0,null,null,0,null,null,0,null,null,null,0,0,null,null,null,{"$f":"SUMIFS(J8:J57,H8:H57,\"=Труба 25х28 чм, 1.5 мм\")","v":0},"Труба 25х28х1,5",null,1.5,2.6,1.3]
["z",null,null,null,null,null,null,null,null,null,38,0,{"$f":"IFERROR(VLOOKUP(F98,Таблица1[[#All],[АСТРА]:[коэф]],7,0),\"0\")","v":"0"},0,null,null,0,null,null,0,null,null,null,0,0,null,null,null,{"$f":"SUMIFS(J8:J57,H8:H57,\"=Труба 25х28 чм, 2.0 мм\")","v":0},"Труба 25х28х2",null,2]
["z",null,null,null,null,null,null,null,null,null,39,0,{"$f":"IFERROR(VLOOKUP(F99,Таблица1[[#All],[АСТРА]:[коэф]],7,0),\"0\")","v":"0"},0,null,null,0,null,null,0,null,null,null,0,0,null,null,null,{"$f":"SUMIFS(J8:J57,H8:H57,\"=Труба 25х50 чм, 1.2 мм\")","v":0},"Труба 25х50х1,2",null,1.2,2.7,1.35]
["z",null,null,null,null,null,null,null,null,null,40,0,{"$f":"IFERROR(VLOOKUP(F100,Таблица1[[#All],[АСТРА]:[коэф]],7,0),\"0\")","v":"0"},0,null,null,0,null,null,0,null,null,null,0,0,null,null,null,{"$f":"SUMIFS(J8:J57,H8:H57,\"=Труба 30х15 чм, 1.2 мм\")","v":0},"Труба 30х15х1,2",null,1.2,1.5660000000000001,0.78300000000000003]
["z",null,null,null,null,null,null,null,null,null,41,0,{"$f":"IFERROR(VLOOKUP(F101,Таблица1[[#All],[АСТРА]:[коэф]],7,0),\"0\")","v":"0"},0,null,null,0,null,null,0,null,null,null,0,0,null,null,null,{"$f":"SUMIFS(J8:J57,H8:H57,\"=Труба 30х20 чм, 1.0 мм\")","v":0},"Труба 30х20х1",null,1,1.5720000000000001,0.78600000000000003]
["z",null,null,null,null,null,null,null,null,null,42,0,{"$f":"IFERROR(VLOOKUP(F102,Таблица1[[#All],[АСТРА]:[коэф]],7,0),\"0\")","v":"0"},0,null,null,0,null,null,0,null,null,null,0,0,null,null,null,{"$f":"SUMIFS(J8:J57,H8:H57,\"=Труба 30х50 чм, 2.0 мм\")","v":0},"Труба 30х50х2",null,2,4.8899999999999997,2.4489999999999998]
["z",null,null,null,null,null,null,null,null,null,43,0,{"$f":"IFERROR(VLOOKUP(F103,Таблица1[[#All],[АСТРА]:[коэф]],7,0),\"0\")","v":"0"},0,null,null,0,null,null,0,null,null,null,0,0,null,null,null,{"$f":"SUMIFS(J8:J57,H8:H57,\"=Труба 40х20 чм, 1.0 мм\")","v":0},"Труба 40х20х1",null,1,1.8839999999999999,0.94199999999999995]
["z",null,null,null,null,null,null,null,null,null,44,0,{"$f":"IFERROR(VLOOKUP(F104,Таблица1[[#All],[АСТРА]:[коэф]],7,0),\"0\")","v":"0"},0,null,null,0,null,null,0,null,null,null,0,0,null,null,null,{"$f":"SUMIFS(J8:J57,H8:H57,\"=Труба 40х20 чм, 1.5 мм\")","v":0},"Труба 40х20х1,5",null,1.5,2.88,1.44]
["z",null,null,null,null,null,null,null,null,null,45,0,{"$f":"IFERROR(VLOOKUP(F105,Таблица1[[#All],[АСТРА]:[коэф]],7,0),\"0\")","v":"0"},0,null,null,0,null,null,0,null,null,null,0,0,null,null,null,{"$f":"SUMIFS(J8:J57,H8:H57,\"=Труба 40х20 чм, 2.0 мм\")","v":0},"Труба 40х20х2",null,2,3.4,1.7]
["z",null,null,null,null,null,null,null,null,null,46,0,{"$f":"IFERROR(VLOOKUP(F106,Таблица1[[#All],[АСТРА]:[коэф]],7,0),\"0\")","v":"0"},0,null,null,0,null,null,0,null,null,null,0,0,null,null,null,{"$f":"SUMIFS(J8:J57,H8:H57,\"=Труба 40х25 чм, 2.0 мм\")","v":0},"Труба 40х25х",null,2,4.08,2.04]
["z",null,null,null,null,null,null,null,null,null,47,0,{"$f":"IFERROR(VLOOKUP(F107,Таблица1[[#All],[АСТРА]:[коэф]],7,0),\"0\")","v":"0"},0,null,null,0,null,null,0,null,null,null,0,0,null,null,null,{"$f":"SUMIFS(J8:J57,H8:H57,\"=Труба 40х40 чм, 2.0 мм\")","v":0},"Труба 40х40х2",null,2,5.08,2.54]
["z",null,null,null,null,null,null,null,null,null,48,0,{"$f":"IFERROR(VLOOKUP(F108,Таблица1[[#All],[АСТРА]:[коэф]],7,0),\"0\")","v":"0"},0,null,null,0,null,null,0,null,null,null,0,0,null,null,null,{"$f":"SUMIFS(J8:J57,H8:H57,\"=Труба 60х30 чм, 2.0 мм\")","v":0},"Труба 60х30х2",null,2,5.3,2.65]
["z",null,null,null,null,null,null,null,null,null,49,0,{"$f":"IFERROR(VLOOKUP(F109,Таблица1[[#All],[АСТРА]:[коэф]],7,0),\"0\")","v":"0"},0,null,null,0,null,null,0,null,null,null,0,0,null,null,null,null,"Труба ø 32,5х3",null,3,4.3159999999999998,2.1579999999999999]
["z",null,null,null,null,null,null,null,null,null,50,0,{"$f":"IFERROR(VLOOKUP(F110,Таблица1[[#All],[АСТРА]:[коэф]],7,0),\"0\")","v":"0"},0,null,null,0,null,null,0,null,null,null,0,0,null,null,null,null,"Труба ø 30х15",null,1.5,1.9179999999999999,0.95899999999999996]
["z",null,null,null,null,null,null,null,null,null,51,0,{"$f":"IFERROR(VLOOKUP(F111,Таблица1[[#All],[АСТРА]:[коэф]],7,0),\"0\")","v":"0"},0,null,null,0,null,null,0,null,null,null,0,0,null,null,null,{"$f":"SUMIFS(J8:J57,H8:H57,\"=Труба 20 чм, 1.0 мм\")","v":0},"Труба ø 20х1",null,1,0.98,0.49]
["z",null,null,null,null,null,null,null,null,null,52,0,{"$f":"IFERROR(VLOOKUP(F112,Таблица1[[#All],[АСТРА]:[коэф]],7,0),\"0\")","v":"0"},0,null,null,0,null,null,0,null,null,null,0,0,null,null,null,{"$f":"SUMIFS(J8:J57,H8:H57,\"=Труба 25 чм, 1.5 мм\")","v":0},"Труба ø 25х1,5",null,1.5,1.86,0.93]
["z",null,null,null,null,null,null,null,null,null,53,0,{"$f":"IFERROR(VLOOKUP(F113,Таблица1[[#All],[АСТРА]:[коэф]],7,0),\"0\")","v":"0"},0,null,null,0,null,null,0,null,null,null,0,0,null,null,null,{"$f":"SUMIFS(J8:J57,H8:H57,\"=Труба 50 чм, 1.2 мм\")","v":0},"Труба ø50х1.2",null,1.2,2.88,1.44]
["z",null,null,null,null,null,null,null,null,null,54,0,{"$f":"IFERROR(VLOOKUP(F114,Таблица1[[#All],[АСТРА]:[коэф]],7,0),\"0\")","v":"0"},0,null,null,0,null,null,0,null,null,null,0,0,null,null,null,null,"Труба ДУ15",null,3,2.3199999999999998,1.1599999999999999]
["z",null,null,null,null,null,null,null,null,null,55,0,{"$f":"IFERROR(VLOOKUP(F115,Таблица1[[#All],[АСТРА]:[коэф]],7,0),\"0\")","v":"0"},0,null,null,0,null,null,0,null,null,null,0,0]
[null,null,null,null,null,null,null,null,null,null,null,null,null,{"$f":"SUM(N61:N115)","v":170.27560000000003},null,null,{"$f":"SUM(Q61:Q115)","v":2.3443200302124025},null,null,{"$f":"SUM(T61:T115)","v":162.91440272331238},null,null,null,{"$f":"SUM(X61:X115)","v":167.93127996978762},{"$f":"SUM(Y61:Y115)","v":5.016877246475218}]
[]
[null,null,null,null,null,null,null,null,"получить",null,null,null,null,null,"остаток",null,null,null,"детали",null,null,null,null,null,"расход",null,null,"лом"]
[null,"№ \nп/п",null,"Длина\nцелых\nмм",null,"Кол-во труб","Толщина\nмм","Марка материала","Масса \nцелых\nкг","Масса\nделовых\nкг",null,null,"Резы","Общая\nкг","Деловой остаток с целых\nкг","Деловой остаок с деловых\nкг","Общая\nкг","ЛОМ\nкг","Масса деталей целых\nкг","Масса деталей деловых\nкг","Общая\nкг",null,null,null,"Расход целых\nкг","Расход деловых\nкг","Общий\nкг","ЛОМ\nдубль\nкг","отход\nна\nпорезку","лом \nчистый\nцелых","лом\nчистый\nделовых",null,null,null,null,null,null,null,null,null,"коэф 2м"]
["z",null,null,null,null,"копия","копия"]
["z","Столбец1","Столбец2","Дл","Столбец4","со.склада.шт.","Толщ.копия","Столбец5","Столбец8","Столбец9","Столбец10","Столбец6","резы","Столбец12","Столбец13","Столбец14","Столбец15","Столбец16","Столбец17","Столбец18","Столбец19","Столбец20","Столбец21","Столбец22","Столбец23","Столбец24","Столбец25","Столбец26","Столбец27","Столбец28","Столбец29","шир.рез","ГОСТ","Для.дано","АСТРА","Столбец33","Столбец34","профиль","толщ","точка","коэф"]
[{"$f":"IF(Таблица1[[#This Row],[Столбец19]]=0,\"z\",\"\")","v":"z"},null,null,3000,null,{"$f":"SUMIFS($G$61:$G$115,$D$61:$D$115,500,$C$61:$C$115,Таблица1[[#This Row],[Дл]],$L$61:$L$115,Таблица1[[#This Row],[Толщ.копия]],$F$61:$F$115,Таблица1[[#This Row],[АСТРА]])","v":0},{"$f":"Таблица1[[#This Row],[толщ]]","v":12},{"$f":"Таблица1[[#This Row],[ГОСТ]]","v":"Круг 12"},{"$f":"SUMIFS($N$61:$N$115,$C$61:$C$115,Таблица1[[#This Row],[Дл]],$D$61:$D$115,\"=500\",$L$61:$L$115,Таблица1[[#This Row],[Толщ.копия]],$F$61:$F$115,Таблица1[[#This Row],[АСТРА]])","v":0},{"$f":"SUMIFS($N$61:$N$115,$C$61:$C$115,\"<\"&Таблица1[[#This Row],[Дл]],$D$61:$D$115,\"=500\",$L$61:$L$115,Таблица1[[#This Row],[Толщ.копия]],$F$61:$F$115,Таблица1[[#This Row],[АСТРА]])","v":0},null,null,{"$f":"SUMIFS($J$8:$J$57,$K$8:$K$57,Таблица1[[#This Row],[Столбец5]])","v":220},{"$f":"Таблица1[[#This Row],[Столбец8]]+Таблица1[[#This Row],[Столбец9]]","v":0},{"$f":"SUMIFS($Q$61:$Q$115,$C$61:$C$115,Таблица1[[#This Row],[Дл]],$D$61:$D$115,\"=500\",$L$61:$L$115,Таблица1[[#This Row],[Толщ.копия]],$F$61:$F$115,Таблица1[[#This Row],[АСТРА]])","v":0},{"$f":"SUMIFS($Q$61:$Q$115,$C$61:$C$115,\"<\"&Таблица1[[#This Row],[Дл]],$D$61:$D$115,\"=500\",$L$61:$L$115,Таблица1[[#This Row],[Толщ.копия]],$F$61:$F$115,Таблица1[[#This Row],[АСТРА]])","v":0},{"$f":"Таблица1[[#This Row],[Столбец13]]+Таблица1[[#This Row],[Столбец14]]","v":0},{"$f":"Таблица1[[#This Row],[Столбец28]]+Таблица1[[#This Row],[Столбец29]]-Таблица1[[#This Row],[Столбец27]]","v":-0.97680000000000011},{"$f":"SUMIFS($T$61:$T$115,$C$61:$C$115,Таблица1[[#This Row],[Дл]],$D$61:$D$115,\"=500\",$L$61:$L$115,Таблица1[[#This Row],[Толщ.копия]],$F$61:$F$115,Таблица1[[#This Row],[АСТРА]])","v":0},{"$f":"SUMIFS($T$61:$T$115,$C$61:$C$115,\"<\"&Таблица1[[#This Row],[Дл]],$D$61:$D$115,\"=500\",$L$61:$L$115,Таблица1[[#This Row],[Толщ.копия]],$F$61:$F$115,Таблица1[[#This Row],[АСТРА]])","v":0},{"$f":"Таблица1[[#This Row],[Столбец17]]+Таблица1[[#This Row],[Столбец18]]","v":0},null,null,null,{"$f":"SUMIFS($X$61:$X$115,$C$61:$C$115,Таблица1[[#This Row],[Дл]],$D$61:$D$115,\"=500\",$L$61:$L$115,Таблица1[[#This Row],[Толщ.копия]],$F$61:$F$115,Таблица1[[#This Row],[АСТРА]])","v":0},{"$f":"SUMIFS($X$61:$X$115,$C$61:$C$115,\"<\"&Таблица1[[#This Row],[Дл]],$D$61:$D$115,\"=500\",$L$61:$L$115,Таблица1[[#This Row],[Толщ.копия]],$F$61:$F$115,Таблица1[[#This Row],[АСТРА]])","v":0},{"$f":"Таблица1[[#This Row],[Столбец23]]+Таблица1[[#This Row],[Столбец24]]","v":0},{"$f":"Таблица1[[#This Row],[Столбец28]]+Таблица1[[#This Row],[Столбец29]]-Таблица1[[#This Row],[Столбец27]]","v":-0.97680000000000011},{"$f":"Таблица1[[#This Row],[резы]]*Таблица1[[#This Row],[шир.рез]]/1000*Таблица1[[#This Row],[коэф]]/2","v":0.97680000000000011},{"$f":"SUMIFS($Y$61:$Y$115,$C$61:$C$115,Таблица1[[#This Row],[Дл]],$D$61:$D$115,\"=500\",$L$61:$L$115,Таблица1[[#This Row],[Толщ.копия]],$F$61:$F$115,Таблица1[[#This Row],[АСТРА]])","v":0},{"$f":"SUMIFS($Y$61:$Y$115,$C$61:$C$115,\"<\"&Таблица1[[#This Row],[Дл]],$D$61:$D$115,\"=500\",$L$61:$L$115,Таблица1[[#This Row],[Толщ.копия]],$F$61:$F$115,Таблица1[[#This Row],[АСТРА]])","v":0},5,{"$f":"IF(Таблица1[[#This Row],[профиль]]=Таблица1[[#This Row],[толщ]],CONCATENATE(Таблица1[[#This Row],[Столбец33]],\" \",Таблица1[[#This Row],[толщ]]),CONCATENATE(Таблица1[[#This Row],[Столбец33]],\" \",Таблица1[[#This Row],[профиль]],\"х\",Таблица1[[#This Row],[толщ]]))","v":"Круг 12"},{"$f":"CONCATENATE(Таблица1[[#This Row],[Столбец33]],\" \",Таблица1[[#This Row],[профиль]])","v":"Круг 12"},"Круг 12 мм, 12.0 мм, кр12","Круг",{"$f":"IF(Таблица1[[#This Row],[профиль]]=Таблица1[[#This Row],[толщ]],Таблица1[[#This Row],[толщ]],CONCATENATE(Таблица1[[#This Row],[профиль]],\"х\",Таблица1[[#This Row],[точка]]))","v":12},12,12,{"$f":"SUBSTITUTE(Таблица1[[#This Row],[толщ]],\",\",\".\")","v":"12"},1.776]
[{"$f":"IF(Таблица1[[#This Row],[Столбец19]]=0,\"z\",\"\")","v":"z"},null,null,6000,null,{"$f":"SUMIFS($G$61:$G$115,$D$61:$D$115,500,$C$61:$C$115,Таблица1[[#This Row],[Дл]],$L$61:$L$115,Таблица1[[#This Row],[Толщ.копия]],$F$61:$F$115,Таблица1[[#This Row],[АСТРА]])","v":0},{"$f":"Таблица1[[#This Row],[толщ]]","v":1},{"$f":"Таблица1[[#This Row],[ГОСТ]]","v":"Труба 10х10х1"},{"$f":"SUMIFS($N$61:$N$115,$C$61:$C$115,Таблица1[[#This Row],[Дл]],$D$61:$D$115,\"=500\",$L$61:$L$115,Таблица1[[#This Row],[Толщ.копия]],$F$61:$F$115,Таблица1[[#This Row],[АСТРА]])","v":0},{"$f":"SUMIFS($N$61:$N$115,$C$61:$C$115,\"<\"&Таблица1[[#This Row],[Дл]],$D$61:$D$115,\"=500\",$L$61:$L$115,Таблица1[[#This Row],[Толщ.копия]],$F$61:$F$115,Таблица1[[#This Row],[АСТРА]])","v":0},null,null,{"$f":"SUMIFS($J$8:$J$57,$K$8:$K$57,Таблица1[[#This Row],[Столбец5]])","v":220},{"$f":"Таблица1[[#This Row],[Столбец8]]+Таблица1[[#This Row],[Столбец9]]","v":0},{"$f":"SUMIFS($Q$61:$Q$115,$C$61:$C$115,Таблица1[[#This Row],[Дл]],$D$61:$D$115,\"=500\",$L$61:$L$115,Таблица1[[#This Row],[Толщ.копия]],$F$61:$F$115,Таблица1[[#This Row],[АСТРА]])","v":0},{"$f":"SUMIFS($Q$61:$Q$115,$C$61:$C$115,\"<\"&Таблица1[[#This Row],[Дл]],$D$61:$D$115,\"=500\",$L$61:$L$115,Таблица1[[#This Row],[Толщ.копия]],$F$61:$F$115,Таблица1[[#This Row],[АСТРА]])","v":0},{"$f":"Таблица1[[#This Row],[Столбец13]]+Таблица1[[#This Row],[Столбец14]]","v":0},{"$f":"Таблица1[[#This Row],[Столбец28]]+Таблица1[[#This Row],[Столбец29]]-Таблица1[[#This Row],[Столбец27]]","v":-0.29700000000000004},{"$f":"SUMIFS($T$61:$T$115,$C$61:$C$115,Таблица1[[#This Row],[Дл]],$D$61:$D$115,\"=500\",$L$61:$L$115,Таблица1[[#This Row],[Толщ.копия]],$F$61:$F$115,Таблица1[[#This Row],[АСТРА]])","v":0},{"$f":"SUMIFS($T$61:$T$115,$C$61:$C$115,\"<\"&Таблица1[[#This Row],[Дл]],$D$61:$D$115,\"=500\",$L$61:$L$115,Таблица1[[#This Row],[Толщ.копия]],$F$61:$F$115,Таблица1[[#This Row],[АСТРА]])","v":0},{"$f":"Таблица1[[#This Row],[Столбец17]]+Таблица1[[#This Row],[Столбец18]]","v":0},null,null,null,{"$f":"SUMIFS($X$61:$X$115,$C$61:$C$115,Таблица1[[#This Row],[Дл]],$D$61:$D$115,\"=500\",$L$61:$L$115,Таблица1[[#This Row],[Толщ.копия]],$F$61:$F$115,Таблица1[[#This Row],[АСТРА]])","v":0},{"$f":"SUMIFS($X$61:$X$115,$C$61:$C$115,\"<\"&Таблица1[[#This Row],[Дл]],$D$61:$D$115,\"=500\",$L$61:$L$115,Таблица1[[#This Row],[Толщ.копия]],$F$61:$F$115,Таблица1[[#This Row],[АСТРА]])","v":0},{"$f":"Таблица1[[#This Row],[Столбец23]]+Таблица1[[#This Row],[Столбец24]]","v":0},{"$f":"Таблица1[[#This Row],[Столбец28]]+Таблица1[[#This Row],[Столбец29]]-Таблица1[[#This Row],[Столбец27]]","v":-0.29700000000000004},{"$f":"Таблица1[[#This Row],[резы]]*Таблица1[[#This Row],[шир.рез]]/1000*Таблица1[[#This Row],[коэф]]/2","v":0.29700000000000004},{"$f":"SUMIFS($Y$61:$Y$115,$C$61:$C$115,Таблица1[[#This Row],[Дл]],$D$61:$D$115,\"=500\",$L$61:$L$115,Таблица1[[#This Row],[Толщ.копия]],$F$61:$F$115,Таблица1[[#This Row],[АСТРА]])","v":0},{"$f":"SUMIFS($Y$61:$Y$115,$C$61:$C$115,\"<\"&Таблица1[[#This Row],[Дл]],$D$61:$D$115,\"=500\",$L$61:$L$115,Таблица1[[#This Row],[Толщ.копия]],$F$61:$F$115,Таблица1[[#This Row],[АСТРА]])","v":0},5,{"$f":"IF(Таблица1[[#This Row],[профиль]]=Таблица1[[#This Row],[толщ]],CONCATENATE(Таблица1[[#This Row],[Столбец33]],\" \",Таблица1[[#This Row],[толщ]]),CONCATENATE(Таблица1[[#This Row],[Столбец33]],\" \",Таблица1[[#This Row],[профиль]],\"х\",Таблица1[[#This Row],[толщ]]))","v":"Труба 10х10х1"},{"$f":"CONCATENATE(Таблица1[[#This Row],[Столбец33]],\" \",Таблица1[[#This Row],[профиль]])","v":"Труба 10х10"},"Труба 10х10, 1.0 мм, тр1010","Труба",{"$f":"IF(Таблица1[[#This Row],[профиль]]=Таблица1[[#This Row],[толщ]],Таблица1[[#This Row],[толщ]],CONCATENATE(Таблица1[[#This Row],[профиль]],\"х\",Таблица1[[#This Row],[точка]]))","v":"10х10х1"},"10х10",1,{"$f":"SUBSTITUTE(Таблица1[[#This Row],[толщ]],\",\",\".\")","v":"1"},0.54]
[{"$f":"IF(Таблица1[[#This Row],[Столбец19]]=0,\"z\",\"\")","v":"z"},null,null,6000,null,{"$f":"SUMIFS($G$61:$G$115,$D$61:$D$115,500,$C$61:$C$115,Таблица1[[#This Row],[Дл]],$L$61:$L$115,Таблица1[[#This Row],[Толщ.копия]],$F$61:$F$115,Таблица1[[#This Row],[АСТРА]])","v":0},{"$f":"Таблица1[[#This Row],[толщ]]","v":1},{"$f":"Таблица1[[#This Row],[ГОСТ]]","v":"Труба 20х20х1"},{"$f":"SUMIFS($N$61:$N$115,$C$61:$C$115,Таблица1[[#This Row],[Дл]],$D$61:$D$115,\"=500\",$L$61:$L$115,Таблица1[[#This Row],[Толщ.копия]],$F$61:$F$115,Таблица1[[#This Row],[АСТРА]])","v":0},{"$f":"SUMIFS($N$61:$N$115,$C$61:$C$115,\"<\"&Таблица1[[#This Row],[Дл]],$D$61:$D$115,\"=500\",$L$61:$L$115,Таблица1[[#This Row],[Толщ.копия]],$F$61:$F$115,Таблица1[[#This Row],[АСТРА]])","v":0},null,null,{"$f":"SUMIFS($J$8:$J$57,$K$8:$K$57,Таблица1[[#This Row],[Столбец5]])","v":0},{"$f":"Таблица1[[#This Row],[Столбец8]]+Таблица1[[#This Row],[Столбец9]]","v":0},{"$f":"SUMIFS($Q$61:$Q$115,$C$61:$C$115,Таблица1[[#This Row],[Дл]],$D$61:$D$115,\"=500\",$L$61:$L$115,Таблица1[[#This Row],[Толщ.копия]],$F$61:$F$115,Таблица1[[#This Row],[АСТРА]])","v":0},{"$f":"SUMIFS($Q$61:$Q$115,$C$61:$C$115,\"<\"&Таблица1[[#This Row],[Дл]],$D$61:$D$115,\"=500\",$L$61:$L$115,Таблица1[[#This Row],[Толщ.копия]],$F$61:$F$115,Таблица1[[#This Row],[АСТРА]])","v":0},{"$f":"Таблица1[[#This Row],[Столбец13]]+Таблица1[[#This Row],[Столбец14]]","v":0},{"$f":"Таблица1[[#This Row],[Столбец28]]+Таблица1[[#This Row],[Столбец29]]-Таблица1[[#This Row],[Столбец27]]","v":0},{"$f":"SUMIFS($T$61:$T$115,$C$61:$C$115,Таблица1[[#This Row],[Дл]],$D$61:$D$115,\"=500\",$L$61:$L$115,Таблица1[[#This Row],[Толщ.копия]],$F$61:$F$115,Таблица1[[#This Row],[АСТРА]])","v":0},{"$f":"SUMIFS($T$61:$T$115,$C$61:$C$115,\"<\"&Таблица1[[#This Row],[Дл]],$D$61:$D$115,\"=500\",$L$61:$L$115,Таблица1[[#This Row],[Толщ.копия]],$F$61:$F$115,Таблица1[[#This Row],[АСТРА]])","v":0},{"$f":"Таблица1[[#This Row],[Столбец17]]+Таблица1[[#This Row],[Столбец18]]","v":0},null,null,null,{"$f":"SUMIFS($X$61:$X$115,$C$61:$C$115,Таблица1[[#This Row],[Дл]],$D$61:$D$115,\"=500\",$L$61:$L$115,Таблица1[[#This Row],[Толщ.копия]],$F$61:$F$115,Таблица1[[#This Row],[АСТРА]])","v":0},{"$f":"SUMIFS($X$61:$X$115,$C$61:$C$115,\"<\"&Таблица1[[#This Row],[Дл]],$D$61:$D$115,\"=500\",$L$61:$L$115,Таблица1[[#This Row],[Толщ.копия]],$F$61:$F$115,Таблица1[[#This Row],[АСТРА]])","v":0},{"$f":"Таблица1[[#This Row],[Столбец23]]+Таблица1[[#This Row],[Столбец24]]","v":0},{"$f":"Таблица1[[#This Row],[Столбец28]]+Таблица1[[#This Row],[Столбец29]]-Таблица1[[#This Row],[Столбец27]]","v":0},{"$f":"Таблица1[[#This Row],[резы]]*Таблица1[[#This Row],[шир.рез]]/1000*Таблица1[[#This Row],[коэф]]/2","v":0},{"$f":"SUMIFS($Y$61:$Y$115,$C$61:$C$115,Таблица1[[#This Row],[Дл]],$D$61:$D$115,\"=500\",$L$61:$L$115,Таблица1[[#This Row],[Толщ.копия]],$F$61:$F$115,Таблица1[[#This Row],[АСТРА]])","v":0},{"$f":"SUMIFS($Y$61:$Y$115,$C$61:$C$115,\"<\"&Таблица1[[#This Row],[Дл]],$D$61:$D$115,\"=500\",$L$61:$L$115,Таблица1[[#This Row],[Толщ.копия]],$F$61:$F$115,Таблица1[[#This Row],[АСТРА]])","v":0},5,{"$f":"IF(Таблица1[[#This Row],[профиль]]=Таблица1[[#This Row],[толщ]],CONCATENATE(Таблица1[[#This Row],[Столбец33]],\" \",Таблица1[[#This Row],[толщ]]),CONCATENATE(Таблица1[[#This Row],[Столбец33]],\" \",Таблица1[[#This Row],[профиль]],\"х\",Таблица1[[#This Row],[толщ]]))","v":"Труба 20х20х1"},{"$f":"CONCATENATE(Таблица1[[#This Row],[Столбец33]],\" \",Таблица1[[#This Row],[профиль]])","v":"Труба 20х20"},"Труба 20х20 чм, 1.0 мм","Труба",{"$f":"IF(Таблица1[[#This Row],[профиль]]=Таблица1[[#This Row],[толщ]],Таблица1[[#This Row],[толщ]],CONCATENATE(Таблица1[[#This Row],[профиль]],\"х\",Таблица1[[#This Row],[точка]]))","v":"20х20х1"},"20х20",1,{"$f":"SUBSTITUTE(Таблица1[[#This Row],[толщ]],\",\",\".\")","v":"1"},1.248]
[{"$f":"IF(Таблица1[[#This Row],[Столбец19]]=0,\"z\",\"\")","v":"z"},null,null,6000,null,{"$f":"SUMIFS($G$61:$G$115,$D$61:$D$115,500,$C$61:$C$115,Таблица1[[#This Row],[Дл]],$L$61:$L$115,Таблица1[[#This Row],[Толщ.копия]],$F$61:$F$115,Таблица1[[#This Row],[АСТРА]])","v":0},{"$f":"Таблица1[[#This Row],[толщ]]","v":1.5},{"$f":"Таблица1[[#This Row],[ГОСТ]]","v":"Труба 20х20х1,5"},{"$f":"SUMIFS($N$61:$N$115,$C$61:$C$115,Таблица1[[#This Row],[Дл]],$D$61:$D$115,\"=500\",$L$61:$L$115,Таблица1[[#This Row],[Толщ.копия]],$F$61:$F$115,Таблица1[[#This Row],[АСТРА]])","v":0},{"$f":"SUMIFS($N$61:$N$115,$C$61:$C$115,\"<\"&Таблица1[[#This Row],[Дл]],$D$61:$D$115,\"=500\",$L$61:$L$115,Таблица1[[#This Row],[Толщ.копия]],$F$61:$F$115,Таблица1[[#This Row],[АСТРА]])","v":0},null,null,{"$f":"SUMIFS($J$8:$J$57,$K$8:$K$57,Таблица1[[#This Row],[Столбец5]])","v":0},{"$f":"Таблица1[[#This Row],[Столбец8]]+Таблица1[[#This Row],[Столбец9]]","v":0},{"$f":"SUMIFS($Q$61:$Q$115,$C$61:$C$115,Таблица1[[#This Row],[Дл]],$D$61:$D$115,\"=500\",$L$61:$L$115,Таблица1[[#This Row],[Толщ.копия]],$F$61:$F$115,Таблица1[[#This Row],[АСТРА]])","v":0},{"$f":"SUMIFS($Q$61:$Q$115,$C$61:$C$115,\"<\"&Таблица1[[#This Row],[Дл]],$D$61:$D$115,\"=500\",$L$61:$L$115,Таблица1[[#This Row],[Толщ.копия]],$F$61:$F$115,Таблица1[[#This Row],[АСТРА]])","v":0},{"$f":"Таблица1[[#This Row],[Столбец13]]+Таблица1[[#This Row],[Столбец14]]","v":0},{"$f":"Таблица1[[#This Row],[Столбец28]]+Таблица1[[#This Row],[Столбец29]]-Таблица1[[#This Row],[Столбец27]]","v":0},{"$f":"SUMIFS($T$61:$T$115,$C$61:$C$115,Таблица1[[#This Row],[Дл]],$D$61:$D$115,\"=500\",$L$61:$L$115,Таблица1[[#This Row],[Толщ.копия]],$F$61:$F$115,Таблица1[[#This Row],[АСТРА]])","v":0},{"$f":"SUMIFS($T$61:$T$115,$C$61:$C$115,\"<\"&Таблица1[[#This Row],[Дл]],$D$61:$D$115,\"=500\",$L$61:$L$115,Таблица1[[#This Row],[Толщ.копия]],$F$61:$F$115,Таблица1[[#This Row],[АСТРА]])","v":0},{"$f":"Таблица1[[#This Row],[Столбец17]]+Таблица1[[#This Row],[Столбец18]]","v":0},null,null,null,{"$f":"SUMIFS($X$61:$X$115,$C$61:$C$115,Таблица1[[#This Row],[Дл]],$D$61:$D$115,\"=500\",$L$61:$L$115,Таблица1[[#This Row],[Толщ.копия]],$F$61:$F$115,Таблица1[[#This Row],[АСТРА]])","v":0},{"$f":"SUMIFS($X$61:$X$115,$C$61:$C$115,\"<\"&Таблица1[[#This Row],[Дл]],$D$61:$D$115,\"=500\",$L$61:$L$115,Таблица1[[#This Row],[Толщ.копия]],$F$61:$F$115,Таблица1[[#This Row],[АСТРА]])","v":0},{"$f":"Таблица1[[#This Row],[Столбец23]]+Таблица1[[#This Row],[Столбец24]]","v":0},{"$f":"Таблица1[[#This Row],[Столбец28]]+Таблица1[[#This Row],[Столбец29]]-Таблица1[[#This Row],[Столбец27]]","v":0},{"$f":"Таблица1[[#This Row],[резы]]*Таблица1[[#This Row],[шир.рез]]/1000*Таблица1[[#This Row],[коэф]]/2","v":0},{"$f":"SUMIFS($Y$61:$Y$115,$C$61:$C$115,Таблица1[[#This Row],[Дл]],$D$61:$D$115,\"=500\",$L$61:$L$115,Таблица1[[#This Row],[Толщ.копия]],$F$61:$F$115,Таблица1[[#This Row],[АСТРА]])","v":0},{"$f":"SUMIFS($Y$61:$Y$115,$C$61:$C$115,\"<\"&Таблица1[[#This Row],[Дл]],$D$61:$D$115,\"=500\",$L$61:$L$115,Таблица1[[#This Row],[Толщ.копия]],$F$61:$F$115,Таблица1[[#This Row],[АСТРА]])","v":0},5,{"$f":"IF(Таблица1[[#This Row],[профиль]]=Таблица1[[#This Row],[толщ]],CONCATENATE(Таблица1[[#This Row],[Столбец33]],\" \",Таблица1[[#This Row],[толщ]]),CONCATENATE(Таблица1[[#This Row],[Столбец33]],\" \",Таблица1[[#This Row],[профиль]],\"х\",Таблица1[[#This Row],[толщ]]))","v":"Труба 20х20х1,5"},{"$f":"CONCATENATE(Таблица1[[#This Row],[Столбец33]],\" \",Таблица1[[#This Row],[профиль]])","v":"Труба 20х20"},"Труба 20х20, 1.5 мм, ТР2020","Труба",{"$f":"IF(Таблица1[[#This Row],[профиль]]=Таблица1[[#This Row],[толщ]],Таблица1[[#This Row],[толщ]],CONCATENATE(Таблица1[[#This Row],[профиль]],\"х\",Таблица1[[#This Row],[точка]]))","v":"20х20х1.5"},"20х20",1.5,{"$f":"SUBSTITUTE(Таблица1[[#This Row],[толщ]],\",\",\".\")","v":"1.5"},1.8720000000000001]
[{"$f":"IF(Таблица1[[#This Row],[Столбец19]]=0,\"z\",\"\")","v":"z"},8,null,6000,null,{"$f":"SUMIFS($G$61:$G$115,$D$61:$D$115,500,$C$61:$C$115,Таблица1[[#This Row],[Дл]],$L$61:$L$115,Таблица1[[#This Row],[Толщ.копия]],$F$61:$F$115,Таблица1[[#This Row],[АСТРА]])","v":0},{"$f":"Таблица1[[#This Row],[толщ]]","v":1.5},{"$f":"Таблица1[[#This Row],[ГОСТ]]","v":"Труба 25х1,5"},{"$f":"SUMIFS($N$61:$N$115,$C$61:$C$115,Таблица1[[#This Row],[Дл]],$D$61:$D$115,\"=500\",$L$61:$L$115,Таблица1[[#This Row],[Толщ.копия]],$F$61:$F$115,Таблица1[[#This Row],[АСТРА]])","v":0},{"$f":"SUMIFS($N$61:$N$115,$C$61:$C$115,\"<\"&Таблица1[[#This Row],[Дл]],$D$61:$D$115,\"=500\",$L$61:$L$115,Таблица1[[#This Row],[Толщ.копия]],$F$61:$F$115,Таблица1[[#This Row],[АСТРА]])","v":0},null,null,{"$f":"SUMIFS($J$8:$J$57,$K$8:$K$57,Таблица1[[#This Row],[Столбец5]])","v":0},{"$f":"Таблица1[[#This Row],[Столбец8]]+Таблица1[[#This Row],[Столбец9]]","v":0},{"$f":"SUMIFS($Q$61:$Q$115,$C$61:$C$115,Таблица1[[#This Row],[Дл]],$D$61:$D$115,\"=500\",$L$61:$L$115,Таблица1[[#This Row],[Толщ.копия]],$F$61:$F$115,Таблица1[[#This Row],[АСТРА]])","v":0},{"$f":"SUMIFS($Q$61:$Q$115,$C$61:$C$115,\"<\"&Таблица1[[#This Row],[Дл]],$D$61:$D$115,\"=500\",$L$61:$L$115,Таблица1[[#This Row],[Толщ.копия]],$F$61:$F$115,Таблица1[[#This Row],[АСТРА]])","v":0},{"$f":"Таблица1[[#This Row],[Столбец13]]+Таблица1[[#This Row],[Столбец14]]","v":0},{"$f":"Таблица1[[#This Row],[Столбец28]]+Таблица1[[#This Row],[Столбец29]]-Таблица1[[#This Row],[Столбец27]]","v":0},{"$f":"SUMIFS($T$61:$T$115,$C$61:$C$115,Таблица1[[#This Row],[Дл]],$D$61:$D$115,\"=500\",$L$61:$L$115,Таблица1[[#This Row],[Толщ.копия]],$F$61:$F$115,Таблица1[[#This Row],[АСТРА]])","v":0},{"$f":"SUMIFS($T$61:$T$115,$C$61:$C$115,\"<\"&Таблица1[[#This Row],[Дл]],$D$61:$D$115,\"=500\",$L$61:$L$115,Таблица1[[#This Row],[Толщ.копия]],$F$61:$F$115,Таблица1[[#This Row],[АСТРА]])","v":0},{"$f":"Таблица1[[#This Row],[Столбец17]]+Таблица1[[#This Row],[Столбец18]]","v":0},null,null,null,{"$f":"SUMIFS($X$61:$X$115,$C$61:$C$115,Таблица1[[#This Row],[Дл]],$D$61:$D$115,\"=500\",$L$61:$L$115,Таблица1[[#This Row],[Толщ.копия]],$F$61:$F$115,Таблица1[[#This Row],[АСТРА]])","v":0},{"$f":"SUMIFS($X$61:$X$115,$C$61:$C$115,\"<\"&Таблица1[[#This Row],[Дл]],$D$61:$D$115,\"=500\",$L$61:$L$115,Таблица1[[#This Row],[Толщ.копия]],$F$61:$F$115,Таблица1[[#This Row],[АСТРА]])","v":0},{"$f":"Таблица1[[#This Row],[Столбец23]]+Таблица1[[#This Row],[Столбец24]]","v":0},{"$f":"Таблица1[[#This Row],[Столбец28]]+Таблица1[[#This Row],[Столбец29]]-Таблица1[[#This Row],[Столбец27]]","v":0},{"$f":"Таблица1[[#This Row],[резы]]*Таблица1[[#This Row],[шир.рез]]/1000*Таблица1[[#This Row],[коэф]]/2","v":0},{"$f":"SUMIFS($Y$61:$Y$115,$C$61:$C$115,Таблица1[[#This Row],[Дл]],$D$61:$D$115,\"=500\",$L$61:$L$115,Таблица1[[#This Row],[Толщ.копия]],$F$61:$F$115,Таблица1[[#This Row],[АСТРА]])","v":0},{"$f":"SUMIFS($Y$61:$Y$115,$C$61:$C$115,\"<\"&Таблица1[[#This Row],[Дл]],$D$61:$D$115,\"=500\",$L$61:$L$115,Таблица1[[#This Row],[Толщ.копия]],$F$61:$F$115,Таблица1[[#This Row],[АСТРА]])","v":0},5,{"$f":"IF(Таблица1[[#This Row],[профиль]]=Таблица1[[#This Row],[толщ]],CONCATENATE(Таблица1[[#This Row],[Столбец33]],\" \",Таблица1[[#This Row],[толщ]]),CONCATENATE(Таблица1[[#This Row],[Столбец33]],\" \",Таблица1[[#This Row],[профиль]],\"х\",Таблица1[[#This Row],[толщ]]))","v":"Труба 25х1,5"},{"$f":"CONCATENATE(Таблица1[[#This Row],[Столбец33]],\" \",Таблица1[[#This Row],[профиль]])","v":"Труба 25"},"Труба 25, 1.5 мм, тр25","Труба",{"$f":"IF(Таблица1[[#This Row],[профиль]]=Таблица1[[#This Row],[толщ]],Таблица1[[#This Row],[толщ]],CONCATENATE(Таблица1[[#This Row],[профиль]],\"х\",Таблица1[[#This Row],[точка]]))","v":"25х1.5"},25,1.5,{"$f":"SUBSTITUTE(Таблица1[[#This Row],[толщ]],\",\",\".\")","v":"1.5"},1.74]
[{"$f":"IF(Таблица1[[#This Row],[Столбец19]]=0,\"z\",\"\")","v":"z"},1,null,6000,null,{"$f":"SUMIFS($G$61:$G$115,$D$61:$D$115,500,$C$61:$C$115,Таблица1[[#This Row],[Дл]],$L$61:$L$115,Таблица1[[#This Row],[Толщ.копия]],$F$61:$F$115,Таблица1[[#This Row],[АСТРА]])","v":0},{"$f":"Таблица1[[#This Row],[толщ]]","v":0.8},{"$f":"Таблица1[[#This Row],[ГОСТ]]","v":"Труба 25х25х0,8"},{"$f":"SUMIFS($N$61:$N$115,$C$61:$C$115,Таблица1[[#This Row],[Дл]],$D$61:$D$115,\"=500\",$L$61:$L$115,Таблица1[[#This Row],[Толщ.копия]],$F$61:$F$115,Таблица1[[#This Row],[АСТРА]])","v":0},{"$f":"SUMIFS($N$61:$N$115,$C$61:$C$115,\"<\"&Таблица1[[#This Row],[Дл]],$D$61:$D$115,\"=500\",$L$61:$L$115,Таблица1[[#This Row],[Толщ.копия]],$F$61:$F$115,Таблица1[[#This Row],[АСТРА]])","v":0},null,null,{"$f":"SUMIFS($J$8:$J$57,$K$8:$K$57,Таблица1[[#This Row],[Столбец5]])","v":0},{"$f":"Таблица1[[#This Row],[Столбец8]]+Таблица1[[#This Row],[Столбец9]]","v":0},{"$f":"SUMIFS($Q$61:$Q$115,$C$61:$C$115,Таблица1[[#This Row],[Дл]],$D$61:$D$115,\"=500\",$L$61:$L$115,Таблица1[[#This Row],[Толщ.копия]],$F$61:$F$115,Таблица1[[#This Row],[АСТРА]])","v":0},{"$f":"SUMIFS($Q$61:$Q$115,$C$61:$C$115,\"<\"&Таблица1[[#This Row],[Дл]],$D$61:$D$115,\"=500\",$L$61:$L$115,Таблица1[[#This Row],[Толщ.копия]],$F$61:$F$115,Таблица1[[#This Row],[АСТРА]])","v":0},{"$f":"Таблица1[[#This Row],[Столбец13]]+Таблица1[[#This Row],[Столбец14]]","v":0},{"$f":"Таблица1[[#This Row],[Столбец28]]+Таблица1[[#This Row],[Столбец29]]-Таблица1[[#This Row],[Столбец27]]","v":0},{"$f":"SUMIFS($T$61:$T$115,$C$61:$C$115,Таблица1[[#This Row],[Дл]],$D$61:$D$115,\"=500\",$L$61:$L$115,Таблица1[[#This Row],[Толщ.копия]],$F$61:$F$115,Таблица1[[#This Row],[АСТРА]])","v":0},{"$f":"SUMIFS($T$61:$T$115,$C$61:$C$115,\"<\"&Таблица1[[#This Row],[Дл]],$D$61:$D$115,\"=500\",$L$61:$L$115,Таблица1[[#This Row],[Толщ.копия]],$F$61:$F$115,Таблица1[[#This Row],[АСТРА]])","v":0},{"$f":"Таблица1[[#This Row],[Столбец17]]+Таблица1[[#This Row],[Столбец18]]","v":0},null,null,null,{"$f":"SUMIFS($X$61:$X$115,$C$61:$C$115,Таблица1[[#This Row],[Дл]],$D$61:$D$115,\"=500\",$L$61:$L$115,Таблица1[[#This Row],[Толщ.копия]],$F$61:$F$115,Таблица1[[#This Row],[АСТРА]])","v":0},{"$f":"SUMIFS($X$61:$X$115,$C$61:$C$115,\"<\"&Таблица1[[#This Row],[Дл]],$D$61:$D$115,\"=500\",$L$61:$L$115,Таблица1[[#This Row],[Толщ.копия]],$F$61:$F$115,Таблица1[[#This Row],[АСТРА]])","v":0},{"$f":"Таблица1[[#This Row],[Столбец23]]+Таблица1[[#This Row],[Столбец24]]","v":0},{"$f":"Таблица1[[#This Row],[Столбец28]]+Таблица1[[#This Row],[Столбец29]]-Таблица1[[#This Row],[Столбец27]]","v":0},{"$f":"Таблица1[[#This Row],[резы]]*Таблица1[[#This Row],[шир.рез]]/1000*Таблица1[[#This Row],[коэф]]/2","v":0},{"$f":"SUMIFS($Y$61:$Y$115,$C$61:$C$115,Таблица1[[#This Row],[Дл]],$D$61:$D$115,\"=500\",$L$61:$L$115,Таблица1[[#This Row],[Толщ.копия]],$F$61:$F$115,Таблица1[[#This Row],[АСТРА]])","v":0},{"$f":"SUMIFS($Y$61:$Y$115,$C$61:$C$115,\"<\"&Таблица1[[#This Row],[Дл]],$D$61:$D$115,\"=500\",$L$61:$L$115,Таблица1[[#This Row],[Толщ.копия]],$F$61:$F$115,Таблица1[[#This Row],[АСТРА]])","v":0},5,{"$f":"IF(Таблица1[[#This Row],[профиль]]=Таблица1[[#This Row],[толщ]],CONCATENATE(Таблица1[[#This Row],[Столбец33]],\" \",Таблица1[[#This Row],[толщ]]),CONCATENATE(Таблица1[[#This Row],[Столбец33]],\" \",Таблица1[[#This Row],[профиль]],\"х\",Таблица1[[#This Row],[толщ]]))","v":"Труба 25х25х0,8"},{"$f":"CONCATENATE(Таблица1[[#This Row],[Столбец33]],\" \",Таблица1[[#This Row],[профиль]])","v":"Труба 25х25"},"Труба 25х25 чм, 0.8 мм","Труба",{"$f":"IF(Таблица1[[#This Row],[профиль]]=Таблица1[[#This Row],[толщ]],Таблица1[[#This Row],[толщ]],CONCATENATE(Таблица1[[#This Row],[профиль]],\"х\",Таблица1[[#This Row],[точка]]))","v":"25х25х0.8"},"25х25",0.8,{"$f":"SUBSTITUTE(Таблица1[[#This Row],[толщ]],\",\",\".\")","v":"0.8"},1.2]
[{"$f":"IF(Таблица1[[#This Row],[Столбец19]]=0,\"z\",\"\")","v":"z"},2,null,6000,null,{"$f":"SUMIFS($G$61:$G$115,$D$61:$D$115,500,$C$61:$C$115,Таблица1[[#This Row],[Дл]],$L$61:$L$115,Таблица1[[#This Row],[Толщ.копия]],$F$61:$F$115,Таблица1[[#This Row],[АСТРА]])","v":0},{"$f":"Таблица1[[#This Row],[толщ]]","v":1},{"$f":"Таблица1[[#This Row],[ГОСТ]]","v":"Труба 25х25х1"},{"$f":"SUMIFS($N$61:$N$115,$C$61:$C$115,Таблица1[[#This Row],[Дл]],$D$61:$D$115,\"=500\",$L$61:$L$115,Таблица1[[#This Row],[Толщ.копия]],$F$61:$F$115,Таблица1[[#This Row],[АСТРА]])","v":0},{"$f":"SUMIFS($N$61:$N$115,$C$61:$C$115,\"<\"&Таблица1[[#This Row],[Дл]],$D$61:$D$115,\"=500\",$L$61:$L$115,Таблица1[[#This Row],[Толщ.копия]],$F$61:$F$115,Таблица1[[#This Row],[АСТРА]])","v":0},null,null,{"$f":"SUMIFS($J$8:$J$57,$K$8:$K$57,Таблица1[[#This Row],[Столбец5]])","v":0},{"$f":"Таблица1[[#This Row],[Столбец8]]+Таблица1[[#This Row],[Столбец9]]","v":0},{"$f":"SUMIFS($Q$61:$Q$115,$C$61:$C$115,Таблица1[[#This Row],[Дл]],$D$61:$D$115,\"=500\",$L$61:$L$115,Таблица1[[#This Row],[Толщ.копия]],$F$61:$F$115,Таблица1[[#This Row],[АСТРА]])","v":0},{"$f":"SUMIFS($Q$61:$Q$115,$C$61:$C$115,\"<\"&Таблица1[[#This Row],[Дл]],$D$61:$D$115,\"=500\",$L$61:$L$115,Таблица1[[#This Row],[Толщ.копия]],$F$61:$F$115,Таблица1[[#This Row],[АСТРА]])","v":0},{"$f":"Таблица1[[#This Row],[Столбец13]]+Таблица1[[#This Row],[Столбец14]]","v":0},{"$f":"Таблица1[[#This Row],[Столбец28]]+Таблица1[[#This Row],[Столбец29]]-Таблица1[[#This Row],[Столбец27]]","v":0},{"$f":"SUMIFS($T$61:$T$115,$C$61:$C$115,Таблица1[[#This Row],[Дл]],$D$61:$D$115,\"=500\",$L$61:$L$115,Таблица1[[#This Row],[Толщ.копия]],$F$61:$F$115,Таблица1[[#This Row],[АСТРА]])","v":0},{"$f":"SUMIFS($T$61:$T$115,$C$61:$C$115,\"<\"&Таблица1[[#This Row],[Дл]],$D$61:$D$115,\"=500\",$L$61:$L$115,Таблица1[[#This Row],[Толщ.копия]],$F$61:$F$115,Таблица1[[#This Row],[АСТРА]])","v":0},{"$f":"Таблица1[[#This Row],[Столбец17]]+Таблица1[[#This Row],[Столбец18]]","v":0},null,null,null,{"$f":"SUMIFS($X$61:$X$115,$C$61:$C$115,Таблица1[[#This Row],[Дл]],$D$61:$D$115,\"=500\",$L$61:$L$115,Таблица1[[#This Row],[Толщ.копия]],$F$61:$F$115,Таблица1[[#This Row],[АСТРА]])","v":0},{"$f":"SUMIFS($X$61:$X$115,$C$61:$C$115,\"<\"&Таблица1[[#This Row],[Дл]],$D$61:$D$115,\"=500\",$L$61:$L$115,Таблица1[[#This Row],[Толщ.копия]],$F$61:$F$115,Таблица1[[#This Row],[АСТРА]])","v":0},{"$f":"Таблица1[[#This Row],[Столбец23]]+Таблица1[[#This Row],[Столбец24]]","v":0},{"$f":"Таблица1[[#This Row],[Столбец28]]+Таблица1[[#This Row],[Столбец29]]-Таблица1[[#This Row],[Столбец27]]","v":0},{"$f":"Таблица1[[#This Row],[резы]]*Таблица1[[#This Row],[шир.рез]]/1000*Таблица1[[#This Row],[коэф]]/2","v":0},{"$f":"SUMIFS($Y$61:$Y$115,$C$61:$C$115,Таблица1[[#This Row],[Дл]],$D$61:$D$115,\"=500\",$L$61:$L$115,Таблица1[[#This Row],[Толщ.копия]],$F$61:$F$115,Таблица1[[#This Row],[АСТРА]])","v":0},{"$f":"SUMIFS($Y$61:$Y$115,$C$61:$C$115,\"<\"&Таблица1[[#This Row],[Дл]],$D$61:$D$115,\"=500\",$L$61:$L$115,Таблица1[[#This Row],[Толщ.копия]],$F$61:$F$115,Таблица1[[#This Row],[АСТРА]])","v":0},5,{"$f":"IF(Таблица1[[#This Row],[профиль]]=Таблица1[[#This Row],[толщ]],CONCATENATE(Таблица1[[#This Row],[Столбец33]],\" \",Таблица1[[#This Row],[толщ]]),CONCATENATE(Таблица1[[#This Row],[Столбец33]],\" \",Таблица1[[#This Row],[профиль]],\"х\",Таблица1[[#This Row],[толщ]]))","v":"Труба 25х25х1"},{"$f":"CONCATENATE(Таблица1[[#This Row],[Столбец33]],\" \",Таблица1[[#This Row],[профиль]])","v":"Труба 25х25"},"Труба 25х25 чм, 1.0 мм","Труба",{"$f":"IF(Таблица1[[#This Row],[профиль]]=Таблица1[[#This Row],[толщ]],Таблица1[[#This Row],[толщ]],CONCATENATE(Таблица1[[#This Row],[профиль]],\"х\",Таблица1[[#This Row],[точка]]))","v":"25х25х1"},"25х25",1,{"$f":"SUBSTITUTE(Таблица1[[#This Row],[толщ]],\",\",\".\")","v":"1"},1.48]
[{"$f":"IF(Таблица1[[#This Row],[Столбец19]]=0,\"z\",\"\")","v":"z"},3,null,6000,null,{"$f":"SUMIFS($G$61:$G$115,$D$61:$D$115,500,$C$61:$C$115,Таблица1[[#This Row],[Дл]],$L$61:$L$115,Таблица1[[#This Row],[Толщ.копия]],$F$61:$F$115,Таблица1[[#This Row],[АСТРА]])","v":0},{"$f":"Таблица1[[#This Row],[толщ]]","v":1.2},{"$f":"Таблица1[[#This Row],[ГОСТ]]","v":"Труба 25х25х1,2"},{"$f":"SUMIFS($N$61:$N$115,$C$61:$C$115,Таблица1[[#This Row],[Дл]],$D$61:$D$115,\"=500\",$L$61:$L$115,Таблица1[[#This Row],[Толщ.копия]],$F$61:$F$115,Таблица1[[#This Row],[АСТРА]])","v":0},{"$f":"SUMIFS($N$61:$N$115,$C$61:$C$115,\"<\"&Таблица1[[#This Row],[Дл]],$D$61:$D$115,\"=500\",$L$61:$L$115,Таблица1[[#This Row],[Толщ.копия]],$F$61:$F$115,Таблица1[[#This Row],[АСТРА]])","v":0},null,null,{"$f":"SUMIFS($J$8:$J$57,$K$8:$K$57,Таблица1[[#This Row],[Столбец5]])","v":110},{"$f":"Таблица1[[#This Row],[Столбец8]]+Таблица1[[#This Row],[Столбец9]]","v":0},{"$f":"SUMIFS($Q$61:$Q$115,$C$61:$C$115,Таблица1[[#This Row],[Дл]],$D$61:$D$115,\"=500\",$L$61:$L$115,Таблица1[[#This Row],[Толщ.копия]],$F$61:$F$115,Таблица1[[#This Row],[АСТРА]])","v":0},{"$f":"SUMIFS($Q$61:$Q$115,$C$61:$C$115,\"<\"&Таблица1[[#This Row],[Дл]],$D$61:$D$115,\"=500\",$L$61:$L$115,Таблица1[[#This Row],[Толщ.копия]],$F$61:$F$115,Таблица1[[#This Row],[АСТРА]])","v":0},{"$f":"Таблица1[[#This Row],[Столбец13]]+Таблица1[[#This Row],[Столбец14]]","v":0},{"$f":"Таблица1[[#This Row],[Столбец28]]+Таблица1[[#This Row],[Столбец29]]-Таблица1[[#This Row],[Столбец27]]","v":-0.48125000000000007},{"$f":"SUMIFS($T$61:$T$115,$C$61:$C$115,Таблица1[[#This Row],[Дл]],$D$61:$D$115,\"=500\",$L$61:$L$115,Таблица1[[#This Row],[Толщ.копия]],$F$61:$F$115,Таблица1[[#This Row],[АСТРА]])","v":0},{"$f":"SUMIFS($T$61:$T$115,$C$61:$C$115,\"<\"&Таблица1[[#This Row],[Дл]],$D$61:$D$115,\"=500\",$L$61:$L$115,Таблица1[[#This Row],[Толщ.копия]],$F$61:$F$115,Таблица1[[#This Row],[АСТРА]])","v":0},{"$f":"Таблица1[[#This Row],[Столбец17]]+Таблица1[[#This Row],[Столбец18]]","v":0},null,null,null,{"$f":"SUMIFS($X$61:$X$115,$C$61:$C$115,Таблица1[[#This Row],[Дл]],$D$61:$D$115,\"=500\",$L$61:$L$115,Таблица1[[#This Row],[Толщ.копия]],$F$61:$F$115,Таблица1[[#This Row],[АСТРА]])","v":0},{"$f":"SUMIFS($X$61:$X$115,$C$61:$C$115,\"<\"&Таблица1[[#This Row],[Дл]],$D$61:$D$115,\"=500\",$L$61:$L$115,Таблица1[[#This Row],[Толщ.копия]],$F$61:$F$115,Таблица1[[#This Row],[АСТРА]])","v":0},{"$f":"Таблица1[[#This Row],[Столбец23]]+Таблица1[[#This Row],[Столбец24]]","v":0},{"$f":"Таблица1[[#This Row],[Столбец28]]+Таблица1[[#This Row],[Столбец29]]-Таблица1[[#This Row],[Столбец27]]","v":-0.48125000000000007},{"$f":"Таблица1[[#This Row],[резы]]*Таблица1[[#This Row],[шир.рез]]/1000*Таблица1[[#This Row],[коэф]]/2","v":0.48125000000000007},{"$f":"SUMIFS($Y$61:$Y$115,$C$61:$C$115,Таблица1[[#This Row],[Дл]],$D$61:$D$115,\"=500\",$L$61:$L$115,Таблица1[[#This Row],[Толщ.копия]],$F$61:$F$115,Таблица1[[#This Row],[АСТРА]])","v":0},{"$f":"SUMIFS($Y$61:$Y$115,$C$61:$C$115,\"<\"&Таблица1[[#This Row],[Дл]],$D$61:$D$115,\"=500\",$L$61:$L$115,Таблица1[[#This Row],[Толщ.копия]],$F$61:$F$115,Таблица1[[#This Row],[АСТРА]])","v":0},5,{"$f":"IF(Таблица1[[#This Row],[профиль]]=Таблица1[[#This Row],[толщ]],CONCATENATE(Таблица1[[#This Row],[Столбец33]],\" \",Таблица1[[#This Row],[толщ]]),CONCATENATE(Таблица1[[#This Row],[Столбец33]],\" \",Таблица1[[#This Row],[профиль]],\"х\",Таблица1[[#This Row],[толщ]]))","v":"Труба 25х25х1,2"},{"$f":"CONCATENATE(Таблица1[[#This Row],[Столбец33]],\" \",Таблица1[[#This Row],[профиль]])","v":"Труба 25х25"},"Труба 25х25 чм, 1.2 мм","Труба",{"$f":"IF(Таблица1[[#This Row],[профиль]]=Таблица1[[#This Row],[толщ]],Таблица1[[#This Row],[толщ]],CONCATENATE(Таблица1[[#This Row],[профиль]],\"х\",Таблица1[[#This Row],[точка]]))","v":"25х25х1.2"},"25х25",1.2,{"$f":"SUBSTITUTE(Таблица1[[#This Row],[толщ]],\",\",\".\")","v":"1.2"},1.75]
[{"$f":"IF(Таблица1[[#This Row],[Столбец19]]=0,\"z\",\"\")","v":"z"},null,null,6000,null,{"$f":"SUMIFS($G$61:$G$115,$D$61:$D$115,500,$C$61:$C$115,Таблица1[[#This Row],[Дл]],$L$61:$L$115,Таблица1[[#This Row],[Толщ.копия]],$F$61:$F$115,Таблица1[[#This Row],[АСТРА]])","v":0},{"$f":"Таблица1[[#This Row],[толщ]]","v":1.5},{"$f":"Таблица1[[#This Row],[ГОСТ]]","v":"Труба 30х15х1,5"},{"$f":"SUMIFS($N$61:$N$115,$C$61:$C$115,Таблица1[[#This Row],[Дл]],$D$61:$D$115,\"=500\",$L$61:$L$115,Таблица1[[#This Row],[Толщ.копия]],$F$61:$F$115,Таблица1[[#This Row],[АСТРА]])","v":0},{"$f":"SUMIFS($N$61:$N$115,$C$61:$C$115,\"<\"&Таблица1[[#This Row],[Дл]],$D$61:$D$115,\"=500\",$L$61:$L$115,Таблица1[[#This Row],[Толщ.копия]],$F$61:$F$115,Таблица1[[#This Row],[АСТРА]])","v":0},null,null,{"$f":"SUMIFS($J$8:$J$57,$K$8:$K$57,Таблица1[[#This Row],[Столбец5]])","v":0},{"$f":"Таблица1[[#This Row],[Столбец8]]+Таблица1[[#This Row],[Столбец9]]","v":0},{"$f":"SUMIFS($Q$61:$Q$115,$C$61:$C$115,Таблица1[[#This Row],[Дл]],$D$61:$D$115,\"=500\",$L$61:$L$115,Таблица1[[#This Row],[Толщ.копия]],$F$61:$F$115,Таблица1[[#This Row],[АСТРА]])","v":0},{"$f":"SUMIFS($Q$61:$Q$115,$C$61:$C$115,\"<\"&Таблица1[[#This Row],[Дл]],$D$61:$D$115,\"=500\",$L$61:$L$115,Таблица1[[#This Row],[Толщ.копия]],$F$61:$F$115,Таблица1[[#This Row],[АСТРА]])","v":0},{"$f":"Таблица1[[#This Row],[Столбец13]]+Таблица1[[#This Row],[Столбец14]]","v":0},{"$f":"Таблица1[[#This Row],[Столбец28]]+Таблица1[[#This Row],[Столбец29]]-Таблица1[[#This Row],[Столбец27]]","v":0},{"$f":"SUMIFS($T$61:$T$115,$C$61:$C$115,Таблица1[[#This Row],[Дл]],$D$61:$D$115,\"=500\",$L$61:$L$115,Таблица1[[#This Row],[Толщ.копия]],$F$61:$F$115,Таблица1[[#This Row],[АСТРА]])","v":0},{"$f":"SUMIFS($T$61:$T$115,$C$61:$C$115,\"<\"&Таблица1[[#This Row],[Дл]],$D$61:$D$115,\"=500\",$L$61:$L$115,Таблица1[[#This Row],[Толщ.копия]],$F$61:$F$115,Таблица1[[#This Row],[АСТРА]])","v":0},{"$f":"Таблица1[[#This Row],[Столбец17]]+Таблица1[[#This Row],[Столбец18]]","v":0},null,null,null,{"$f":"SUMIFS($X$61:$X$115,$C$61:$C$115,Таблица1[[#This Row],[Дл]],$D$61:$D$115,\"=500\",$L$61:$L$115,Таблица1[[#This Row],[Толщ.копия]],$F$61:$F$115,Таблица1[[#This Row],[АСТРА]])","v":0},{"$f":"SUMIFS($X$61:$X$115,$C$61:$C$115,\"<\"&Таблица1[[#This Row],[Дл]],$D$61:$D$115,\"=500\",$L$61:$L$115,Таблица1[[#This Row],[Толщ.копия]],$F$61:$F$115,Таблица1[[#This Row],[АСТРА]])","v":0},{"$f":"Таблица1[[#This Row],[Столбец23]]+Таблица1[[#This Row],[Столбец24]]","v":0},{"$f":"Таблица1[[#This Row],[Столбец28]]+Таблица1[[#This Row],[Столбец29]]-Таблица1[[#This Row],[Столбец27]]","v":0},{"$f":"Таблица1[[#This Row],[резы]]*Таблица1[[#This Row],[шир.рез]]/1000*Таблица1[[#This Row],[коэф]]/2","v":0},{"$f":"SUMIFS($Y$61:$Y$115,$C$61:$C$115,Таблица1[[#This Row],[Дл]],$D$61:$D$115,\"=500\",$L$61:$L$115,Таблица1[[#This Row],[Толщ.копия]],$F$61:$F$115,Таблица1[[#This Row],[АСТРА]])","v":0},{"$f":"SUMIFS($Y$61:$Y$115,$C$61:$C$115,\"<\"&Таблица1[[#This Row],[Дл]],$D$61:$D$115,\"=500\",$L$61:$L$115,Таблица1[[#This Row],[Толщ.копия]],$F$61:$F$115,Таблица1[[#This Row],[АСТРА]])","v":0},5,{"$f":"IF(Таблица1[[#This Row],[профиль]]=Таблица1[[#This Row],[толщ]],CONCATENATE(Таблица1[[#This Row],[Столбец33]],\" \",Таблица1[[#This Row],[толщ]]),CONCATENATE(Таблица1[[#This Row],[Столбец33]],\" \",Таблица1[[#This Row],[профиль]],\"х\",Таблица1[[#This Row],[толщ]]))","v":"Труба 30х15х1,5"},{"$f":"CONCATENATE(Таблица1[[#This Row],[Столбец33]],\" \",Таблица1[[#This Row],[профиль]])","v":"Труба 30х15"},"Труба 30х15, 1.5 мм, тр3015","Труба",{"$f":"IF(Таблица1[[#This Row],[профиль]]=Таблица1[[#This Row],[толщ]],Таблица1[[#This Row],[толщ]],CONCATENATE(Таблица1[[#This Row],[профиль]],\"х\",Таблица1[[#This Row],[точка]]))","v":"30х15х1.5"},"30х15",1.5,{"$f":"SUBSTITUTE(Таблица1[[#This Row],[толщ]],\",\",\".\")","v":"1.5"},1.92]
[{"$f":"IF(Таблица1[[#This Row],[Столбец19]]=0,\"z\",\"\")","v":""},4,null,6000,null,{"$f":"SUMIFS($G$61:$G$115,$D$61:$D$115,500,$C$61:$C$115,Таблица1[[#This Row],[Дл]],$L$61:$L$115,Таблица1[[#This Row],[Толщ.копия]],$F$61:$F$115,Таблица1[[#This Row],[АСТРА]])","v":32},{"$f":"Таблица1[[#This Row],[толщ]]","v":1.2},{"$f":"Таблица1[[#This Row],[ГОСТ]]","v":"Труба 30х20х1,2"},{"$f":"SUMIFS($N$61:$N$115,$C$61:$C$115,Таблица1[[#This Row],[Дл]],$D$61:$D$115,\"=500\",$L$61:$L$115,Таблица1[[#This Row],[Толщ.копия]],$F$61:$F$115,Таблица1[[#This Row],[АСТРА]])","v":168.96},{"$f":"SUMIFS($N$61:$N$115,$C$61:$C$115,\"<\"&Таблица1[[#This Row],[Дл]],$D$61:$D$115,\"=500\",$L$61:$L$115,Таблица1[[#This Row],[Толщ.копия]],$F$61:$F$115,Таблица1[[#This Row],[АСТРА]])","v":1.3156000000000001},null,null,{"$f":"SUMIFS($J$8:$J$57,$K$8:$K$57,Таблица1[[#This Row],[Столбец5]])","v":0},{"$f":"Таблица1[[#This Row],[Столбец8]]+Таблица1[[#This Row],[Столбец9]]","v":170.2756},{"$f":"SUMIFS($Q$61:$Q$115,$C$61:$C$115,Таблица1[[#This Row],[Дл]],$D$61:$D$115,\"=500\",$L$61:$L$115,Таблица1[[#This Row],[Толщ.копия]],$F$61:$F$115,Таблица1[[#This Row],[АСТРА]])","v":2.3443200302124025},{"$f":"SUMIFS($Q$61:$Q$115,$C$61:$C$115,\"<\"&Таблица1[[#This Row],[Дл]],$D$61:$D$115,\"=500\",$L$61:$L$115,Таблица1[[#This Row],[Толщ.копия]],$F$61:$F$115,Таблица1[[#This Row],[АСТРА]])","v":0},{"$f":"Таблица1[[#This Row],[Столбец13]]+Таблица1[[#This Row],[Столбец14]]","v":2.3443200302124025},{"$f":"Таблица1[[#This Row],[Столбец28]]+Таблица1[[#This Row],[Столбец29]]-Таблица1[[#This Row],[Столбец27]]","v":5.016877246475218},{"$f":"SUMIFS($T$61:$T$115,$C$61:$C$115,Таблица1[[#This Row],[Дл]],$D$61:$D$115,\"=500\",$L$61:$L$115,Таблица1[[#This Row],[Толщ.копия]],$F$61:$F$115,Таблица1[[#This Row],[АСТРА]])","v":161.67360270023346},{"$f":"SUMIFS($T$61:$T$115,$C$61:$C$115,\"<\"&Таблица1[[#This Row],[Дл]],$D$61:$D$115,\"=500\",$L$61:$L$115,Таблица1[[#This Row],[Толщ.копия]],$F$61:$F$115,Таблица1[[#This Row],[АСТРА]])","v":1.2408000230789185},{"$f":"Таблица1[[#This Row],[Столбец17]]+Таблица1[[#This Row],[Столбец18]]","v":162.91440272331238},null,null,null,{"$f":"SUMIFS($X$61:$X$115,$C$61:$C$115,Таблица1[[#This Row],[Дл]],$D$61:$D$115,\"=500\",$L$61:$L$115,Таблица1[[#This Row],[Толщ.копия]],$F$61:$F$115,Таблица1[[#This Row],[АСТРА]])","v":166.61567996978761},{"$f":"SUMIFS($X$61:$X$115,$C$61:$C$115,\"<\"&Таблица1[[#This Row],[Дл]],$D$61:$D$115,\"=500\",$L$61:$L$115,Таблица1[[#This Row],[Толщ.копия]],$F$61:$F$115,Таблица1[[#This Row],[АСТРА]])","v":1.3156000000000001},{"$f":"Таблица1[[#This Row],[Столбец23]]+Таблица1[[#This Row],[Столбец24]]","v":167.9312799697876},{"$f":"Таблица1[[#This Row],[Столбец28]]+Таблица1[[#This Row],[Столбец29]]-Таблица1[[#This Row],[Столбец27]]","v":5.016877246475218},{"$f":"Таблица1[[#This Row],[резы]]*Таблица1[[#This Row],[шир.рез]]/1000*Таблица1[[#This Row],[коэф]]/2","v":0},{"$f":"SUMIFS($Y$61:$Y$115,$C$61:$C$115,Таблица1[[#This Row],[Дл]],$D$61:$D$115,\"=500\",$L$61:$L$115,Таблица1[[#This Row],[Толщ.копия]],$F$61:$F$115,Таблица1[[#This Row],[АСТРА]])","v":4.9420772695541366},{"$f":"SUMIFS($Y$61:$Y$115,$C$61:$C$115,\"<\"&Таблица1[[#This Row],[Дл]],$D$61:$D$115,\"=500\",$L$61:$L$115,Таблица1[[#This Row],[Толщ.копия]],$F$61:$F$115,Таблица1[[#This Row],[АСТРА]])","v":7.4799976921081646E-2},5,{"$f":"IF(Таблица1[[#This Row],[профиль]]=Таблица1[[#This Row],[толщ]],CONCATENATE(Таблица1[[#This Row],[Столбец33]],\" \",Таблица1[[#This Row],[толщ]]),CONCATENATE(Таблица1[[#This Row],[Столбец33]],\" \",Таблица1[[#This Row],[профиль]],\"х\",Таблица1[[#This Row],[толщ]]))","v":"Труба 30х20х1,2"},{"$f":"CONCATENATE(Таблица1[[#This Row],[Столбец33]],\" \",Таблица1[[#This Row],[профиль]])","v":"Труба 30х20"},"Труба 30х20, 1.2 мм, тр3020","Труба",{"$f":"IF(Таблица1[[#This Row],[профиль]]=Таблица1[[#This Row],[толщ]],Таблица1[[#This Row],[толщ]],CONCATENATE(Таблица1[[#This Row],[профиль]],\"х\",Таблица1[[#This Row],[точка]]))","v":"30х20х1.2"},"30х20",1.2,{"$f":"SUBSTITUTE(Таблица1[[#This Row],[толщ]],\",\",\".\")","v":"1.2"},1.76]
[{"$f":"IF(Таблица1[[#This Row],[Столбец19]]=0,\"z\",\"\")","v":"z"},null,null,6000,null,{"$f":"SUMIFS($G$61:$G$115,$D$61:$D$115,500,$C$61:$C$115,Таблица1[[#This Row],[Дл]],$L$61:$L$115,Таблица1[[#This Row],[Толщ.копия]],$F$61:$F$115,Таблица1[[#This Row],[АСТРА]])","v":0},{"$f":"Таблица1[[#This Row],[толщ]]","v":2},{"$f":"Таблица1[[#This Row],[ГОСТ]]","v":"Труба 30х30х2"},{"$f":"SUMIFS($N$61:$N$115,$C$61:$C$115,Таблица1[[#This Row],[Дл]],$D$61:$D$115,\"=500\",$L$61:$L$115,Таблица1[[#This Row],[Толщ.копия]],$F$61:$F$115,Таблица1[[#This Row],[АСТРА]])","v":0},{"$f":"SUMIFS($N$61:$N$115,$C$61:$C$115,\"<\"&Таблица1[[#This Row],[Дл]],$D$61:$D$115,\"=500\",$L$61:$L$115,Таблица1[[#This Row],[Толщ.копия]],$F$61:$F$115,Таблица1[[#This Row],[АСТРА]])","v":0},null,null,{"$f":"SUMIFS($J$8:$J$57,$K$8:$K$57,Таблица1[[#This Row],[Столбец5]])","v":0},{"$f":"Таблица1[[#This Row],[Столбец8]]+Таблица1[[#This Row],[Столбец9]]","v":0},{"$f":"SUMIFS($Q$61:$Q$115,$C$61:$C$115,Таблица1[[#This Row],[Дл]],$D$61:$D$115,\"=500\",$L$61:$L$115,Таблица1[[#This Row],[Толщ.копия]],$F$61:$F$115,Таблица1[[#This Row],[АСТРА]])","v":0},{"$f":"SUMIFS($Q$61:$Q$115,$C$61:$C$115,\"<\"&Таблица1[[#This Row],[Дл]],$D$61:$D$115,\"=500\",$L$61:$L$115,Таблица1[[#This Row],[Толщ.копия]],$F$61:$F$115,Таблица1[[#This Row],[АСТРА]])","v":0},{"$f":"Таблица1[[#This Row],[Столбец13]]+Таблица1[[#This Row],[Столбец14]]","v":0},{"$f":"Таблица1[[#This Row],[Столбец28]]+Таблица1[[#This Row],[Столбец29]]-Таблица1[[#This Row],[Столбец27]]","v":0},{"$f":"SUMIFS($T$61:$T$115,$C$61:$C$115,Таблица1[[#This Row],[Дл]],$D$61:$D$115,\"=500\",$L$61:$L$115,Таблица1[[#This Row],[Толщ.копия]],$F$61:$F$115,Таблица1[[#This Row],[АСТРА]])","v":0},{"$f":"SUMIFS($T$61:$T$115,$C$61:$C$115,\"<\"&Таблица1[[#This Row],[Дл]],$D$61:$D$115,\"=500\",$L$61:$L$115,Таблица1[[#This Row],[Толщ.копия]],$F$61:$F$115,Таблица1[[#This Row],[АСТРА]])","v":0},{"$f":"Таблица1[[#This Row],[Столбец17]]+Таблица1[[#This Row],[Столбец18]]","v":0},null,null,null,{"$f":"SUMIFS($X$61:$X$115,$C$61:$C$115,Таблица1[[#This Row],[Дл]],$D$61:$D$115,\"=500\",$L$61:$L$115,Таблица1[[#This Row],[Толщ.копия]],$F$61:$F$115,Таблица1[[#This Row],[АСТРА]])","v":0},{"$f":"SUMIFS($X$61:$X$115,$C$61:$C$115,\"<\"&Таблица1[[#This Row],[Дл]],$D$61:$D$115,\"=500\",$L$61:$L$115,Таблица1[[#This Row],[Толщ.копия]],$F$61:$F$115,Таблица1[[#This Row],[АСТРА]])","v":0},{"$f":"Таблица1[[#This Row],[Столбец23]]+Таблица1[[#This Row],[Столбец24]]","v":0},{"$f":"Таблица1[[#This Row],[Столбец28]]+Таблица1[[#This Row],[Столбец29]]-Таблица1[[#This Row],[Столбец27]]","v":0},{"$f":"Таблица1[[#This Row],[резы]]*Таблица1[[#This Row],[шир.рез]]/1000*Таблица1[[#This Row],[коэф]]/2","v":0},{"$f":"SUMIFS($Y$61:$Y$115,$C$61:$C$115,Таблица1[[#This Row],[Дл]],$D$61:$D$115,\"=500\",$L$61:$L$115,Таблица1[[#This Row],[Толщ.копия]],$F$61:$F$115,Таблица1[[#This Row],[АСТРА]])","v":0},{"$f":"SUMIFS($Y$61:$Y$115,$C$61:$C$115,\"<\"&Таблица1[[#This Row],[Дл]],$D$61:$D$115,\"=500\",$L$61:$L$115,Таблица1[[#This Row],[Толщ.копия]],$F$61:$F$115,Таблица1[[#This Row],[АСТРА]])","v":0},5,{"$f":"IF(Таблица1[[#This Row],[профиль]]=Таблица1[[#This Row],[толщ]],CONCATENATE(Таблица1[[#This Row],[Столбец33]],\" \",Таблица1[[#This Row],[толщ]]),CONCATENATE(Таблица1[[#This Row],[Столбец33]],\" \",Таблица1[[#This Row],[профиль]],\"х\",Таблица1[[#This Row],[толщ]]))","v":"Труба 30х30х2"},{"$f":"CONCATENATE(Таблица1[[#This Row],[Столбец33]],\" \",Таблица1[[#This Row],[профиль]])","v":"Труба 30х30"},"Труба 30х30, 2.0 мм, тр3030","Труба",{"$f":"IF(Таблица1[[#This Row],[профиль]]=Таблица1[[#This Row],[толщ]],Таблица1[[#This Row],[толщ]],CONCATENATE(Таблица1[[#This Row],[профиль]],\"х\",Таблица1[[#This Row],[точка]]))","v":"30х30х2"},"30х30",2,{"$f":"SUBSTITUTE(Таблица1[[#This Row],[толщ]],\",\",\".\")","v":"2"},3.4]
[{"$f":"IF(Таблица1[[#This Row],[Столбец19]]=0,\"z\",\"\")","v":"z"},7,null,6000,null,{"$f":"SUMIFS($G$61:$G$115,$D$61:$D$115,500,$C$61:$C$115,Таблица1[[#This Row],[Дл]],$L$61:$L$115,Таблица1[[#This Row],[Толщ.копия]],$F$61:$F$115,Таблица1[[#This Row],[АСТРА]])","v":0},{"$f":"Таблица1[[#This Row],[толщ]]","v":2},{"$f":"Таблица1[[#This Row],[ГОСТ]]","v":"Труба 30х80х2"},{"$f":"SUMIFS($N$61:$N$115,$C$61:$C$115,Таблица1[[#This Row],[Дл]],$D$61:$D$115,\"=500\",$L$61:$L$115,Таблица1[[#This Row],[Толщ.копия]],$F$61:$F$115,Таблица1[[#This Row],[АСТРА]])","v":0},{"$f":"SUMIFS($N$61:$N$115,$C$61:$C$115,\"<\"&Таблица1[[#This Row],[Дл]],$D$61:$D$115,\"=500\",$L$61:$L$115,Таблица1[[#This Row],[Толщ.копия]],$F$61:$F$115,Таблица1[[#This Row],[АСТРА]])","v":0},null,null,{"$f":"SUMIFS($J$8:$J$57,$K$8:$K$57,Таблица1[[#This Row],[Столбец5]])","v":0},{"$f":"Таблица1[[#This Row],[Столбец8]]+Таблица1[[#This Row],[Столбец9]]","v":0},{"$f":"SUMIFS($Q$61:$Q$115,$C$61:$C$115,Таблица1[[#This Row],[Дл]],$D$61:$D$115,\"=500\",$L$61:$L$115,Таблица1[[#This Row],[Толщ.копия]],$F$61:$F$115,Таблица1[[#This Row],[АСТРА]])","v":0},{"$f":"SUMIFS($Q$61:$Q$115,$C$61:$C$115,\"<\"&Таблица1[[#This Row],[Дл]],$D$61:$D$115,\"=500\",$L$61:$L$115,Таблица1[[#This Row],[Толщ.копия]],$F$61:$F$115,Таблица1[[#This Row],[АСТРА]])","v":0},{"$f":"Таблица1[[#This Row],[Столбец13]]+Таблица1[[#This Row],[Столбец14]]","v":0},{"$f":"Таблица1[[#This Row],[Столбец28]]+Таблица1[[#This Row],[Столбец29]]-Таблица1[[#This Row],[Столбец27]]","v":0},{"$f":"SUMIFS($T$61:$T$115,$C$61:$C$115,Таблица1[[#This Row],[Дл]],$D$61:$D$115,\"=500\",$L$61:$L$115,Таблица1[[#This Row],[Толщ.копия]],$F$61:$F$115,Таблица1[[#This Row],[АСТРА]])","v":0},{"$f":"SUMIFS($T$61:$T$115,$C$61:$C$115,\"<\"&Таблица1[[#This Row],[Дл]],$D$61:$D$115,\"=500\",$L$61:$L$115,Таблица1[[#This Row],[Толщ.копия]],$F$61:$F$115,Таблица1[[#This Row],[АСТРА]])","v":0},{"$f":"Таблица1[[#This Row],[Столбец17]]+Таблица1[[#This Row],[Столбец18]]","v":0},null,null,null,{"$f":"SUMIFS($X$61:$X$115,$C$61:$C$115,Таблица1[[#This Row],[Дл]],$D$61:$D$115,\"=500\",$L$61:$L$115,Таблица1[[#This Row],[Толщ.копия]],$F$61:$F$115,Таблица1[[#This Row],[АСТРА]])","v":0},{"$f":"SUMIFS($X$61:$X$115,$C$61:$C$115,\"<\"&Таблица1[[#This Row],[Дл]],$D$61:$D$115,\"=500\",$L$61:$L$115,Таблица1[[#This Row],[Толщ.копия]],$F$61:$F$115,Таблица1[[#This Row],[АСТРА]])","v":0},{"$f":"Таблица1[[#This Row],[Столбец23]]+Таблица1[[#This Row],[Столбец24]]","v":0},{"$f":"Таблица1[[#This Row],[Столбец28]]+Таблица1[[#This Row],[Столбец29]]-Таблица1[[#This Row],[Столбец27]]","v":0},{"$f":"Таблица1[[#This Row],[резы]]*Таблица1[[#This Row],[шир.рез]]/1000*Таблица1[[#This Row],[коэф]]/2","v":0},{"$f":"SUMIFS($Y$61:$Y$115,$C$61:$C$115,Таблица1[[#This Row],[Дл]],$D$61:$D$115,\"=500\",$L$61:$L$115,Таблица1[[#This Row],[Толщ.копия]],$F$61:$F$115,Таблица1[[#This Row],[АСТРА]])","v":0},{"$f":"SUMIFS($Y$61:$Y$115,$C$61:$C$115,\"<\"&Таблица1[[#This Row],[Дл]],$D$61:$D$115,\"=500\",$L$61:$L$115,Таблица1[[#This Row],[Толщ.копия]],$F$61:$F$115,Таблица1[[#This Row],[АСТРА]])","v":0},5,{"$f":"IF(Таблица1[[#This Row],[профиль]]=Таблица1[[#This Row],[толщ]],CONCATENATE(Таблица1[[#This Row],[Столбец33]],\" \",Таблица1[[#This Row],[толщ]]),CONCATENATE(Таблица1[[#This Row],[Столбец33]],\" \",Таблица1[[#This Row],[профиль]],\"х\",Таблица1[[#This Row],[толщ]]))","v":"Труба 30х80х2"},{"$f":"CONCATENATE(Таблица1[[#This Row],[Столбец33]],\" \",Таблица1[[#This Row],[профиль]])","v":"Труба 30х80"},"Труба 30х80, 2.0 мм, тр3080","Труба",{"$f":"IF(Таблица1[[#This Row],[профиль]]=Таблица1[[#This Row],[толщ]],Таблица1[[#This Row],[толщ]],CONCATENATE(Таблица1[[#This Row],[профиль]],\"х\",Таблица1[[#This Row],[точка]]))","v":"30х80х2"},"30х80",2,{"$f":"SUBSTITUTE(Таблица1[[#This Row],[толщ]],\",\",\".\")","v":"2"},6.54]
[{"$f":"IF(Таблица1[[#This Row],[Столбец19]]=0,\"z\",\"\")","v":"z"},null,null,6000,null,{"$f":"SUMIFS($G$61:$G$115,$D$61:$D$115,500,$C$61:$C$115,Таблица1[[#This Row],[Дл]],$L$61:$L$115,Таблица1[[#This Row],[Толщ.копия]],$F$61:$F$115,Таблица1[[#This Row],[АСТРА]])","v":0},{"$f":"Таблица1[[#This Row],[толщ]]","v":3},{"$f":"Таблица1[[#This Row],[ГОСТ]]","v":"Труба 32.5х3"},{"$f":"SUMIFS($N$61:$N$115,$C$61:$C$115,Таблица1[[#This Row],[Дл]],$D$61:$D$115,\"=500\",$L$61:$L$115,Таблица1[[#This Row],[Толщ.копия]],$F$61:$F$115,Таблица1[[#This Row],[АСТРА]])","v":0},{"$f":"SUMIFS($N$61:$N$115,$C$61:$C$115,\"<\"&Таблица1[[#This Row],[Дл]],$D$61:$D$115,\"=500\",$L$61:$L$115,Таблица1[[#This Row],[Толщ.копия]],$F$61:$F$115,Таблица1[[#This Row],[АСТРА]])","v":0},null,null,{"$f":"SUMIFS($J$8:$J$57,$K$8:$K$57,Таблица1[[#This Row],[Столбец5]])","v":0},{"$f":"Таблица1[[#This Row],[Столбец8]]+Таблица1[[#This Row],[Столбец9]]","v":0},{"$f":"SUMIFS($Q$61:$Q$115,$C$61:$C$115,Таблица1[[#This Row],[Дл]],$D$61:$D$115,\"=500\",$L$61:$L$115,Таблица1[[#This Row],[Толщ.копия]],$F$61:$F$115,Таблица1[[#This Row],[АСТРА]])","v":0},{"$f":"SUMIFS($Q$61:$Q$115,$C$61:$C$115,\"<\"&Таблица1[[#This Row],[Дл]],$D$61:$D$115,\"=500\",$L$61:$L$115,Таблица1[[#This Row],[Толщ.копия]],$F$61:$F$115,Таблица1[[#This Row],[АСТРА]])","v":0},{"$f":"Таблица1[[#This Row],[Столбец13]]+Таблица1[[#This Row],[Столбец14]]","v":0},{"$f":"Таблица1[[#This Row],[Столбец28]]+Таблица1[[#This Row],[Столбец29]]-Таблица1[[#This Row],[Столбец27]]","v":0},{"$f":"SUMIFS($T$61:$T$115,$C$61:$C$115,Таблица1[[#This Row],[Дл]],$D$61:$D$115,\"=500\",$L$61:$L$115,Таблица1[[#This Row],[Толщ.копия]],$F$61:$F$115,Таблица1[[#This Row],[АСТРА]])","v":0},{"$f":"SUMIFS($T$61:$T$115,$C$61:$C$115,\"<\"&Таблица1[[#This Row],[Дл]],$D$61:$D$115,\"=500\",$L$61:$L$115,Таблица1[[#This Row],[Толщ.копия]],$F$61:$F$115,Таблица1[[#This Row],[АСТРА]])","v":0},{"$f":"Таблица1[[#This Row],[Столбец17]]+Таблица1[[#This Row],[Столбец18]]","v":0},null,null,null,{"$f":"SUMIFS($X$61:$X$115,$C$61:$C$115,Таблица1[[#This Row],[Дл]],$D$61:$D$115,\"=500\",$L$61:$L$115,Таблица1[[#This Row],[Толщ.копия]],$F$61:$F$115,Таблица1[[#This Row],[АСТРА]])","v":0},{"$f":"SUMIFS($X$61:$X$115,$C$61:$C$115,\"<\"&Таблица1[[#This Row],[Дл]],$D$61:$D$115,\"=500\",$L$61:$L$115,Таблица1[[#This Row],[Толщ.копия]],$F$61:$F$115,Таблица1[[#This Row],[АСТРА]])","v":0},{"$f":"Таблица1[[#This Row],[Столбец23]]+Таблица1[[#This Row],[Столбец24]]","v":0},{"$f":"Таблица1[[#This Row],[Столбец28]]+Таблица1[[#This Row],[Столбец29]]-Таблица1[[#This Row],[Столбец27]]","v":0},{"$f":"Таблица1[[#This Row],[резы]]*Таблица1[[#This Row],[шир.рез]]/1000*Таблица1[[#This Row],[коэф]]/2","v":0},{"$f":"SUMIFS($Y$61:$Y$115,$C$61:$C$115,Таблица1[[#This Row],[Дл]],$D$61:$D$115,\"=500\",$L$61:$L$115,Таблица1[[#This Row],[Толщ.копия]],$F$61:$F$115,Таблица1[[#This Row],[АСТРА]])","v":0},{"$f":"SUMIFS($Y$61:$Y$115,$C$61:$C$115,\"<\"&Таблица1[[#This Row],[Дл]],$D$61:$D$115,\"=500\",$L$61:$L$115,Таблица1[[#This Row],[Толщ.копия]],$F$61:$F$115,Таблица1[[#This Row],[АСТРА]])","v":0},5,{"$f":"IF(Таблица1[[#This Row],[профиль]]=Таблица1[[#This Row],[толщ]],CONCATENATE(Таблица1[[#This Row],[Столбец33]],\" \",Таблица1[[#This Row],[толщ]]),CONCATENATE(Таблица1[[#This Row],[Столбец33]],\" \",Таблица1[[#This Row],[профиль]],\"х\",Таблица1[[#This Row],[толщ]]))","v":"Труба 32.5х3"},{"$f":"CONCATENATE(Таблица1[[#This Row],[Столбец33]],\" \",Таблица1[[#This Row],[профиль]])","v":"Труба 32.5"},"Труба 32.5, 3.0 мм, тр32.5","Труба",{"$f":"IF(Таблица1[[#This Row],[профиль]]=Таблица1[[#This Row],[толщ]],Таблица1[[#This Row],[толщ]],CONCATENATE(Таблица1[[#This Row],[профиль]],\"х\",Таблица1[[#This Row],[точка]]))","v":"32.5х3"},"32.5",3,{"$f":"SUBSTITUTE(Таблица1[[#This Row],[толщ]],\",\",\".\")","v":"3"},4.3159999999999998]
[{"$f":"IF(Таблица1[[#This Row],[Столбец19]]=0,\"z\",\"\")","v":"z"},9,null,6000,null,{"$f":"SUMIFS($G$61:$G$115,$D$61:$D$115,500,$C$61:$C$115,Таблица1[[#This Row],[Дл]],$L$61:$L$115,Таблица1[[#This Row],[Толщ.копия]],$F$61:$F$115,Таблица1[[#This Row],[АСТРА]])","v":0},{"$f":"Таблица1[[#This Row],[толщ]]","v":1},{"$f":"Таблица1[[#This Row],[ГОСТ]]","v":"Труба 40х20х1"},{"$f":"SUMIFS($N$61:$N$115,$C$61:$C$115,Таблица1[[#This Row],[Дл]],$D$61:$D$115,\"=500\",$L$61:$L$115,Таблица1[[#This Row],[Толщ.копия]],$F$61:$F$115,Таблица1[[#This Row],[АСТРА]])","v":0},{"$f":"SUMIFS($N$61:$N$115,$C$61:$C$115,\"<\"&Таблица1[[#This Row],[Дл]],$D$61:$D$115,\"=500\",$L$61:$L$115,Таблица1[[#This Row],[Толщ.копия]],$F$61:$F$115,Таблица1[[#This Row],[АСТРА]])","v":0},null,null,{"$f":"SUMIFS($J$8:$J$57,$K$8:$K$57,Таблица1[[#This Row],[Столбец5]])","v":0},{"$f":"Таблица1[[#This Row],[Столбец8]]+Таблица1[[#This Row],[Столбец9]]","v":0},{"$f":"SUMIFS($Q$61:$Q$115,$C$61:$C$115,Таблица1[[#This Row],[Дл]],$D$61:$D$115,\"=500\",$L$61:$L$115,Таблица1[[#This Row],[Толщ.копия]],$F$61:$F$115,Таблица1[[#This Row],[АСТРА]])","v":0},{"$f":"SUMIFS($Q$61:$Q$115,$C$61:$C$115,\"<\"&Таблица1[[#This Row],[Дл]],$D$61:$D$115,\"=500\",$L$61:$L$115,Таблица1[[#This Row],[Толщ.копия]],$F$61:$F$115,Таблица1[[#This Row],[АСТРА]])","v":0},{"$f":"Таблица1[[#This Row],[Столбец13]]+Таблица1[[#This Row],[Столбец14]]","v":0},{"$f":"Таблица1[[#This Row],[Столбец28]]+Таблица1[[#This Row],[Столбец29]]-Таблица1[[#This Row],[Столбец27]]","v":0},{"$f":"SUMIFS($T$61:$T$115,$C$61:$C$115,Таблица1[[#This Row],[Дл]],$D$61:$D$115,\"=500\",$L$61:$L$115,Таблица1[[#This Row],[Толщ.копия]],$F$61:$F$115,Таблица1[[#This Row],[АСТРА]])","v":0},{"$f":"SUMIFS($T$61:$T$115,$C$61:$C$115,\"<\"&Таблица1[[#This Row],[Дл]],$D$61:$D$115,\"=500\",$L$61:$L$115,Таблица1[[#This Row],[Толщ.копия]],$F$61:$F$115,Таблица1[[#This Row],[АСТРА]])","v":0},{"$f":"Таблица1[[#This Row],[Столбец17]]+Таблица1[[#This Row],[Столбец18]]","v":0},null,null,null,{"$f":"SUMIFS($X$61:$X$115,$C$61:$C$115,Таблица1[[#This Row],[Дл]],$D$61:$D$115,\"=500\",$L$61:$L$115,Таблица1[[#This Row],[Толщ.копия]],$F$61:$F$115,Таблица1[[#This Row],[АСТРА]])","v":0},{"$f":"SUMIFS($X$61:$X$115,$C$61:$C$115,\"<\"&Таблица1[[#This Row],[Дл]],$D$61:$D$115,\"=500\",$L$61:$L$115,Таблица1[[#This Row],[Толщ.копия]],$F$61:$F$115,Таблица1[[#This Row],[АСТРА]])","v":0},{"$f":"Таблица1[[#This Row],[Столбец23]]+Таблица1[[#This Row],[Столбец24]]","v":0},{"$f":"Таблица1[[#This Row],[Столбец28]]+Таблица1[[#This Row],[Столбец29]]-Таблица1[[#This Row],[Столбец27]]","v":0},{"$f":"Таблица1[[#This Row],[резы]]*Таблица1[[#This Row],[шир.рез]]/1000*Таблица1[[#This Row],[коэф]]/2","v":0},{"$f":"SUMIFS($Y$61:$Y$115,$C$61:$C$115,Таблица1[[#This Row],[Дл]],$D$61:$D$115,\"=500\",$L$61:$L$115,Таблица1[[#This Row],[Толщ.копия]],$F$61:$F$115,Таблица1[[#This Row],[АСТРА]])","v":0},{"$f":"SUMIFS($Y$61:$Y$115,$C$61:$C$115,\"<\"&Таблица1[[#This Row],[Дл]],$D$61:$D$115,\"=500\",$L$61:$L$115,Таблица1[[#This Row],[Толщ.копия]],$F$61:$F$115,Таблица1[[#This Row],[АСТРА]])","v":0},5,{"$f":"IF(Таблица1[[#This Row],[профиль]]=Таблица1[[#This Row],[толщ]],CONCATENATE(Таблица1[[#This Row],[Столбец33]],\" \",Таблица1[[#This Row],[толщ]]),CONCATENATE(Таблица1[[#This Row],[Столбец33]],\" \",Таблица1[[#This Row],[профиль]],\"х\",Таблица1[[#This Row],[толщ]]))","v":"Труба 40х20х1"},{"$f":"CONCATENATE(Таблица1[[#This Row],[Столбец33]],\" \",Таблица1[[#This Row],[профиль]])","v":"Труба 40х20"},"Труба 40х20, 1.0 мм, тр4020","Труба",{"$f":"IF(Таблица1[[#This Row],[профиль]]=Таблица1[[#This Row],[толщ]],Таблица1[[#This Row],[толщ]],CONCATENATE(Таблица1[[#This Row],[профиль]],\"х\",Таблица1[[#This Row],[точка]]))","v":"40х20х1"},"40х20",1,{"$f":"SUBSTITUTE(Таблица1[[#This Row],[толщ]],\",\",\".\")","v":"1"},1.8839999999999999]
[{"$f":"IF(Таблица1[[#This Row],[Столбец19]]=0,\"z\",\"\")","v":"z"},5,null,6000,null,{"$f":"SUMIFS($G$61:$G$115,$D$61:$D$115,500,$C$61:$C$115,Таблица1[[#This Row],[Дл]],$L$61:$L$115,Таблица1[[#This Row],[Толщ.копия]],$F$61:$F$115,Таблица1[[#This Row],[АСТРА]])","v":0},{"$f":"Таблица1[[#This Row],[толщ]]","v":1.2},{"$f":"Таблица1[[#This Row],[ГОСТ]]","v":"Труба 40х20х1,2"},{"$f":"SUMIFS($N$61:$N$115,$C$61:$C$115,Таблица1[[#This Row],[Дл]],$D$61:$D$115,\"=500\",$L$61:$L$115,Таблица1[[#This Row],[Толщ.копия]],$F$61:$F$115,Таблица1[[#This Row],[АСТРА]])","v":0},{"$f":"SUMIFS($N$61:$N$115,$C$61:$C$115,\"<\"&Таблица1[[#This Row],[Дл]],$D$61:$D$115,\"=500\",$L$61:$L$115,Таблица1[[#This Row],[Толщ.копия]],$F$61:$F$115,Таблица1[[#This Row],[АСТРА]])","v":0},null,null,{"$f":"SUMIFS($J$8:$J$57,$K$8:$K$57,Таблица1[[#This Row],[Столбец5]])","v":0},{"$f":"Таблица1[[#This Row],[Столбец8]]+Таблица1[[#This Row],[Столбец9]]","v":0},{"$f":"SUMIFS($Q$61:$Q$115,$C$61:$C$115,Таблица1[[#This Row],[Дл]],$D$61:$D$115,\"=500\",$L$61:$L$115,Таблица1[[#This Row],[Толщ.копия]],$F$61:$F$115,Таблица1[[#This Row],[АСТРА]])","v":0},{"$f":"SUMIFS($Q$61:$Q$115,$C$61:$C$115,\"<\"&Таблица1[[#This Row],[Дл]],$D$61:$D$115,\"=500\",$L$61:$L$115,Таблица1[[#This Row],[Толщ.копия]],$F$61:$F$115,Таблица1[[#This Row],[АСТРА]])","v":0},{"$f":"Таблица1[[#This Row],[Столбец13]]+Таблица1[[#This Row],[Столбец14]]","v":0},{"$f":"Таблица1[[#This Row],[Столбец28]]+Таблица1[[#This Row],[Столбец29]]-Таблица1[[#This Row],[Столбец27]]","v":0},{"$f":"SUMIFS($T$61:$T$115,$C$61:$C$115,Таблица1[[#This Row],[Дл]],$D$61:$D$115,\"=500\",$L$61:$L$115,Таблица1[[#This Row],[Толщ.копия]],$F$61:$F$115,Таблица1[[#This Row],[АСТРА]])","v":0},{"$f":"SUMIFS($T$61:$T$115,$C$61:$C$115,\"<\"&Таблица1[[#This Row],[Дл]],$D$61:$D$115,\"=500\",$L$61:$L$115,Таблица1[[#This Row],[Толщ.копия]],$F$61:$F$115,Таблица1[[#This Row],[АСТРА]])","v":0},{"$f":"Таблица1[[#This Row],[Столбец17]]+Таблица1[[#This Row],[Столбец18]]","v":0},null,null,null,{"$f":"SUMIFS($X$61:$X$115,$C$61:$C$115,Таблица1[[#This Row],[Дл]],$D$61:$D$115,\"=500\",$L$61:$L$115,Таблица1[[#This Row],[Толщ.копия]],$F$61:$F$115,Таблица1[[#This Row],[АСТРА]])","v":0},{"$f":"SUMIFS($X$61:$X$115,$C$61:$C$115,\"<\"&Таблица1[[#This Row],[Дл]],$D$61:$D$115,\"=500\",$L$61:$L$115,Таблица1[[#This Row],[Толщ.копия]],$F$61:$F$115,Таблица1[[#This Row],[АСТРА]])","v":0},{"$f":"Таблица1[[#This Row],[Столбец23]]+Таблица1[[#This Row],[Столбец24]]","v":0},{"$f":"Таблица1[[#This Row],[Столбец28]]+Таблица1[[#This Row],[Столбец29]]-Таблица1[[#This Row],[Столбец27]]","v":0},{"$f":"Таблица1[[#This Row],[резы]]*Таблица1[[#This Row],[шир.рез]]/1000*Таблица1[[#This Row],[коэф]]/2","v":0},{"$f":"SUMIFS($Y$61:$Y$115,$C$61:$C$115,Таблица1[[#This Row],[Дл]],$D$61:$D$115,\"=500\",$L$61:$L$115,Таблица1[[#This Row],[Толщ.копия]],$F$61:$F$115,Таблица1[[#This Row],[АСТРА]])","v":0},{"$f":"SUMIFS($Y$61:$Y$115,$C$61:$C$115,\"<\"&Таблица1[[#This Row],[Дл]],$D$61:$D$115,\"=500\",$L$61:$L$115,Таблица1[[#This Row],[Толщ.копия]],$F$61:$F$115,Таблица1[[#This Row],[АСТРА]])","v":0},5,{"$f":"IF(Таблица1[[#This Row],[профиль]]=Таблица1[[#This Row],[толщ]],CONCATENATE(Таблица1[[#This Row],[Столбец33]],\" \",Таблица1[[#This Row],[толщ]]),CONCATENATE(Таблица1[[#This Row],[Столбец33]],\" \",Таблица1[[#This Row],[профиль]],\"х\",Таблица1[[#This Row],[толщ]]))","v":"Труба 40х20х1,2"},{"$f":"CONCATENATE(Таблица1[[#This Row],[Столбец33]],\" \",Таблица1[[#This Row],[профиль]])","v":"Труба 40х20"},"Труба 40х20, 1.2 мм, тр4020","Труба",{"$f":"IF(Таблица1[[#This Row],[профиль]]=Таблица1[[#This Row],[толщ]],Таблица1[[#This Row],[толщ]],CONCATENATE(Таблица1[[#This Row],[профиль]],\"х\",Таблица1[[#This Row],[точка]]))","v":"40х20х1.2"},"40х20",1.2,{"$f":"SUBSTITUTE(Таблица1[[#This Row],[толщ]],\",\",\".\")","v":"1.2"},2.14]
[{"$f":"IF(Таблица1[[#This Row],[Столбец19]]=0,\"z\",\"\")","v":"z"},null,null,6000,null,{"$f":"SUMIFS($G$61:$G$115,$D$61:$D$115,500,$C$61:$C$115,Таблица1[[#This Row],[Дл]],$L$61:$L$115,Таблица1[[#This Row],[Толщ.копия]],$F$61:$F$115,Таблица1[[#This Row],[АСТРА]])","v":0},{"$f":"Таблица1[[#This Row],[толщ]]","v":2},{"$f":"Таблица1[[#This Row],[ГОСТ]]","v":"Труба 60х30х2"},{"$f":"SUMIFS($N$61:$N$115,$C$61:$C$115,Таблица1[[#This Row],[Дл]],$D$61:$D$115,\"=500\",$L$61:$L$115,Таблица1[[#This Row],[Толщ.копия]],$F$61:$F$115,Таблица1[[#This Row],[АСТРА]])","v":0},{"$f":"SUMIFS($N$61:$N$115,$C$61:$C$115,\"<\"&Таблица1[[#This Row],[Дл]],$D$61:$D$115,\"=500\",$L$61:$L$115,Таблица1[[#This Row],[Толщ.копия]],$F$61:$F$115,Таблица1[[#This Row],[АСТРА]])","v":0},null,null,{"$f":"SUMIFS($J$8:$J$57,$K$8:$K$57,Таблица1[[#This Row],[Столбец5]])","v":0},{"$f":"Таблица1[[#This Row],[Столбец8]]+Таблица1[[#This Row],[Столбец9]]","v":0},{"$f":"SUMIFS($Q$61:$Q$115,$C$61:$C$115,Таблица1[[#This Row],[Дл]],$D$61:$D$115,\"=500\",$L$61:$L$115,Таблица1[[#This Row],[Толщ.копия]],$F$61:$F$115,Таблица1[[#This Row],[АСТРА]])","v":0},{"$f":"SUMIFS($Q$61:$Q$115,$C$61:$C$115,\"<\"&Таблица1[[#This Row],[Дл]],$D$61:$D$115,\"=500\",$L$61:$L$115,Таблица1[[#This Row],[Толщ.копия]],$F$61:$F$115,Таблица1[[#This Row],[АСТРА]])","v":0},{"$f":"Таблица1[[#This Row],[Столбец13]]+Таблица1[[#This Row],[Столбец14]]","v":0},{"$f":"Таблица1[[#This Row],[Столбец28]]+Таблица1[[#This Row],[Столбец29]]-Таблица1[[#This Row],[Столбец27]]","v":0},{"$f":"SUMIFS($T$61:$T$115,$C$61:$C$115,Таблица1[[#This Row],[Дл]],$D$61:$D$115,\"=500\",$L$61:$L$115,Таблица1[[#This Row],[Толщ.копия]],$F$61:$F$115,Таблица1[[#This Row],[АСТРА]])","v":0},{"$f":"SUMIFS($T$61:$T$115,$C$61:$C$115,\"<\"&Таблица1[[#This Row],[Дл]],$D$61:$D$115,\"=500\",$L$61:$L$115,Таблица1[[#This Row],[Толщ.копия]],$F$61:$F$115,Таблица1[[#This Row],[АСТРА]])","v":0},{"$f":"Таблица1[[#This Row],[Столбец17]]+Таблица1[[#This Row],[Столбец18]]","v":0},null,null,null,{"$f":"SUMIFS($X$61:$X$115,$C$61:$C$115,Таблица1[[#This Row],[Дл]],$D$61:$D$115,\"=500\",$L$61:$L$115,Таблица1[[#This Row],[Толщ.копия]],$F$61:$F$115,Таблица1[[#This Row],[АСТРА]])","v":0},{"$f":"SUMIFS($X$61:$X$115,$C$61:$C$115,\"<\"&Таблица1[[#This Row],[Дл]],$D$61:$D$115,\"=500\",$L$61:$L$115,Таблица1[[#This Row],[Толщ.копия]],$F$61:$F$115,Таблица1[[#This Row],[АСТРА]])","v":0},{"$f":"Таблица1[[#This Row],[Столбец23]]+Таблица1[[#This Row],[Столбец24]]","v":0},{"$f":"Таблица1[[#This Row],[Столбец28]]+Таблица1[[#This Row],[Столбец29]]-Таблица1[[#This Row],[Столбец27]]","v":0},{"$f":"Таблица1[[#This Row],[резы]]*Таблица1[[#This Row],[шир.рез]]/1000*Таблица1[[#This Row],[коэф]]/2","v":0},{"$f":"SUMIFS($Y$61:$Y$115,$C$61:$C$115,Таблица1[[#This Row],[Дл]],$D$61:$D$115,\"=500\",$L$61:$L$115,Таблица1[[#This Row],[Толщ.копия]],$F$61:$F$115,Таблица1[[#This Row],[АСТРА]])","v":0},{"$f":"SUMIFS($Y$61:$Y$115,$C$61:$C$115,\"<\"&Таблица1[[#This Row],[Дл]],$D$61:$D$115,\"=500\",$L$61:$L$115,Таблица1[[#This Row],[Толщ.копия]],$F$61:$F$115,Таблица1[[#This Row],[АСТРА]])","v":0},5,{"$f":"IF(Таблица1[[#This Row],[профиль]]=Таблица1[[#This Row],[толщ]],CONCATENATE(Таблица1[[#This Row],[Столбец33]],\" \",Таблица1[[#This Row],[толщ]]),CONCATENATE(Таблица1[[#This Row],[Столбец33]],\" \",Таблица1[[#This Row],[профиль]],\"х\",Таблица1[[#This Row],[толщ]]))","v":"Труба 60х30х2"},{"$f":"CONCATENATE(Таблица1[[#This Row],[Столбец33]],\" \",Таблица1[[#This Row],[профиль]])","v":"Труба 60х30"},"Труба 60х30, 2.0 мм, тр6030","Труба",{"$f":"IF(Таблица1[[#This Row],[профиль]]=Таблица1[[#This Row],[толщ]],Таблица1[[#This Row],[толщ]],CONCATENATE(Таблица1[[#This Row],[профиль]],\"х\",Таблица1[[#This Row],[точка]]))","v":"60х30х2"},"60х30",2,{"$f":"SUBSTITUTE(Таблица1[[#This Row],[толщ]],\",\",\".\")","v":"2"},5.3]
[{"$f":"IF(Таблица1[[#This Row],[Столбец19]]=0,\"z\",\"\")","v":"z"},null,null,6000,null,{"$f":"SUMIFS($G$61:$G$115,$D$61:$D$115,500,$C$61:$C$115,Таблица1[[#This Row],[Дл]],$L$61:$L$115,Таблица1[[#This Row],[Толщ.копия]],$F$61:$F$115,Таблица1[[#This Row],[АСТРА]])","v":0},{"$f":"Таблица1[[#This Row],[толщ]]","v":1.2},{"$f":"Таблица1[[#This Row],[ГОСТ]]","v":"Труба пл.ов. 30х15х1,2"},{"$f":"SUMIFS($N$61:$N$115,$C$61:$C$115,Таблица1[[#This Row],[Дл]],$D$61:$D$115,\"=500\",$L$61:$L$115,Таблица1[[#This Row],[Толщ.копия]],$F$61:$F$115,Таблица1[[#This Row],[АСТРА]])","v":0},{"$f":"SUMIFS($N$61:$N$115,$C$61:$C$115,\"<\"&Таблица1[[#This Row],[Дл]],$D$61:$D$115,\"=500\",$L$61:$L$115,Таблица1[[#This Row],[Толщ.копия]],$F$61:$F$115,Таблица1[[#This Row],[АСТРА]])","v":0},null,null,{"$f":"SUMIFS($J$8:$J$57,$K$8:$K$57,Таблица1[[#This Row],[Столбец5]])","v":880},{"$f":"Таблица1[[#This Row],[Столбец8]]+Таблица1[[#This Row],[Столбец9]]","v":0},{"$f":"SUMIFS($Q$61:$Q$115,$C$61:$C$115,Таблица1[[#This Row],[Дл]],$D$61:$D$115,\"=500\",$L$61:$L$115,Таблица1[[#This Row],[Толщ.копия]],$F$61:$F$115,Таблица1[[#This Row],[АСТРА]])","v":0},{"$f":"SUMIFS($Q$61:$Q$115,$C$61:$C$115,\"<\"&Таблица1[[#This Row],[Дл]],$D$61:$D$115,\"=500\",$L$61:$L$115,Таблица1[[#This Row],[Толщ.копия]],$F$61:$F$115,Таблица1[[#This Row],[АСТРА]])","v":0},{"$f":"Таблица1[[#This Row],[Столбец13]]+Таблица1[[#This Row],[Столбец14]]","v":0},{"$f":"Таблица1[[#This Row],[Столбец28]]+Таблица1[[#This Row],[Столбец29]]-Таблица1[[#This Row],[Столбец27]]","v":-3.08},{"$f":"SUMIFS($T$61:$T$115,$C$61:$C$115,Таблица1[[#This Row],[Дл]],$D$61:$D$115,\"=500\",$L$61:$L$115,Таблица1[[#This Row],[Толщ.копия]],$F$61:$F$115,Таблица1[[#This Row],[АСТРА]])","v":0},{"$f":"SUMIFS($T$61:$T$115,$C$61:$C$115,\"<\"&Таблица1[[#This Row],[Дл]],$D$61:$D$115,\"=500\",$L$61:$L$115,Таблица1[[#This Row],[Толщ.копия]],$F$61:$F$115,Таблица1[[#This Row],[АСТРА]])","v":0},{"$f":"Таблица1[[#This Row],[Столбец17]]+Таблица1[[#This Row],[Столбец18]]","v":0},null,null,null,{"$f":"SUMIFS($X$61:$X$115,$C$61:$C$115,Таблица1[[#This Row],[Дл]],$D$61:$D$115,\"=500\",$L$61:$L$115,Таблица1[[#This Row],[Толщ.копия]],$F$61:$F$115,Таблица1[[#This Row],[АСТРА]])","v":0},{"$f":"SUMIFS($X$61:$X$115,$C$61:$C$115,\"<\"&Таблица1[[#This Row],[Дл]],$D$61:$D$115,\"=500\",$L$61:$L$115,Таблица1[[#This Row],[Толщ.копия]],$F$61:$F$115,Таблица1[[#This Row],[АСТРА]])","v":0},{"$f":"Таблица1[[#This Row],[Столбец23]]+Таблица1[[#This Row],[Столбец24]]","v":0},{"$f":"Таблица1[[#This Row],[Столбец28]]+Таблица1[[#This Row],[Столбец29]]-Таблица1[[#This Row],[Столбец27]]","v":-3.08},{"$f":"Таблица1[[#This Row],[резы]]*Таблица1[[#This Row],[шир.рез]]/1000*Таблица1[[#This Row],[коэф]]/2","v":3.08},{"$f":"SUMIFS($Y$61:$Y$115,$C$61:$C$115,Таблица1[[#This Row],[Дл]],$D$61:$D$115,\"=500\",$L$61:$L$115,Таблица1[[#This Row],[Толщ.копия]],$F$61:$F$115,Таблица1[[#This Row],[АСТРА]])","v":0},{"$f":"SUMIFS($Y$61:$Y$115,$C$61:$C$115,\"<\"&Таблица1[[#This Row],[Дл]],$D$61:$D$115,\"=500\",$L$61:$L$115,Таблица1[[#This Row],[Толщ.копия]],$F$61:$F$115,Таблица1[[#This Row],[АСТРА]])","v":0},5,{"$f":"IF(Таблица1[[#This Row],[профиль]]=Таблица1[[#This Row],[толщ]],CONCATENATE(Таблица1[[#This Row],[Столбец33]],\" \",Таблица1[[#This Row],[толщ]]),CONCATENATE(Таблица1[[#This Row],[Столбец33]],\" \",Таблица1[[#This Row],[профиль]],\"х\",Таблица1[[#This Row],[толщ]]))","v":"Труба пл.ов. 30х15х1,2"},{"$f":"CONCATENATE(Таблица1[[#This Row],[Столбец33]],\" \",Таблица1[[#This Row],[профиль]])","v":"Труба пл.ов. 30х15"},"Труба плоскоовальная 30х15, 1.2 мм, трпл-ов3015","Труба пл.ов.",{"$f":"IF(Таблица1[[#This Row],[профиль]]=Таблица1[[#This Row],[толщ]],Таблица1[[#This Row],[толщ]],CONCATENATE(Таблица1[[#This Row],[профиль]],\"х\",Таблица1[[#This Row],[точка]]))","v":"30х15х1.2"},"30х15",1.2,{"$f":"SUBSTITUTE(Таблица1[[#This Row],[толщ]],\",\",\".\")","v":"1.2"},1.4]
[{"$f":"IF(Таблица1[[#This Row],[Столбец19]]=0,\"z\",\"\")","v":"z"},6,null,6000,null,{"$f":"SUMIFS($G$61:$G$115,$D$61:$D$115,500,$C$61:$C$115,Таблица1[[#This Row],[Дл]],$L$61:$L$115,Таблица1[[#This Row],[Толщ.копия]],$F$61:$F$115,Таблица1[[#This Row],[АСТРА]])","v":0},{"$f":"Таблица1[[#This Row],[толщ]]","v":1.5},{"$f":"Таблица1[[#This Row],[ГОСТ]]","v":"Труба пл.ов. 30х15х1,5"},{"$f":"SUMIFS($N$61:$N$115,$C$61:$C$115,Таблица1[[#This Row],[Дл]],$D$61:$D$115,\"=500\",$L$61:$L$115,Таблица1[[#This Row],[Толщ.копия]],$F$61:$F$115,Таблица1[[#This Row],[АСТРА]])","v":0},{"$f":"SUMIFS($N$61:$N$115,$C$61:$C$115,\"<\"&Таблица1[[#This Row],[Дл]],$D$61:$D$115,\"=500\",$L$61:$L$115,Таблица1[[#This Row],[Толщ.копия]],$F$61:$F$115,Таблица1[[#This Row],[АСТРА]])","v":0},null,null,{"$f":"SUMIFS($J$8:$J$57,$K$8:$K$57,Таблица1[[#This Row],[Столбец5]])","v":0},{"$f":"Таблица1[[#This Row],[Столбец8]]+Таблица1[[#This Row],[Столбец9]]","v":0},{"$f":"SUMIFS($Q$61:$Q$115,$C$61:$C$115,Таблица1[[#This Row],[Дл]],$D$61:$D$115,\"=500\",$L$61:$L$115,Таблица1[[#This Row],[Толщ.копия]],$F$61:$F$115,Таблица1[[#This Row],[АСТРА]])","v":0},{"$f":"SUMIFS($Q$61:$Q$115,$C$61:$C$115,\"<\"&Таблица1[[#This Row],[Дл]],$D$61:$D$115,\"=500\",$L$61:$L$115,Таблица1[[#This Row],[Толщ.копия]],$F$61:$F$115,Таблица1[[#This Row],[АСТРА]])","v":0},{"$f":"Таблица1[[#This Row],[Столбец13]]+Таблица1[[#This Row],[Столбец14]]","v":0},{"$f":"Таблица1[[#This Row],[Столбец28]]+Таблица1[[#This Row],[Столбец29]]-Таблица1[[#This Row],[Столбец27]]","v":0},{"$f":"SUMIFS($T$61:$T$115,$C$61:$C$115,Таблица1[[#This Row],[Дл]],$D$61:$D$115,\"=500\",$L$61:$L$115,Таблица1[[#This Row],[Толщ.копия]],$F$61:$F$115,Таблица1[[#This Row],[АСТРА]])","v":0},{"$f":"SUMIFS($T$61:$T$115,$C$61:$C$115,\"<\"&Таблица1[[#This Row],[Дл]],$D$61:$D$115,\"=500\",$L$61:$L$115,Таблица1[[#This Row],[Толщ.копия]],$F$61:$F$115,Таблица1[[#This Row],[АСТРА]])","v":0},{"$f":"Таблица1[[#This Row],[Столбец17]]+Таблица1[[#This Row],[Столбец18]]","v":0},null,null,null,{"$f":"SUMIFS($X$61:$X$115,$C$61:$C$115,Таблица1[[#This Row],[Дл]],$D$61:$D$115,\"=500\",$L$61:$L$115,Таблица1[[#This Row],[Толщ.копия]],$F$61:$F$115,Таблица1[[#This Row],[АСТРА]])","v":0},{"$f":"SUMIFS($X$61:$X$115,$C$61:$C$115,\"<\"&Таблица1[[#This Row],[Дл]],$D$61:$D$115,\"=500\",$L$61:$L$115,Таблица1[[#This Row],[Толщ.копия]],$F$61:$F$115,Таблица1[[#This Row],[АСТРА]])","v":0},{"$f":"Таблица1[[#This Row],[Столбец23]]+Таблица1[[#This Row],[Столбец24]]","v":0},{"$f":"Таблица1[[#This Row],[Столбец28]]+Таблица1[[#This Row],[Столбец29]]-Таблица1[[#This Row],[Столбец27]]","v":0},{"$f":"Таблица1[[#This Row],[резы]]*Таблица1[[#This Row],[шир.рез]]/1000*Таблица1[[#This Row],[коэф]]/2","v":0},{"$f":"SUMIFS($Y$61:$Y$115,$C$61:$C$115,Таблица1[[#This Row],[Дл]],$D$61:$D$115,\"=500\",$L$61:$L$115,Таблица1[[#This Row],[Толщ.копия]],$F$61:$F$115,Таблица1[[#This Row],[АСТРА]])","v":0},{"$f":"SUMIFS($Y$61:$Y$115,$C$61:$C$115,\"<\"&Таблица1[[#This Row],[Дл]],$D$61:$D$115,\"=500\",$L$61:$L$115,Таблица1[[#This Row],[Толщ.копия]],$F$61:$F$115,Таблица1[[#This Row],[АСТРА]])","v":0},5,{"$f":"IF(Таблица1[[#This Row],[профиль]]=Таблица1[[#This Row],[толщ]],CONCATENATE(Таблица1[[#This Row],[Столбец33]],\" \",Таблица1[[#This Row],[толщ]]),CONCATENATE(Таблица1[[#This Row],[Столбец33]],\" \",Таблица1[[#This Row],[профиль]],\"х\",Таблица1[[#This Row],[толщ]]))","v":"Труба пл.ов. 30х15х1,5"},{"$f":"CONCATENATE(Таблица1[[#This Row],[Столбец33]],\" \",Таблица1[[#This Row],[профиль]])","v":"Труба пл.ов. 30х15"},"Труба плоскоовальная 30х15, 1.5 мм, трпл-ов3015","Труба пл.ов.",{"$f":"IF(Таблица1[[#This Row],[профиль]]=Таблица1[[#This Row],[толщ]],Таблица1[[#This Row],[толщ]],CONCATENATE(Таблица1[[#This Row],[профиль]],\"х\",Таблица1[[#This Row],[точка]]))","v":"30х15х1.5"},"30х15",1.5,{"$f":"SUBSTITUTE(Таблица1[[#This Row],[толщ]],\",\",\".\")","v":"1.5"},1.9179999999999999]
[]
[]
[]
[]
[]
[]
[null,"Подпись",null,null,null,"Инженер-технолог"]
[null,"Подпись",null,null,null,"Нач техотдела"]
[null,"Подпись",null,null,null,"Генеральный директор"]

{"sheet":"ЛИСТ","index":1,"n_rows":150,"n_cols":35,"rows_kept":150,"cut":false,"hidden":false,"merged":[[2,14,2,15],[116,1,116,9],[119,2,119,3],[3,3,3,8],[2,7,2,9],[59,7,60,7],[59,8,60,8],[59,9,60,9],[59,6,60,6],[59,1,60,1],[59,2,60,2],[59,3,60,3],[59,4,60,4],[59,5,60,5],[59,29,60,29],[59,28,60,28],[59,24,60,24],[59,23,60,23],[59,11,60,11],[59,14,60,14],[59,17,60,17],[59,20,60,20],[5,26,6,26],[59,18,59,19],[59,21,59,22],[119,15,119,17],[119,12,119,14],[119,18,119,20],[59,15,59,16],[119,22,119,24],[119,21,120,21],[119,25,120,25],[118,15,118,20],[59,12,59,13]]}
["z",null,null,null,null,null,null,null,null,null,"z","z",null,null,null,null,null,null,null,null,null,null,null,null,null,null,"z","z","z","z","z","z","z","z","z"]
[null,null,null,null,null,"            Приложение № 1 к ЛЗК ___"]
[null,null,null,null,null,null,null,{"$f":"CONCATENATE(\"НЕ СОВПАДЕНИЕ  \",ROUND(L6-L7,3),\" кг\")","v":"НЕ СОВПАДЕНИЕ  -17522,433 кг"},null,null,null,0,null,null,{"$f":"TODAY()","v":"2023-07-27"}]
[null,null,null,{"$f":"ТРУБА!C4","v":"(19137.022.20.9016) Кронштейн 240 "}]
[null,null,null,{"$f":"CONCATENATE(\"Изделие из: \",IF(ТРУБА!M7>0,\"ТРУБА, \",\"\"),IF(ЛИСТ!L7>0,\"ЛИСТ, \",\"\"),IF(ПРОВОЛОКА!R83>0,\"ПРОВОЛОКА, \",\"\"),IF(ПВХ!I60>0,\"ПВХ \",\"\"))","v":"Изделие из: ТРУБА, ЛИСТ, ПРОВОЛОКА, ПВХ "},null,null,null,null,null,null,null,null,null,null,"по картам",null,null,null,null,null,null,null,"Сумма"]
[null,null,null,null,null,"План ",null,80,"шт",null,null,{"$f":"SUM(Таблица3[Столбец25])","v":176.3443462570969},null,null,"кол-во","сумма",null,null,null,null,null,null,{"$f":"SUM(W8:W57)","v":43.210102137851912},null,null,null,"разница\nмассы \n(рас-фак)"]
[null,"№\nп/п","Длина ","Ширина","Кол-во\nна\nизделие","Вращение детали\n1 - да\n0 - нет","S тол-на","материал","Наименование детали","Кол-во на план","ГОСТ",{"$f":"SUM(L8:L57)","v":17698.777674646397},"Площадь\nфакт\nм2","Площадь \nрасч\nм2",null,{"$f":"SUM(P8:P57)","v":7.2107000000000004E-2},"коэф\nмассы","толщина\n(запятая)","номерация",null,"Длина\nреза\nмм","Кол-во \nна \nплан","Угар/\nплан/\nдетали"," общая \nдлина \nреза/м/п"]
[{"$f":"IF(E8=0,\"z\",\"\")","v":""},{"$f":"IF(E8=0,\"\",S8)","v":1},970,520,1,1,{"$f":"IF(K8=\"\",\"\",VLOOKUP(K8,Таблица3[[#All],[Столбец9]:[точка]],24,0))","v":"1.5"},{"$f":"IF(K8=\"\",\"\",VLOOKUP(K8,Таблица3[[#All],[Столбец9]:[точка]],21,0))","v":"Лист лазер"},"деталька",{"$f":"$H$6*E8","v":80},"Лист 1,5",{"$f":"IFERROR(IF(M8=0,N8*J8*R8*Q8,M8*J8*R8*Q8),\"\")","v":448.23595391999999},0.47438399999999997,{"$f":"C8*D8/1000000","v":0.50439999999999996},0,{"$f":"O8*N8","v":0},{"$f":"IFERROR(VLOOKUP(H8,Таблица3[[#All],[Столбец28]:[Столбец30]],3,0),\"0\")","v":7.8739999999999997},{"$f":"IF(K8=\"\",\"\",VLOOKUP(K8,Таблица3[[#All],[Столбец9]:[точка]],3,0))","v":1.5},{"$f":"IF(J8=0,0,1)","v":1},null,{"$f":"(C8+D8)*2","v":2980},{"$f":"U8*J8/1000","v":238.4},{"$f":"IF(R8=\"\",\"\",X8*0.15*R8*Q8/1000)","v":1.2586368528},{"$f":"U8*V8/1000","v":710.43200000000002},null,null,{"$f":"IF(M8=0,0,(N8-M8)*J8*R8*Q8)","v":28.361518079999986}]
[{"$f":"IF(E9=0,\"z\",\"\")","v":""},2,303,303,5,1,{"$f":"IF(K9=\"\",\"\",VLOOKUP(K9,Таблица3[[#All],[Столбец9]:[точка]],24,0))","v":"2"},{"$f":"IF(K9=\"\",\"\",VLOOKUP(K9,Таблица3[[#All],[Столбец9]:[точка]],21,0))","v":"Лист лазер"},"штучка",{"$f":"$H$6*E9","v":400},"Лист 2",{"$f":"IFERROR(IF(M9=0,N9*J9*R9*Q9,M9*J9*R9*Q9),\"\")","v":454.21641439999996},7.2107000000000004E-2,{"$f":"C9*D9/1000000","v":9.1809000000000002E-2},0,{"$f":"IF(M9=0,O9*N9,M9)","v":7.2107000000000004E-2},{"$f":"IFERROR(VLOOKUP(H9,Таблица3[[#All],[Столбец28]:[Столбец30]],3,0),\"0\")","v":7.8739999999999997},{"$f":"IF(K9=\"\",\"\",VLOOKUP(K9,Таблица3[[#All],[Столбец9]:[точка]],3,0))","v":2},{"$f":"IF(J9=0,S8,S8+1)","v":2},null,{"$f":"(C9+D9)*2","v":1212},{"$f":"U9*J9/1000","v":484.8},1.3879758067199999,{"$f":"U9*V9/1000","v":587.57759999999996},null,null,{"$f":"IF(M9=0,0,(N9-M9)*J9*R9*Q9)","v":124.10683839999997}]
["",3,654,565,72,1,{"$f":"IF(K10=\"\",\"\",VLOOKUP(K10,Таблица3[[#All],[Столбец9]:[точка]],24,0))","v":"1"},{"$f":"IF(K10=\"\",\"\",VLOOKUP(K10,Таблица3[[#All],[Столбец9]:[точка]],21,0))","v":"листоц"},null,5760,"Лист ОЦ 1",16790.532508108798,null,{"$f":"C10*D10/1000000","v":0.36951000000000001},0,{"$f":"IF(M10=0,O10*N10,M10)","v":0},{"$f":"IFERROR(VLOOKUP(H10,Таблица3[[#All],[Столбец28]:[Столбец30]],3,0),\"0\")","v":7.8888879999999997},{"$f":"IF(K10=\"\",\"\",VLOOKUP(K10,Таблица3[[#All],[Столбец9]:[точка]],3,0))","v":1},{"$f":"IF(J10=0,S9,S9+1)","v":3},null,{"$f":"(C10+D10)*2","v":2438},{"$f":"U10*J10/1000","v":14042.88},{"$f":"IF(R10=\"\",\"\",X10*0.15*R10*Q10/1000)","v":40.513236139127812},{"$f":"U10*V10/1000","v":34236.541440000001},null,null,0]
[{"$f":"IF(E11=0,\"z\",\"\")","v":""},{"$f":"IF(E11=0,\"\",S11)","v":4},45,557,1,1,{"$f":"IF(K11=\"\",\"\",VLOOKUP(K11,Таблица3[[#All],[Столбец9]:[точка]],24,0))","v":"1"},{"$f":"IF(K11=\"\",\"\",VLOOKUP(K11,Таблица3[[#All],[Столбец9]:[точка]],21,0))","v":"пвл1"},null,{"$f":"$H$6*E11","v":80},"Сетка ПВЛ 1",{"$f":"IFERROR(IF(M11=0,N11*J11*R11*Q11,M11*J11*R11*Q11),\"\")","v":5.7927982175999997},null,{"$f":"C11*D11/1000000","v":2.5065E-2},0,{"$f":"IF(M11=0,O11*N11,M11)","v":0},{"$f":"IFERROR(VLOOKUP(H11,Таблица3[[#All],[Столбец28]:[Столбец30]],3,0),\"0\")","v":2.8888880000000001},{"$f":"IF(K11=\"\",\"\",VLOOKUP(K11,Таблица3[[#All],[Столбец9]:[точка]],3,0))","v":1},{"$f":"IF(J11=0,S10,S10+1)","v":4},null,{"$f":"(C11+D11)*2","v":1204},{"$f":"U11*J11/1000","v":96.32},{"$f":"IF(R11=\"\",\"\",X11*0.15*R11*Q11/1000)","v":5.0253339204095991E-2},{"$f":"U11*V11/1000","v":115.96928},null,null,{"$f":"IF(M11=0,0,(N11-M11)*J11*R11*Q11)","v":0}]
["z","",null,null,null,1,{"$f":"IF(K12=\"\",\"\",VLOOKUP(K12,Таблица3[[#All],[Столбец9]:[точка]],24,0))","v":""},{"$f":"IF(K12=\"\",\"\",VLOOKUP(K12,Таблица3[[#All],[Столбец9]:[точка]],21,0))","v":""},null,0,null,"",null,0,0,0,{"$f":"IFERROR(VLOOKUP(H12,Таблица3[[#All],[Столбец28]:[Столбец30]],3,0),\"0\")","v":"0"},{"$f":"IF(K12=\"\",\"\",VLOOKUP(K12,Таблица3[[#All],[Столбец9]:[точка]],3,0))","v":""},4,null,0,0,"",0,null,null,0]
["z","",null,null,null,1,{"$f":"IF(K13=\"\",\"\",VLOOKUP(K13,Таблица3[[#All],[Столбец9]:[точка]],24,0))","v":"1"},{"$f":"IF(K13=\"\",\"\",VLOOKUP(K13,Таблица3[[#All],[Столбец9]:[точка]],21,0))","v":"пвл1"},null,0,"Сетка ПВЛ 1",0,null,0,0,0,{"$f":"IFERROR(VLOOKUP(H13,Таблица3[[#All],[Столбец28]:[Столбец30]],3,0),\"0\")","v":2.8888880000000001},{"$f":"IF(K13=\"\",\"\",VLOOKUP(K13,Таблица3[[#All],[Столбец9]:[точка]],3,0))","v":1},4,null,0,0,0,0,null,null,0]
["z","",null,null,null,1,{"$f":"IF(K14=\"\",\"\",VLOOKUP(K14,Таблица3[[#All],[Столбец9]:[точка]],24,0))","v":""},{"$f":"IF(K14=\"\",\"\",VLOOKUP(K14,Таблица3[[#All],[Столбец9]:[точка]],21,0))","v":""},null,0,null,"",null,0,0,0,{"$f":"IFERROR(VLOOKUP(H14,Таблица3[[#All],[Столбец28]:[Столбец30]],3,0),\"0\")","v":"0"},{"$f":"IF(K14=\"\",\"\",VLOOKUP(K14,Таблица3[[#All],[Столбец9]:[точка]],3,0))","v":""},4,null,0,0,"",0,null,null,0]
["z","",null,null,null,1,{"$f":"IF(K15=\"\",\"\",VLOOKUP(K15,Таблица3[[#All],[Столбец9]:[точка]],24,0))","v":""},{"$f":"IF(K15=\"\",\"\",VLOOKUP(K15,Таблица3[[#All],[Столбец9]:[точка]],21,0))","v":""},null,0,null,"",null,0,0,0,{"$f":"IFERROR(VLOOKUP(H15,Таблица3[[#All],[Столбец28]:[Столбец30]],3,0),\"0\")","v":"0"},{"$f":"IF(K15=\"\",\"\",VLOOKUP(K15,Таблица3[[#All],[Столбец9]:[точка]],3,0))","v":""},4,null,0,0,"",0,null,null,0]
["z","",null,null,null,1,{"$f":"IF(K16=\"\",\"\",VLOOKUP(K16,Таблица3[[#All],[Столбец9]:[точка]],24,0))","v":""},{"$f":"IF(K16=\"\",\"\",VLOOKUP(K16,Таблица3[[#All],[Столбец9]:[точка]],21,0))","v":""},null,0,null,"",null,0,0,0,{"$f":"IFERROR(VLOOKUP(H16,Таблица3[[#All],[Столбец28]:[Столбец30]],3,0),\"0\")","v":"0"},{"$f":"IF(K16=\"\",\"\",VLOOKUP(K16,Таблица3[[#All],[Столбец9]:[точка]],3,0))","v":""},4,null,0,0,"",0,null,null,0]
["z","",null,null,null,1,{"$f":"IF(K17=\"\",\"\",VLOOKUP(K17,Таблица3[[#All],[Столбец9]:[точка]],24,0))","v":""},{"$f":"IF(K17=\"\",\"\",VLOOKUP(K17,Таблица3[[#All],[Столбец9]:[точка]],21,0))","v":""},null,0,null,"",null,0,0,0,{"$f":"IFERROR(VLOOKUP(H17,Таблица3[[#All],[Столбец28]:[Столбец30]],3,0),\"0\")","v":"0"},{"$f":"IF(K17=\"\",\"\",VLOOKUP(K17,Таблица3[[#All],[Столбец9]:[точка]],3,0))","v":""},4,null,0,0,"",0,null,null,0]
["z","",null,null,null,1,{"$f":"IF(K18=\"\",\"\",VLOOKUP(K18,Таблица3[[#All],[Столбец9]:[точка]],24,0))","v":"1.5"},{"$f":"IF(K18=\"\",\"\",VLOOKUP(K18,Таблица3[[#All],[Столбец9]:[точка]],21,0))","v":"Лист лазер"},null,0,"Лист 1,5",0,null,0,0,0,{"$f":"IFERROR(VLOOKUP(H18,Таблица3[[#All],[Столбец28]:[Столбец30]],3,0),\"0\")","v":7.8739999999999997},{"$f":"IF(K18=\"\",\"\",VLOOKUP(K18,Таблица3[[#All],[Столбец9]:[точка]],3,0))","v":1.5},4,null,0,0,0,0,null,null,0]
["z","",null,null,null,1,{"$f":"IF(K19=\"\",\"\",VLOOKUP(K19,Таблица3[[#All],[Столбец9]:[точка]],24,0))","v":""},{"$f":"IF(K19=\"\",\"\",VLOOKUP(K19,Таблица3[[#All],[Столбец9]:[точка]],21,0))","v":""},null,0,null,"",null,0,0,0,{"$f":"IFERROR(VLOOKUP(H19,Таблица3[[#All],[Столбец28]:[Столбец30]],3,0),\"0\")","v":"0"},{"$f":"IF(K19=\"\",\"\",VLOOKUP(K19,Таблица3[[#All],[Столбец9]:[точка]],3,0))","v":""},4,null,0,0,"",0,null,null,0]
[{"$f":"IF(E20=0,\"z\",\"\")","v":"z"},{"$f":"IF(E20=0,\"\",S20)","v":""},null,null,null,1,{"$f":"IF(K20=\"\",\"\",VLOOKUP(K20,Таблица3[[#All],[Столбец9]:[точка]],24,0))","v":""},{"$f":"IF(K20=\"\",\"\",VLOOKUP(K20,Таблица3[[#All],[Столбец9]:[точка]],21,0))","v":""},null,{"$f":"$H$6*E20","v":0},null,{"$f":"IFERROR(IF(M20=0,N20*J20*R20*Q20,M20*J20*R20*Q20),\"\")","v":""},null,{"$f":"C20*D20/1000000","v":0},0,{"$f":"IF(M20=0,O20*N20,M20)","v":0},{"$f":"IFERROR(VLOOKUP(H20,Таблица3[[#All],[Столбец28]:[Столбец30]],3,0),\"0\")","v":"0"},{"$f":"IF(K20=\"\",\"\",VLOOKUP(K20,Таблица3[[#All],[Столбец9]:[точка]],3,0))","v":""},4,null,{"$f":"(C20+D20)*2","v":0},{"$f":"U20*J20/1000","v":0},{"$f":"IF(R20=\"\",\"\",X20*0.15*R20*Q20/1000)","v":""},{"$f":"U20*V20/1000","v":0},null,null,{"$f":"IF(M20=0,0,(N20-M20)*J20*R20*Q20)","v":0}]
["z","",null,null,null,1,{"$f":"IF(K21=\"\",\"\",VLOOKUP(K21,Таблица3[[#All],[Столбец9]:[точка]],24,0))","v":""},{"$f":"IF(K21=\"\",\"\",VLOOKUP(K21,Таблица3[[#All],[Столбец9]:[точка]],21,0))","v":""},null,0,null,"",null,0,0,0,{"$f":"IFERROR(VLOOKUP(H21,Таблица3[[#All],[Столбец28]:[Столбец30]],3,0),\"0\")","v":"0"},{"$f":"IF(K21=\"\",\"\",VLOOKUP(K21,Таблица3[[#All],[Столбец9]:[точка]],3,0))","v":""},4,null,0,0,"",0,null,null,0]
["z","",null,null,null,1,{"$f":"IF(K22=\"\",\"\",VLOOKUP(K22,Таблица3[[#All],[Столбец9]:[точка]],24,0))","v":""},{"$f":"IF(K22=\"\",\"\",VLOOKUP(K22,Таблица3[[#All],[Столбец9]:[точка]],21,0))","v":""},null,0,null,"",null,0,0,0,{"$f":"IFERROR(VLOOKUP(H22,Таблица3[[#All],[Столбец28]:[Столбец30]],3,0),\"0\")","v":"0"},{"$f":"IF(K22=\"\",\"\",VLOOKUP(K22,Таблица3[[#All],[Столбец9]:[точка]],3,0))","v":""},4,null,0,0,"",0,null,null,0]
["z","",null,null,null,1,{"$f":"IF(K23=\"\",\"\",VLOOKUP(K23,Таблица3[[#All],[Столбец9]:[точка]],24,0))","v":""},{"$f":"IF(K23=\"\",\"\",VLOOKUP(K23,Таблица3[[#All],[Столбец9]:[точка]],21,0))","v":""},null,0,null,"",null,0,0,0,{"$f":"IFERROR(VLOOKUP(H23,Таблица3[[#All],[Столбец28]:[Столбец30]],3,0),\"0\")","v":"0"},{"$f":"IF(K23=\"\",\"\",VLOOKUP(K23,Таблица3[[#All],[Столбец9]:[точка]],3,0))","v":""},4,null,0,0,"",0,null,null,0]
["z","",null,null,null,1,{"$f":"IF(K24=\"\",\"\",VLOOKUP(K24,Таблица3[[#All],[Столбец9]:[точка]],24,0))","v":""},{"$f":"IF(K24=\"\",\"\",VLOOKUP(K24,Таблица3[[#All],[Столбец9]:[точка]],21,0))","v":""},null,0,null,"",null,0,0,0,{"$f":"IFERROR(VLOOKUP(H24,Таблица3[[#All],[Столбец28]:[Столбец30]],3,0),\"0\")","v":"0"},{"$f":"IF(K24=\"\",\"\",VLOOKUP(K24,Таблица3[[#All],[Столбец9]:[точка]],3,0))","v":""},4,null,0,0,"",0,null,null,0]
["z","",null,null,null,1,{"$f":"IF(K25=\"\",\"\",VLOOKUP(K25,Таблица3[[#All],[Столбец9]:[точка]],24,0))","v":""},{"$f":"IF(K25=\"\",\"\",VLOOKUP(K25,Таблица3[[#All],[Столбец9]:[точка]],21,0))","v":""},null,0,null,"",null,0,0,0,{"$f":"IFERROR(VLOOKUP(H25,Таблица3[[#All],[Столбец28]:[Столбец30]],3,0),\"0\")","v":"0"},{"$f":"IF(K25=\"\",\"\",VLOOKUP(K25,Таблица3[[#All],[Столбец9]:[точка]],3,0))","v":""},4,null,0,0,"",0,null,null,0]
["z","",null,null,null,1,{"$f":"IF(K26=\"\",\"\",VLOOKUP(K26,Таблица3[[#All],[Столбец9]:[точка]],24,0))","v":""},{"$f":"IF(K26=\"\",\"\",VLOOKUP(K26,Таблица3[[#All],[Столбец9]:[точка]],21,0))","v":""},null,0,null,"",null,0,0,0,{"$f":"IFERROR(VLOOKUP(H26,Таблица3[[#All],[Столбец28]:[Столбец30]],3,0),\"0\")","v":"0"},{"$f":"IF(K26=\"\",\"\",VLOOKUP(K26,Таблица3[[#All],[Столбец9]:[точка]],3,0))","v":""},4,null,0,0,"",0,null,null,0]
["z","",null,null,null,1,{"$f":"IF(K27=\"\",\"\",VLOOKUP(K27,Таблица3[[#All],[Столбец9]:[точка]],24,0))","v":""},{"$f":"IF(K27=\"\",\"\",VLOOKUP(K27,Таблица3[[#All],[Столбец9]:[точка]],21,0))","v":""},null,0,null,"",null,0,0,0,{"$f":"IFERROR(VLOOKUP(H27,Таблица3[[#All],[Столбец28]:[Столбец30]],3,0),\"0\")","v":"0"},{"$f":"IF(K27=\"\",\"\",VLOOKUP(K27,Таблица3[[#All],[Столбец9]:[точка]],3,0))","v":""},4,null,0,0,"",0,null,null,0]
["z","",null,null,null,1,{"$f":"IF(K28=\"\",\"\",VLOOKUP(K28,Таблица3[[#All],[Столбец9]:[точка]],24,0))","v":""},{"$f":"IF(K28=\"\",\"\",VLOOKUP(K28,Таблица3[[#All],[Столбец9]:[точка]],21,0))","v":""},null,0,null,"",null,0,0,0,{"$f":"IFERROR(VLOOKUP(H28,Таблица3[[#All],[Столбец28]:[Столбец30]],3,0),\"0\")","v":"0"},{"$f":"IF(K28=\"\",\"\",VLOOKUP(K28,Таблица3[[#All],[Столбец9]:[точка]],3,0))","v":""},4,null,0,0,"",0,null,null,0]
["z","",null,null,null,1,{"$f":"IF(K29=\"\",\"\",VLOOKUP(K29,Таблица3[[#All],[Столбец9]:[точка]],24,0))","v":""},{"$f":"IF(K29=\"\",\"\",VLOOKUP(K29,Таблица3[[#All],[Столбец9]:[точка]],21,0))","v":""},null,0,null,"",null,0,0,0,{"$f":"IFERROR(VLOOKUP(H29,Таблица3[[#All],[Столбец28]:[Столбец30]],3,0),\"0\")","v":"0"},{"$f":"IF(K29=\"\",\"\",VLOOKUP(K29,Таблица3[[#All],[Столбец9]:[точка]],3,0))","v":""},4,null,0,0,"",0,null,null,0]
["z","",null,null,null,1,{"$f":"IF(K30=\"\",\"\",VLOOKUP(K30,Таблица3[[#All],[Столбец9]:[точка]],24,0))","v":""},{"$f":"IF(K30=\"\",\"\",VLOOKUP(K30,Таблица3[[#All],[Столбец9]:[точка]],21,0))","v":""},null,0,null,"",null,0,0,0,{"$f":"IFERROR(VLOOKUP(H30,Таблица3[[#All],[Столбец28]:[Столбец30]],3,0),\"0\")","v":"0"},{"$f":"IF(K30=\"\",\"\",VLOOKUP(K30,Таблица3[[#All],[Столбец9]:[точка]],3,0))","v":""},4,null,0,0,"",0,null,null,0]
[{"$f":"IF(E31=0,\"z\",\"\")","v":"z"},{"$f":"IF(E31=0,\"\",S31)","v":""},null,null,null,1,{"$f":"IF(K31=\"\",\"\",VLOOKUP(K31,Таблица3[[#All],[Столбец9]:[точка]],24,0))","v":""},{"$f":"IF(K31=\"\",\"\",VLOOKUP(K31,Таблица3[[#All],[Столбец9]:[точка]],21,0))","v":""},null,{"$f":"$H$6*E31","v":0},null,{"$f":"IFERROR(IF(M31=0,N31*J31*R31*Q31,M31*J31*R31*Q31),\"\")","v":""},null,{"$f":"C31*D31/1000000","v":0},0,{"$f":"IF(M31=0,O31*N31,M31)","v":0},{"$f":"IFERROR(VLOOKUP(H31,Таблица3[[#All],[Столбец28]:[Столбец30]],3,0),\"0\")","v":"0"},{"$f":"IF(K31=\"\",\"\",VLOOKUP(K31,Таблица3[[#All],[Столбец9]:[точка]],3,0))","v":""},{"$f":"IF(J31=0,S30,S30+1)","v":4},null,{"$f":"(C31+D31)*2","v":0},{"$f":"U31*J31/1000","v":0},{"$f":"IF(R31=\"\",\"\",X31*0.15*R31*Q31/1000)","v":""},{"$f":"U31*V31/1000","v":0},null,null,{"$f":"IF(M31=0,0,(N31-M31)*J31*R31*Q31)","v":0}]
["z","",null,null,null,1,{"$f":"IF(K32=\"\",\"\",VLOOKUP(K32,Таблица3[[#All],[Столбец9]:[точка]],24,0))","v":""},{"$f":"IF(K32=\"\",\"\",VLOOKUP(K32,Таблица3[[#All],[Столбец9]:[точка]],21,0))","v":""},null,0,null,"",null,0,0,0,{"$f":"IFERROR(VLOOKUP(H32,Таблица3[[#All],[Столбец28]:[Столбец30]],3,0),\"0\")","v":"0"},{"$f":"IF(K32=\"\",\"\",VLOOKUP(K32,Таблица3[[#All],[Столбец9]:[точка]],3,0))","v":""},4,null,0,0,"",0,null,null,0]
["z","",null,null,null,1,{"$f":"IF(K33=\"\",\"\",VLOOKUP(K33,Таблица3[[#All],[Столбец9]:[точка]],24,0))","v":""},{"$f":"IF(K33=\"\",\"\",VLOOKUP(K33,Таблица3[[#All],[Столбец9]:[точка]],21,0))","v":""},null,0,null,"",null,0,0,0,{"$f":"IFERROR(VLOOKUP(H33,Таблица3[[#All],[Столбец28]:[Столбец30]],3,0),\"0\")","v":"0"},{"$f":"IF(K33=\"\",\"\",VLOOKUP(K33,Таблица3[[#All],[Столбец9]:[точка]],3,0))","v":""},4,null,0,0,"",0,null,null,0]
["z","",null,null,null,1,{"$f":"IF(K34=\"\",\"\",VLOOKUP(K34,Таблица3[[#All],[Столбец9]:[точка]],24,0))","v":""},{"$f":"IF(K34=\"\",\"\",VLOOKUP(K34,Таблица3[[#All],[Столбец9]:[точка]],21,0))","v":""},null,0,null,"",null,0,0,0,{"$f":"IFERROR(VLOOKUP(H34,Таблица3[[#All],[Столбец28]:[Столбец30]],3,0),\"0\")","v":"0"},{"$f":"IF(K34=\"\",\"\",VLOOKUP(K34,Таблица3[[#All],[Столбец9]:[точка]],3,0))","v":""},4,null,0,0,"",0,null,null,0]
["z","",null,null,null,1,{"$f":"IF(K35=\"\",\"\",VLOOKUP(K35,Таблица3[[#All],[Столбец9]:[точка]],24,0))","v":""},{"$f":"IF(K35=\"\",\"\",VLOOKUP(K35,Таблица3[[#All],[Столбец9]:[точка]],21,0))","v":""},null,0,null,"",null,0,0,0,{"$f":"IFERROR(VLOOKUP(H35,Таблица3[[#All],[Столбец28]:[Столбец30]],3,0),\"0\")","v":"0"},{"$f":"IF(K35=\"\",\"\",VLOOKUP(K35,Таблица3[[#All],[Столбец9]:[точка]],3,0))","v":""},4,null,0,0,"",0,null,null,0]
["z","",null,null,null,1,{"$f":"IF(K36=\"\",\"\",VLOOKUP(K36,Таблица3[[#All],[Столбец9]:[точка]],24,0))","v":""},{"$f":"IF(K36=\"\",\"\",VLOOKUP(K36,Таблица3[[#All],[Столбец9]:[точка]],21,0))","v":""},null,0,null,"",null,0,0,0,{"$f":"IFERROR(VLOOKUP(H36,Таблица3[[#All],[Столбец28]:[Столбец30]],3,0),\"0\")","v":"0"},{"$f":"IF(K36=\"\",\"\",VLOOKUP(K36,Таблица3[[#All],[Столбец9]:[точка]],3,0))","v":""},4,null,0,0,"",0,null,null,0]
["z","",null,null,null,1,{"$f":"IF(K37=\"\",\"\",VLOOKUP(K37,Таблица3[[#All],[Столбец9]:[точка]],24,0))","v":""},{"$f":"IF(K37=\"\",\"\",VLOOKUP(K37,Таблица3[[#All],[Столбец9]:[точка]],21,0))","v":""},null,0,null,"",null,0,0,0,{"$f":"IFERROR(VLOOKUP(H37,Таблица3[[#All],[Столбец28]:[Столбец30]],3,0),\"0\")","v":"0"},{"$f":"IF(K37=\"\",\"\",VLOOKUP(K37,Таблица3[[#All],[Столбец9]:[точка]],3,0))","v":""},4,null,0,0,"",0,null,null,0]
["z","",null,null,null,1,{"$f":"IF(K38=\"\",\"\",VLOOKUP(K38,Таблица3[[#All],[Столбец9]:[точка]],24,0))","v":""},{"$f":"IF(K38=\"\",\"\",VLOOKUP(K38,Таблица3[[#All],[Столбец9]:[точка]],21,0))","v":""},null,0,null,"",null,0,0,0,{"$f":"IFERROR(VLOOKUP(H38,Таблица3[[#All],[Столбец28]:[Столбец30]],3,0),\"0\")","v":"0"},{"$f":"IF(K38=\"\",\"\",VLOOKUP(K38,Таблица3[[#All],[Столбец9]:[точка]],3,0))","v":""},4,null,0,0,"",0,null,null,0]
["z","",null,null,null,1,{"$f":"IF(K39=\"\",\"\",VLOOKUP(K39,Таблица3[[#All],[Столбец9]:[точка]],24,0))","v":""},{"$f":"IF(K39=\"\",\"\",VLOOKUP(K39,Таблица3[[#All],[Столбец9]:[точка]],21,0))","v":""},null,0,null,"",null,0,0,0,{"$f":"IFERROR(VLOOKUP(H39,Таблица3[[#All],[Столбец28]:[Столбец30]],3,0),\"0\")","v":"0"},{"$f":"IF(K39=\"\",\"\",VLOOKUP(K39,Таблица3[[#All],[Столбец9]:[точка]],3,0))","v":""},4,null,0,0,"",0,null,null,0]
["z","",null,null,null,1,{"$f":"IF(K40=\"\",\"\",VLOOKUP(K40,Таблица3[[#All],[Столбец9]:[точка]],24,0))","v":""},{"$f":"IF(K40=\"\",\"\",VLOOKUP(K40,Таблица3[[#All],[Столбец9]:[точка]],21,0))","v":""},null,0,null,"",null,0,0,0,{"$f":"IFERROR(VLOOKUP(H40,Таблица3[[#All],[Столбец28]:[Столбец30]],3,0),\"0\")","v":"0"},{"$f":"IF(K40=\"\",\"\",VLOOKUP(K40,Таблица3[[#All],[Столбец9]:[точка]],3,0))","v":""},4,null,0,0,"",0,null,null,0]
["z","",null,null,null,1,{"$f":"IF(K41=\"\",\"\",VLOOKUP(K41,Таблица3[[#All],[Столбец9]:[точка]],24,0))","v":""},{"$f":"IF(K41=\"\",\"\",VLOOKUP(K41,Таблица3[[#All],[Столбец9]:[точка]],21,0))","v":""},null,0,null,"",null,0,0,0,{"$f":"IFERROR(VLOOKUP(H41,Таблица3[[#All],[Столбец28]:[Столбец30]],3,0),\"0\")","v":"0"},{"$f":"IF(K41=\"\",\"\",VLOOKUP(K41,Таблица3[[#All],[Столбец9]:[точка]],3,0))","v":""},4,null,0,0,"",0,null,null,0]
["z","",null,null,null,1,{"$f":"IF(K42=\"\",\"\",VLOOKUP(K42,Таблица3[[#All],[Столбец9]:[точка]],24,0))","v":""},{"$f":"IF(K42=\"\",\"\",VLOOKUP(K42,Таблица3[[#All],[Столбец9]:[точка]],21,0))","v":""},null,0,null,"",null,0,0,0,{"$f":"IFERROR(VLOOKUP(H42,Таблица3[[#All],[Столбец28]:[Столбец30]],3,0),\"0\")","v":"0"},{"$f":"IF(K42=\"\",\"\",VLOOKUP(K42,Таблица3[[#All],[Столбец9]:[точка]],3,0))","v":""},4,null,0,0,"",0,null,null,0]
["z","",null,null,null,1,{"$f":"IF(K43=\"\",\"\",VLOOKUP(K43,Таблица3[[#All],[Столбец9]:[точка]],24,0))","v":""},{"$f":"IF(K43=\"\",\"\",VLOOKUP(K43,Таблица3[[#All],[Столбец9]:[точка]],21,0))","v":""},null,0,null,"",null,0,0,0,{"$f":"IFERROR(VLOOKUP(H43,Таблица3[[#All],[Столбец28]:[Столбец30]],3,0),\"0\")","v":"0"},{"$f":"IF(K43=\"\",\"\",VLOOKUP(K43,Таблица3[[#All],[Столбец9]:[точка]],3,0))","v":""},4,null,0,0,"",0,null,null,0]
["z","",null,null,null,1,{"$f":"IF(K44=\"\",\"\",VLOOKUP(K44,Таблица3[[#All],[Столбец9]:[точка]],24,0))","v":""},{"$f":"IF(K44=\"\",\"\",VLOOKUP(K44,Таблица3[[#All],[Столбец9]:[точка]],21,0))","v":""},null,0,null,"",null,0,0,0,{"$f":"IFERROR(VLOOKUP(H44,Таблица3[[#All],[Столбец28]:[Столбец30]],3,0),\"0\")","v":"0"},{"$f":"IF(K44=\"\",\"\",VLOOKUP(K44,Таблица3[[#All],[Столбец9]:[точка]],3,0))","v":""},4,null,0,0,"",0,null,null,0]
["z","",null,null,null,1,{"$f":"IF(K45=\"\",\"\",VLOOKUP(K45,Таблица3[[#All],[Столбец9]:[точка]],24,0))","v":""},{"$f":"IF(K45=\"\",\"\",VLOOKUP(K45,Таблица3[[#All],[Столбец9]:[точка]],21,0))","v":""},null,0,null,"",null,0,0,0,{"$f":"IFERROR(VLOOKUP(H45,Таблица3[[#All],[Столбец28]:[Столбец30]],3,0),\"0\")","v":"0"},{"$f":"IF(K45=\"\",\"\",VLOOKUP(K45,Таблица3[[#All],[Столбец9]:[точка]],3,0))","v":""},4,null,0,0,"",0,null,null,0]
["z","",null,null,null,1,{"$f":"IF(K46=\"\",\"\",VLOOKUP(K46,Таблица3[[#All],[Столбец9]:[точка]],24,0))","v":""},{"$f":"IF(K46=\"\",\"\",VLOOKUP(K46,Таблица3[[#All],[Столбец9]:[точка]],21,0))","v":""},null,0,null,"",null,0,0,0,{"$f":"IFERROR(VLOOKUP(H46,Таблица3[[#All],[Столбец28]:[Столбец30]],3,0),\"0\")","v":"0"},{"$f":"IF(K46=\"\",\"\",VLOOKUP(K46,Таблица3[[#All],[Столбец9]:[точка]],3,0))","v":""},4,null,0,0,"",0,null,null,0]
["z","",null,null,null,1,{"$f":"IF(K47=\"\",\"\",VLOOKUP(K47,Таблица3[[#All],[Столбец9]:[точка]],24,0))","v":""},{"$f":"IF(K47=\"\",\"\",VLOOKUP(K47,Таблица3[[#All],[Столбец9]:[точка]],21,0))","v":""},null,0,null,"",null,0,0,0,{"$f":"IFERROR(VLOOKUP(H47,Таблица3[[#All],[Столбец28]:[Столбец30]],3,0),\"0\")","v":"0"},{"$f":"IF(K47=\"\",\"\",VLOOKUP(K47,Таблица3[[#All],[Столбец9]:[точка]],3,0))","v":""},4,null,0,0,"",0,null,null,0]
["z","",null,null,null,1,{"$f":"IF(K48=\"\",\"\",VLOOKUP(K48,Таблица3[[#All],[Столбец9]:[точка]],24,0))","v":""},{"$f":"IF(K48=\"\",\"\",VLOOKUP(K48,Таблица3[[#All],[Столбец9]:[точка]],21,0))","v":""},null,0,null,"",null,0,0,0,{"$f":"IFERROR(VLOOKUP(H48,Таблица3[[#All],[Столбец28]:[Столбец30]],3,0),\"0\")","v":"0"},{"$f":"IF(K48=\"\",\"\",VLOOKUP(K48,Таблица3[[#All],[Столбец9]:[точка]],3,0))","v":""},4,null,0,0,"",0,null,null,0]
["z","",null,null,null,1,{"$f":"IF(K49=\"\",\"\",VLOOKUP(K49,Таблица3[[#All],[Столбец9]:[точка]],24,0))","v":""},{"$f":"IF(K49=\"\",\"\",VLOOKUP(K49,Таблица3[[#All],[Столбец9]:[точка]],21,0))","v":""},null,0,null,"",null,0,0,0,{"$f":"IFERROR(VLOOKUP(H49,Таблица3[[#All],[Столбец28]:[Столбец30]],3,0),\"0\")","v":"0"},{"$f":"IF(K49=\"\",\"\",VLOOKUP(K49,Таблица3[[#All],[Столбец9]:[точка]],3,0))","v":""},4,null,0,0,"",0,null,null,0]
["z","",null,null,null,1,{"$f":"IF(K50=\"\",\"\",VLOOKUP(K50,Таблица3[[#All],[Столбец9]:[точка]],24,0))","v":""},{"$f":"IF(K50=\"\",\"\",VLOOKUP(K50,Таблица3[[#All],[Столбец9]:[точка]],21,0))","v":""},null,0,null,"",null,0,0,0,{"$f":"IFERROR(VLOOKUP(H50,Таблица3[[#All],[Столбец28]:[Столбец30]],3,0),\"0\")","v":"0"},{"$f":"IF(K50=\"\",\"\",VLOOKUP(K50,Таблица3[[#All],[Столбец9]:[точка]],3,0))","v":""},4,null,0,0,"",0,null,null,0]
["z","",null,null,null,1,{"$f":"IF(K51=\"\",\"\",VLOOKUP(K51,Таблица3[[#All],[Столбец9]:[точка]],24,0))","v":""},{"$f":"IF(K51=\"\",\"\",VLOOKUP(K51,Таблица3[[#All],[Столбец9]:[точка]],21,0))","v":""},null,0,null,"",null,0,0,0,{"$f":"IFERROR(VLOOKUP(H51,Таблица3[[#All],[Столбец28]:[Столбец30]],3,0),\"0\")","v":"0"},{"$f":"IF(K51=\"\",\"\",VLOOKUP(K51,Таблица3[[#All],[Столбец9]:[точка]],3,0))","v":""},4,null,0,0,"",0,null,null,0]
["z","",null,null,null,1,{"$f":"IF(K52=\"\",\"\",VLOOKUP(K52,Таблица3[[#All],[Столбец9]:[точка]],24,0))","v":""},{"$f":"IF(K52=\"\",\"\",VLOOKUP(K52,Таблица3[[#All],[Столбец9]:[точка]],21,0))","v":""},null,0,null,"",null,0,0,0,{"$f":"IFERROR(VLOOKUP(H52,Таблица3[[#All],[Столбец28]:[Столбец30]],3,0),\"0\")","v":"0"},{"$f":"IF(K52=\"\",\"\",VLOOKUP(K52,Таблица3[[#All],[Столбец9]:[точка]],3,0))","v":""},4,null,0,0,"",0,null,null,0]
["z","",null,null,null,1,{"$f":"IF(K53=\"\",\"\",VLOOKUP(K53,Таблица3[[#All],[Столбец9]:[точка]],24,0))","v":""},{"$f":"IF(K53=\"\",\"\",VLOOKUP(K53,Таблица3[[#All],[Столбец9]:[точка]],21,0))","v":""},null,0,null,"",null,0,0,0,{"$f":"IFERROR(VLOOKUP(H53,Таблица3[[#All],[Столбец28]:[Столбец30]],3,0),\"0\")","v":"0"},{"$f":"IF(K53=\"\",\"\",VLOOKUP(K53,Таблица3[[#All],[Столбец9]:[точка]],3,0))","v":""},4,null,0,0,"",0,null,null,0]
["z","",null,null,null,1,{"$f":"IF(K54=\"\",\"\",VLOOKUP(K54,Таблица3[[#All],[Столбец9]:[точка]],24,0))","v":""},{"$f":"IF(K54=\"\",\"\",VLOOKUP(K54,Таблица3[[#All],[Столбец9]:[точка]],21,0))","v":""},null,0,null,"",null,0,0,0,{"$f":"IFERROR(VLOOKUP(H54,Таблица3[[#All],[Столбец28]:[Столбец30]],3,0),\"0\")","v":"0"},{"$f":"IF(K54=\"\",\"\",VLOOKUP(K54,Таблица3[[#All],[Столбец9]:[точка]],3,0))","v":""},4,null,0,0,"",0,null,null,0]
["z","",null,null,null,1,{"$f":"IF(K55=\"\",\"\",VLOOKUP(K55,Таблица3[[#All],[Столбец9]:[точка]],24,0))","v":""},{"$f":"IF(K55=\"\",\"\",VLOOKUP(K55,Таблица3[[#All],[Столбец9]:[точка]],21,0))","v":""},null,0,null,"",null,0,0,0,{"$f":"IFERROR(VLOOKUP(H55,Таблица3[[#All],[Столбец28]:[Столбец30]],3,0),\"0\")","v":"0"},{"$f":"IF(K55=\"\",\"\",VLOOKUP(K55,Таблица3[[#All],[Столбец9]:[точка]],3,0))","v":""},4,null,0,0,"",0,null,null,0]
["z","",null,null,null,1,{"$f":"IF(K56=\"\",\"\",VLOOKUP(K56,Таблица3[[#All],[Столбец9]:[точка]],24,0))","v":""},{"$f":"IF(K56=\"\",\"\",VLOOKUP(K56,Таблица3[[#All],[Столбец9]:[точка]],21,0))","v":""},null,0,null,"",null,0,0,0,{"$f":"IFERROR(VLOOKUP(H56,Таблица3[[#All],[Столбец28]:[Столбец30]],3,0),\"0\")","v":"0"},{"$f":"IF(K56=\"\",\"\",VLOOKUP(K56,Таблица3[[#All],[Столбец9]:[точка]],3,0))","v":""},4,null,0,0,"",0,null,null,0]
["z","",null,null,null,1,{"$f":"IF(K57=\"\",\"\",VLOOKUP(K57,Таблица3[[#All],[Столбец9]:[точка]],24,0))","v":""},{"$f":"IF(K57=\"\",\"\",VLOOKUP(K57,Таблица3[[#All],[Столбец9]:[точка]],21,0))","v":""},null,0,null,"",null,0,0,0,{"$f":"IFERROR(VLOOKUP(H57,Таблица3[[#All],[Столбец28]:[Столбец30]],3,0),\"0\")","v":"0"},{"$f":"IF(K57=\"\",\"\",VLOOKUP(K57,Таблица3[[#All],[Столбец9]:[точка]],3,0))","v":""},4,null,0,0,"",0,null,null,0]
[null,null,null,null,null,null,null,null,"Всего ",{"$f":"SUM(J8:J57)","v":6320}]
[null,null,null,null,null,null,null,null,null,null,null,null,null,null,null,null,null,null,null,null,null,null,null,null,null,null,null,null,"ОКРУГЛЕНИЕ"]
[null,"Карта\nраскроя\n №","Ширина, мм","Длина, мм","Толщина, мм","Марка материала","Кол-во","Площадь остатков всего, кв.м","Площадь деталей всего, кв.м","Кол-во деталей",null,"Плот-ность ","Лист / деловые остатка со склада (кг)",null,"Получил","Деловой остаток на склад (кг)",null,"Получил кладовщик","ЛОМ (кг)",null,"Получил кладовщик","Масса деталей (кг)",null,"Количество деталей","Получил",null,"Расход (кг)","ЛОМ (кг) дубль","Толщина, мм","Факт масса"]
[null,null,null,null,null,null,null,null,null,null,null,null,"теория","факт",null,"теория","факт",null,"теория","факт",null,"теория","факт",null,null,null,null,"теория"]
[{"$f":"IF(G62=0,\"z\",\"\")","v":""},1,622,622,0.8,"Лист лазер, 0.8 мм, лт",20,0,7.3447197675704956,4,1,{"$f":"IFERROR(VLOOKUP(F62,Таблица3[[#All],[Астра]:[Столбец30]],4,0),\"0\")","v":7.8739999999999997},{"$f":"C62*D62*E62*L62*G62/1000000","v":48.741193855999995},null,null,{"$f":"E62*H62*L62","v":0},null,null,{"$f":"AA62-V62","v":2.4753350961199345},null,null,{"$f":"E62*I62*L62","v":46.265858759880061},null,null,null,null,{"$f":"M62-P62","v":48.741193855999995},{"$f":"AA62-V62","v":2.4753350961199345},{"$f":"ROUND(E62,2)","v":0.8}]
[{"$f":"IF(G63=0,\"z\",\"\")","v":""},2,1250,622,0.8,"Лист лазер, 0.8 мм, лт",1,0.26354799419641495,0.50440001487731934,1,2,{"$f":"IFERROR(VLOOKUP(F63,Таблица3[[#All],[Астра]:[Столбец30]],4,0),\"0\")","v":7.8739999999999997},{"$f":"C63*D63*E63*L63*G63/1000000","v":4.8976280000000001},null,null,{"$f":"E63*H63*L63","v":1.660141525042057},null,null,6.0169901242733026E-2,null,null,{"$f":"E63*I63*L63","v":3.1773165737152098},null,null,null,null,3.2374864749579428,6.0169901242733026E-2,{"$f":"ROUND(E63,2)","v":0.8}]
["",3,1250,2500,0.8,"Лист лазер, 0.8 мм, лт",19,20.479150265455246,38.33440113067627,4,3,{"$f":"IFERROR(VLOOKUP(F64,Таблица3[[#All],[Астра]:[Столбец30]],4,0),\"0\")","v":7.8739999999999997},374.01499999999999,null,null,129.00226335215569,null,null,3.5366770454883181,null,null,241.47605960235597,null,null,null,null,245.01273664784429,3.5366770454883181,0.8]
["",4,1250,2500,0.8,"Лист лазер, 0.8 мм, лт",1,1.5890839695930481,1.513200044631958,3,4,{"$f":"IFERROR(VLOOKUP(F65,Таблица3[[#All],[Астра]:[Столбец30]],4,0),\"0\")","v":7.8739999999999997},19.684999999999999,null,null,10.009957741260529,null,null,0.143092537593839,null,null,9.5319497211456312,null,null,null,null,9.6750422587394702,0.143092537593839,0.8]
[{"$f":"IF(G66=0,\"z\",\"\")","v":"z"},null,null,null,null,null,null,null,null,null,5,{"$f":"IFERROR(VLOOKUP(F66,Таблица3[[#All],[Астра]:[Столбец30]],4,0),\"0\")","v":"0"},{"$f":"C66*D66*E66*L66*G66/1000000","v":0},null,null,{"$f":"E66*H66*L66","v":0},null,null,{"$f":"AA66-V66","v":0},null,null,{"$f":"E66*I66*L66","v":0},null,null,null,null,{"$f":"M66-P66","v":0},{"$f":"AA66-V66","v":0},{"$f":"ROUND(E66,2)","v":0}]
["z",null,null,null,null,null,null,null,null,null,6,{"$f":"IFERROR(VLOOKUP(F67,Таблица3[[#All],[Астра]:[Столбец30]],4,0),\"0\")","v":"0"},0,null,null,0,null,null,0,null,null,0,null,null,null,null,0,0,0]
["z",null,null,null,null,null,null,null,null,null,7,{"$f":"IFERROR(VLOOKUP(F68,Таблица3[[#All],[Астра]:[Столбец30]],4,0),\"0\")","v":"0"},0,null,null,0,null,null,0,null,null,0,null,null,null,null,0,0,0]
["z",null,null,null,null,null,null,null,null,null,8,{"$f":"IFERROR(VLOOKUP(F69,Таблица3[[#All],[Астра]:[Столбец30]],4,0),\"0\")","v":"0"},0,null,null,0,null,null,0,null,null,0,null,null,null,null,0,0,0]
["z",null,null,null,null,null,null,null,null,null,9,{"$f":"IFERROR(VLOOKUP(F70,Таблица3[[#All],[Астра]:[Столбец30]],4,0),\"0\")","v":"0"},0,null,null,0,null,null,0,null,null,0,null,null,null,null,0,0,0]
["z",null,null,null,null,null,null,null,null,null,10,{"$f":"IFERROR(VLOOKUP(F71,Таблица3[[#All],[Астра]:[Столбец30]],4,0),\"0\")","v":"0"},0,null,null,0,null,null,0,null,null,0,null,null,null,null,0,0,0]
["z",null,null,null,null,null,null,null,null,null,11,{"$f":"IFERROR(VLOOKUP(F72,Таблица3[[#All],[Астра]:[Столбец30]],4,0),\"0\")","v":"0"},0,null,null,0,null,null,0,null,null,0,null,null,null,null,0,0,0]
["z",null,null,null,null,null,null,null,null,null,12,{"$f":"IFERROR(VLOOKUP(F73,Таблица3[[#All],[Астра]:[Столбец30]],4,0),\"0\")","v":"0"},0,null,null,0,null,null,0,null,null,0,null,null,null,null,0,0,0]
["z",null,null,null,null,null,null,null,null,null,13,{"$f":"IFERROR(VLOOKUP(F74,Таблица3[[#All],[Астра]:[Столбец30]],4,0),\"0\")","v":"0"},0,null,null,0,null,null,0,null,null,0,null,null,null,null,0,0,0]
["z",null,null,null,null,null,null,null,null,null,14,{"$f":"IFERROR(VLOOKUP(F75,Таблица3[[#All],[Астра]:[Столбец30]],4,0),\"0\")","v":"0"},0,null,null,0,null,null,0,null,null,0,null,null,null,null,0,0,0]
["z",null,null,null,null,null,null,null,null,null,15,{"$f":"IFERROR(VLOOKUP(F76,Таблица3[[#All],[Астра]:[Столбец30]],4,0),\"0\")","v":"0"},0,null,null,0,null,null,0,null,null,0,null,null,null,null,0,0,0]
["z",null,null,null,null,null,null,null,null,null,16,{"$f":"IFERROR(VLOOKUP(F77,Таблица3[[#All],[Астра]:[Столбец30]],4,0),\"0\")","v":"0"},0,null,null,0,null,null,0,null,null,0,null,null,null,null,0,0,0]
["z",null,null,null,null,null,null,null,null,null,17,{"$f":"IFERROR(VLOOKUP(F78,Таблица3[[#All],[Астра]:[Столбец30]],4,0),\"0\")","v":"0"},0,null,null,0,null,null,0,null,null,0,null,null,null,null,0,0,0]
["z",null,null,null,null,null,null,null,null,null,18,{"$f":"IFERROR(VLOOKUP(F79,Таблица3[[#All],[Астра]:[Столбец30]],4,0),\"0\")","v":"0"},0,null,null,0,null,null,0,null,null,0,null,null,null,null,0,0,0]
["z",null,null,null,null,null,null,null,null,null,19,{"$f":"IFERROR(VLOOKUP(F80,Таблица3[[#All],[Астра]:[Столбец30]],4,0),\"0\")","v":"0"},0,null,null,0,null,null,0,null,null,0,null,null,null,null,0,0,0]
["z",null,null,null,null,null,null,null,null,null,20,{"$f":"IFERROR(VLOOKUP(F81,Таблица3[[#All],[Астра]:[Столбец30]],4,0),\"0\")","v":"0"},0,null,null,0,null,null,0,null,null,0,null,null,null,null,0,0,0]
["z",null,null,null,null,null,null,null,null,null,21,{"$f":"IFERROR(VLOOKUP(F82,Таблица3[[#All],[Астра]:[Столбец30]],4,0),\"0\")","v":"0"},0,null,null,0,null,null,0,null,null,0,null,null,null,null,0,0,0]
["z",null,null,null,null,null,null,null,null,null,22,{"$f":"IFERROR(VLOOKUP(F83,Таблица3[[#All],[Астра]:[Столбец30]],4,0),\"0\")","v":"0"},0,null,null,0,null,null,0,null,null,0,null,null,null,null,0,0,0]
["z",null,null,null,null,null,null,null,null,null,23,{"$f":"IFERROR(VLOOKUP(F84,Таблица3[[#All],[Астра]:[Столбец30]],4,0),\"0\")","v":"0"},0,null,null,0,null,null,0,null,null,0,null,null,null,null,0,0,0]
["z",null,null,null,null,null,null,null,null,null,24,{"$f":"IFERROR(VLOOKUP(F85,Таблица3[[#All],[Астра]:[Столбец30]],4,0),\"0\")","v":"0"},0,null,null,0,null,null,0,null,null,0,null,null,null,null,0,0,0]
["z",null,null,null,null,null,null,null,null,null,25,{"$f":"IFERROR(VLOOKUP(F86,Таблица3[[#All],[Астра]:[Столбец30]],4,0),\"0\")","v":"0"},0,null,null,0,null,null,0,null,null,0,null,null,null,null,0,0,0]
["z",null,null,null,null,null,null,null,null,null,26,{"$f":"IFERROR(VLOOKUP(F87,Таблица3[[#All],[Астра]:[Столбец30]],4,0),\"0\")","v":"0"},0,null,null,0,null,null,0,null,null,0,null,null,null,null,0,0,0]
["z",null,null,null,null,null,null,null,null,null,27,{"$f":"IFERROR(VLOOKUP(F88,Таблица3[[#All],[Астра]:[Столбец30]],4,0),\"0\")","v":"0"},0,null,null,0,null,null,0,null,null,0,null,null,null,null,0,0,0]
["z",null,null,null,null,null,null,null,null,null,28,{"$f":"IFERROR(VLOOKUP(F89,Таблица3[[#All],[Астра]:[Столбец30]],4,0),\"0\")","v":"0"},0,null,null,0,null,null,0,null,null,0,null,null,null,null,0,0,0]
["z",null,null,null,null,null,null,null,null,null,29,{"$f":"IFERROR(VLOOKUP(F90,Таблица3[[#All],[Астра]:[Столбец30]],4,0),\"0\")","v":"0"},0,null,null,0,null,null,0,null,null,0,null,null,null,null,0,0,0]
["z",null,null,null,null,null,null,null,null,null,30,{"$f":"IFERROR(VLOOKUP(F91,Таблица3[[#All],[Астра]:[Столбец30]],4,0),\"0\")","v":"0"},0,null,null,0,null,null,0,null,null,0,null,null,null,null,0,0,0]
["z",null,null,null,null,null,null,null,null,null,31,{"$f":"IFERROR(VLOOKUP(F92,Таблица3[[#All],[Астра]:[Столбец30]],4,0),\"0\")","v":"0"},0,null,null,0,null,null,0,null,null,0,null,null,null,null,0,0,0]
["z",null,null,null,null,null,null,null,null,null,32,{"$f":"IFERROR(VLOOKUP(F93,Таблица3[[#All],[Астра]:[Столбец30]],4,0),\"0\")","v":"0"},0,null,null,0,null,null,0,null,null,0,null,null,null,null,0,0,0]
["z",null,null,null,null,null,null,null,null,null,33,{"$f":"IFERROR(VLOOKUP(F94,Таблица3[[#All],[Астра]:[Столбец30]],4,0),\"0\")","v":"0"},0,null,null,0,null,null,0,null,null,0,null,null,null,null,0,0,0]
["z",null,null,null,null,null,null,null,null,null,34,{"$f":"IFERROR(VLOOKUP(F95,Таблица3[[#All],[Астра]:[Столбец30]],4,0),\"0\")","v":"0"},{"$f":"C95*D95*E95*L95*G95/1000000","v":0},null,null,{"$f":"E95*H95*L95","v":0},null,null,0,null,null,{"$f":"E95*I95*L95","v":0},null,null,null,null,0,0,0]
["z",null,null,null,null,null,null,null,null,null,35,{"$f":"IFERROR(VLOOKUP(F96,Таблица3[[#All],[Астра]:[Столбец30]],4,0),\"0\")","v":"0"},0,null,null,0,null,null,0,null,null,{"$f":"E96*I96*L96","v":0},null,null,null,null,0,0,0]
["z",null,null,null,null,null,null,null,null,null,36,{"$f":"IFERROR(VLOOKUP(F97,Таблица3[[#All],[Астра]:[Столбец30]],4,0),\"0\")","v":"0"},0,null,null,0,null,null,0,null,null,0,null,null,null,null,0,0,0]
["z",null,null,null,null,null,null,null,null,null,37,{"$f":"IFERROR(VLOOKUP(F98,Таблица3[[#All],[Астра]:[Столбец30]],4,0),\"0\")","v":"0"},0,null,null,0,null,null,0,null,null,0,null,null,null,null,0,0,0]
["z",null,null,null,null,null,null,null,null,null,38,{"$f":"IFERROR(VLOOKUP(F99,Таблица3[[#All],[Астра]:[Столбец30]],4,0),\"0\")","v":"0"},0,null,null,0,null,null,0,null,null,0,null,null,null,null,0,0,0]
["z",null,null,null,null,null,null,null,null,null,39,{"$f":"IFERROR(VLOOKUP(F100,Таблица3[[#All],[Астра]:[Столбец30]],4,0),\"0\")","v":"0"},0,null,null,0,null,null,0,null,null,0,null,null,null,null,0,0,0]
["z",null,null,null,null,null,null,null,null,null,40,{"$f":"IFERROR(VLOOKUP(F101,Таблица3[[#All],[Астра]:[Столбец30]],4,0),\"0\")","v":"0"},0,null,null,0,null,null,0,null,null,0,null,null,null,null,0,0,0]
["z",null,null,null,null,null,null,null,null,null,41,{"$f":"IFERROR(VLOOKUP(F102,Таблица3[[#All],[Астра]:[Столбец30]],4,0),\"0\")","v":"0"},0,null,null,0,null,null,0,null,null,0,null,null,null,null,0,0,0]
["z",null,null,null,null,null,null,null,null,null,42,{"$f":"IFERROR(VLOOKUP(F103,Таблица3[[#All],[Астра]:[Столбец30]],4,0),\"0\")","v":"0"},0,null,null,0,null,null,0,null,null,0,null,null,null,null,0,0,0]
["z",null,null,null,null,null,null,null,null,null,43,{"$f":"IFERROR(VLOOKUP(F104,Таблица3[[#All],[Астра]:[Столбец30]],4,0),\"0\")","v":"0"},0,null,null,0,null,null,0,null,null,0,null,null,null,null,0,0,0]
["z",null,null,null,null,null,null,null,null,null,44,{"$f":"IFERROR(VLOOKUP(F105,Таблица3[[#All],[Астра]:[Столбец30]],4,0),\"0\")","v":"0"},0,null,null,0,null,null,0,null,null,0,null,null,null,null,0,0,0]
["z",null,null,null,null,null,null,null,null,null,45,{"$f":"IFERROR(VLOOKUP(F106,Таблица3[[#All],[Астра]:[Столбец30]],4,0),\"0\")","v":"0"},0,null,null,0,null,null,0,null,null,0,null,null,null,null,0,0,0]
["z",null,null,null,null,null,null,null,null,null,46,{"$f":"IFERROR(VLOOKUP(F107,Таблица3[[#All],[Астра]:[Столбец30]],4,0),\"0\")","v":"0"},0,null,null,0,null,null,0,null,null,0,null,null,null,null,0,0,0]
["z",null,null,null,null,null,null,null,null,null,47,{"$f":"IFERROR(VLOOKUP(F108,Таблица3[[#All],[Астра]:[Столбец30]],4,0),\"0\")","v":"0"},0,null,null,0,null,null,0,null,null,0,null,null,null,null,0,0,0]
["z",null,null,null,null,null,null,null,null,null,48,{"$f":"IFERROR(VLOOKUP(F109,Таблица3[[#All],[Астра]:[Столбец30]],4,0),\"0\")","v":"0"},0,null,null,0,null,null,0,null,null,0,null,null,null,null,0,0,0]
["z",null,null,null,null,null,null,null,null,null,49,{"$f":"IFERROR(VLOOKUP(F110,Таблица3[[#All],[Астра]:[Столбец30]],4,0),\"0\")","v":"0"},0,null,null,0,null,null,0,null,null,0,null,null,null,null,0,0,0]
["z",null,null,null,null,null,null,null,null,null,50,{"$f":"IFERROR(VLOOKUP(F111,Таблица3[[#All],[Астра]:[Столбец30]],4,0),\"0\")","v":"0"},0,null,null,0,null,null,0,null,null,0,null,null,null,null,0,0,0]
["z",null,null,null,null,null,null,null,null,null,51,{"$f":"IFERROR(VLOOKUP(F112,Таблица3[[#All],[Астра]:[Столбец30]],4,0),\"0\")","v":"0"},0,null,null,0,null,null,0,null,null,0,null,null,null,null,0,0,0]
["z",null,null,null,null,null,null,null,null,null,52,{"$f":"IFERROR(VLOOKUP(F113,Таблица3[[#All],[Астра]:[Столбец30]],4,0),\"0\")","v":"0"},0,null,null,0,null,null,0,null,null,0,null,null,null,null,0,0,0]
["z",null,null,null,null,null,null,null,null,null,53,{"$f":"IFERROR(VLOOKUP(F114,Таблица3[[#All],[Астра]:[Столбец30]],4,0),\"0\")","v":"0"},0,null,null,0,null,null,0,null,null,0,null,null,null,null,0,0,0]
["z",null,null,null,null,null,null,null,null,null,54,{"$f":"IFERROR(VLOOKUP(F115,Таблица3[[#All],[Астра]:[Столбец30]],4,0),\"0\")","v":"0"},0,null,null,0,null,null,0,null,null,0,null,null,null,null,0,0,0]
[{"$f":"IF(G116=0,\"z\",\"\")","v":"z"},null,null,null,null,null,null,null,null,null,55,{"$f":"IFERROR(VLOOKUP(F116,Таблица3[[#All],[Астра]:[Столбец30]],4,0),\"0\")","v":"0"},0,null,null,0,null,null,0,null,null,0,null,null,null,null,0,0,0]
[null,"Данные раскроя АСТРА (без уточнения масс)",null,null,null,null,null,null,null,null,null,null,{"$f":"SUM(M62:M116)","v":447.33882185599998},null,null,{"$f":"SUM(P62:P116)","v":140.67236261845829},null,null,{"$f":"SUM(S62:S116)","v":6.2152745804448246},null,null,{"$f":"SUM(V62:V116)","v":300.45118465709686},null,null,null,null,{"$f":"SUM(AA62:AA116)","v":306.66645923754174},{"$f":"SUM(AB62:AB116)","v":6.2152745804448246}]
[]
[null,null,null,null,null,null,null,null,null,null,null,null,null,null,null,"Угар суммарный в составе лома в колличестве, кг",null,null,null,null,null,{"$f":"W6","v":43.210102137851912}]
[null,null,"Стандартный р-р",null,null,null,null,null,null,null,null,null,"Получить со склада",null,null,"Остаток на склад",null,null,"ЛОМ",null,null,"Точная \nмасса\nЛОМА\nкг","Детали",null,null,"Точная \nмасса\nдеталей\nкг"]
[null,"№ п/п","Ширина\nмм","Длина\nмм","Толщина\nмм",null,"Целых \nлистов",null,"Название",null,null,null,"Масса \nцелых\nкг","Масса\nделовых\nкг","Общая\nкг","Деловой остаток с целых\nкг","Деловой остаок с деловых\nкг","Общая\nкг","Лом \nцелых\nкг","Лом деловых\nкг","Общая\nкг",null,"Масса деталей целых\nкг","Масса деталей деловых\nкг","Общая\nкг",null,null,"АСТРА","Для ДАНО\nАСТРА","название\nлиста\nдля Д","коэф",null,"разница \nмассы\nкг"]
["z"]
["z","Столбец2","Шир","Дл","Толщ","Ст6","Ст7","Ст8","Столбец9","Столбец22","Столбец222","Столбец23","Ст10","Ст11","Ст12","Ст13","Ст14","Ст15","Ст16","Ст17","Ст18","Столбец24","Ст19","Ст20","Ст21","Столбец25","Столбец26","Астра","Столбец28","Столбец29","Столбец30","точка","Столбец32","Столбец33","Столбец34"]
[{"$f":"IF(Таблица3[[#All],[Ст21]]=0,\"z\",\"\")","v":"z"},null,1250,2500,0.6,null,{"$f":"SUMIFS($G$62:$G$116,$D$62:$D$116,Таблица3[[#This Row],[Дл]],$C$62:$C$116,Таблица3[[#This Row],[Шир]],$AC$62:$AC$116,Таблица3[[#This Row],[Толщ]],$F$62:$F$116,Таблица3[[#This Row],[Астра]])","v":0},null,{"$f":"CONCATENATE(Таблица3[[#This Row],[Столбец29]],\" \",Таблица3[[#This Row],[Толщ]])","v":"Лист 0,6"},null,{"$f":"Таблица3[[#This Row],[Толщ]]","v":0.6},null,{"$f":"SUMIFS($M$62:$M$116,$C$62:$C$116,Таблица3[[#This Row],[Шир]],$D$62:$D$116,Таблица3[[#This Row],[Дл]],$AC$62:$AC$116,Таблица3[[#This Row],[Толщ]],$F$62:$F$116,Таблица3[[#This Row],[Астра]])","v":0},{"$f":"SUMIFS($M$62:$M$116,$AC$62:$AC$116,Таблица3[[#This Row],[Толщ]],$C$62:$C$116,\"<\"&Таблица3[[#This Row],[Шир]],$D$62:$D$116,Таблица3[[#This Row],[Дл]],$F$62:$F$116,Таблица3[[#This Row],[Астра]])+SUMIFS($M$62:$M$116,$AC$62:$AC$116,Таблица3[[#This Row],[Толщ]],$C$62:$C$116,Таблица3[[#This Row],[Шир]],$D$62:$D$116,\"<\"&Таблица3[[#This Row],[Дл]],$F$62:$F$116,Таблица3[[#This Row],[Астра]])+SUMIFS($M$62:$M$116,$AC$62:$AC$116,Таблица3[[#This Row],[Толщ]],$C$62:$C$116,\"<\"&Таблица3[[#This Row],[Шир]],$D$62:$D$116,\"<\"&Таблица3[[#This Row],[Дл]],$F$62:$F$116,Таблица3[[#This Row],[Астра]])","v":0},{"$f":"Таблица3[[#This Row],[Ст10]]+Таблица3[[#This Row],[Ст11]]","v":0},{"$f":"SUMIFS($P$62:$P$116,$C$62:$C$116,Таблица3[[#This Row],[Шир]],$D$62:$D$116,Таблица3[[#This Row],[Дл]],$AC$62:$AC$116,Таблица3[[#This Row],[Толщ]],$F$62:$F$116,Таблица3[[#This Row],[Астра]])","v":0},{"$f":"SUMIFS($P$62:$P$116,$AC$62:$AC$116,Таблица3[[#This Row],[Толщ]],$C$62:$C$116,\"<\"&Таблица3[[#This Row],[Шир]],$D$62:$D$116,Таблица3[[#This Row],[Дл]],$F$62:$F$116,Таблица3[[#This Row],[Астра]])+SUMIFS($P$62:$P$116,$AC$62:$AC$116,Таблица3[[#This Row],[Толщ]],$C$62:$C$116,Таблица3[[#This Row],[Шир]],$D$62:$D$116,\"<\"&Таблица3[[#This Row],[Дл]],$F$62:$F$116,Таблица3[[#This Row],[Астра]])+SUMIFS($P$62:$P$116,$AC$62:$AC$116,Таблица3[[#This Row],[Толщ]],$C$62:$C$116,\"<\"&Таблица3[[#This Row],[Шир]],$D$62:$D$116,\"<\"&Таблица3[[#This Row],[Дл]],$F$62:$F$116,Таблица3[[#This Row],[Астра]])","v":0},{"$f":"Таблица3[[#This Row],[Ст13]]+Таблица3[[#This Row],[Ст14]]","v":0},{"$f":"SUMIFS($S$62:$S$116,$C$62:$C$116,Таблица3[[#This Row],[Шир]],$D$62:$D$116,Таблица3[[#This Row],[Дл]],$AC$62:$AC$116,Таблица3[[#This Row],[Толщ]],$F$62:$F$116,Таблица3[[#This Row],[Астра]])","v":0},{"$f":"SUMIFS($S$62:$S$116,$AC$62:$AC$116,Таблица3[[#This Row],[Толщ]],$C$62:$C$116,\"<\"&Таблица3[[#This Row],[Шир]],$D$62:$D$116,Таблица3[[#This Row],[Дл]],$F$62:$F$116,Таблица3[[#This Row],[Астра]])+SUMIFS($S$62:$S$116,$AC$62:$AC$116,Таблица3[[#This Row],[Толщ]],$C$62:$C$116,Таблица3[[#This Row],[Шир]],$D$62:$D$116,\"<\"&Таблица3[[#This Row],[Дл]],$F$62:$F$116,Таблица3[[#This Row],[Астра]])+SUMIFS($S$62:$S$116,$AC$62:$AC$116,Таблица3[[#This Row],[Толщ]],$C$62:$C$116,\"<\"&Таблица3[[#This Row],[Шир]],$D$62:$D$116,\"<\"&Таблица3[[#This Row],[Дл]],$F$62:$F$116,Таблица3[[#This Row],[Астра]])","v":0},{"$f":"Таблица3[[#This Row],[Ст16]]+Таблица3[[#This Row],[Ст17]]","v":0},{"$f":"Таблица3[[#This Row],[Ст18]]+Таблица3[[#This Row],[Столбец32]]","v":0},{"$f":"SUMIFS($V$62:$V$116,$C$62:$C$116,Таблица3[[#This Row],[Шир]],$D$62:$D$116,Таблица3[[#This Row],[Дл]],$AC$62:$AC$116,Таблица3[[#This Row],[Толщ]],$F$62:$F$116,Таблица3[[#This Row],[Астра]])","v":0},{"$f":"SUMIFS($V$62:$V$116,$AC$62:$AC$116,Таблица3[[#This Row],[Толщ]],$C$62:$C$116,\"<\"&Таблица3[[#This Row],[Шир]],$D$62:$D$116,Таблица3[[#This Row],[Дл]],$F$62:$F$116,Таблица3[[#This Row],[Астра]])+SUMIFS($V$62:$V$116,$AC$62:$AC$116,Таблица3[[#This Row],[Толщ]],$C$62:$C$116,Таблица3[[#This Row],[Шир]],$D$62:$D$116,\"<\"&Таблица3[[#This Row],[Дл]],$F$62:$F$116,Таблица3[[#This Row],[Астра]])+SUMIFS($V$62:$V$116,$AC$62:$AC$116,Таблица3[[#This Row],[Толщ]],$C$62:$C$116,\"<\"&Таблица3[[#This Row],[Шир]],$D$62:$D$116,\"<\"&Таблица3[[#This Row],[Дл]],$F$62:$F$116,Таблица3[[#This Row],[Астра]])","v":0},{"$f":"Таблица3[[#This Row],[Ст19]]+Таблица3[[#This Row],[Ст20]]","v":0},{"$f":"Таблица3[[#This Row],[Ст21]]-Таблица3[[#This Row],[Столбец32]]","v":0},null,"Лист лазер, 0.6 мм, лт","Лист лазер","Лист",7.8739999999999997,{"$f":"SUBSTITUTE(Таблица3[[#This Row],[Толщ]],\",\",\".\")","v":"0.6"},{"$f":"SUMIFS($AA$8:$AA$57,$H$8:$H$57,Таблица3[[#This Row],[Столбец28]],$G$8:$G$57,Таблица3[[#This Row],[Толщ]])","v":0}]
[{"$f":"IF(Таблица3[[#All],[Ст21]]=0,\"z\",\"\")","v":"z"},null,1250,2500,0.7,null,{"$f":"SUMIFS($G$62:$G$116,$D$62:$D$116,Таблица3[[#This Row],[Дл]],$C$62:$C$116,Таблица3[[#This Row],[Шир]],$AC$62:$AC$116,Таблица3[[#This Row],[Толщ]],$F$62:$F$116,Таблица3[[#This Row],[Астра]])","v":0},null,{"$f":"CONCATENATE(Таблица3[[#This Row],[Столбец29]],\" \",Таблица3[[#This Row],[Толщ]])","v":"Лист 0,7"},null,{"$f":"Таблица3[[#This Row],[Толщ]]","v":0.7},null,{"$f":"SUMIFS($M$62:$M$116,$C$62:$C$116,Таблица3[[#This Row],[Шир]],$D$62:$D$116,Таблица3[[#This Row],[Дл]],$AC$62:$AC$116,Таблица3[[#This Row],[Толщ]],$F$62:$F$116,Таблица3[[#This Row],[Астра]])","v":0},{"$f":"SUMIFS($M$62:$M$116,$AC$62:$AC$116,Таблица3[[#This Row],[Толщ]],$C$62:$C$116,\"<\"&Таблица3[[#This Row],[Шир]],$D$62:$D$116,Таблица3[[#This Row],[Дл]],$F$62:$F$116,Таблица3[[#This Row],[Астра]])+SUMIFS($M$62:$M$116,$AC$62:$AC$116,Таблица3[[#This Row],[Толщ]],$C$62:$C$116,Таблица3[[#This Row],[Шир]],$D$62:$D$116,\"<\"&Таблица3[[#This Row],[Дл]],$F$62:$F$116,Таблица3[[#This Row],[Астра]])+SUMIFS($M$62:$M$116,$AC$62:$AC$116,Таблица3[[#This Row],[Толщ]],$C$62:$C$116,\"<\"&Таблица3[[#This Row],[Шир]],$D$62:$D$116,\"<\"&Таблица3[[#This Row],[Дл]],$F$62:$F$116,Таблица3[[#This Row],[Астра]])","v":0},{"$f":"Таблица3[[#This Row],[Ст10]]+Таблица3[[#This Row],[Ст11]]","v":0},{"$f":"SUMIFS($P$62:$P$116,$C$62:$C$116,Таблица3[[#This Row],[Шир]],$D$62:$D$116,Таблица3[[#This Row],[Дл]],$AC$62:$AC$116,Таблица3[[#This Row],[Толщ]],$F$62:$F$116,Таблица3[[#This Row],[Астра]])","v":0},{"$f":"SUMIFS($P$62:$P$116,$AC$62:$AC$116,Таблица3[[#This Row],[Толщ]],$C$62:$C$116,\"<\"&Таблица3[[#This Row],[Шир]],$D$62:$D$116,Таблица3[[#This Row],[Дл]],$F$62:$F$116,Таблица3[[#This Row],[Астра]])+SUMIFS($P$62:$P$116,$AC$62:$AC$116,Таблица3[[#This Row],[Толщ]],$C$62:$C$116,Таблица3[[#This Row],[Шир]],$D$62:$D$116,\"<\"&Таблица3[[#This Row],[Дл]],$F$62:$F$116,Таблица3[[#This Row],[Астра]])+SUMIFS($P$62:$P$116,$AC$62:$AC$116,Таблица3[[#This Row],[Толщ]],$C$62:$C$116,\"<\"&Таблица3[[#This Row],[Шир]],$D$62:$D$116,\"<\"&Таблица3[[#This Row],[Дл]],$F$62:$F$116,Таблица3[[#This Row],[Астра]])","v":0},{"$f":"Таблица3[[#This Row],[Ст13]]+Таблица3[[#This Row],[Ст14]]","v":0},{"$f":"SUMIFS($S$62:$S$116,$C$62:$C$116,Таблица3[[#This Row],[Шир]],$D$62:$D$116,Таблица3[[#This Row],[Дл]],$AC$62:$AC$116,Таблица3[[#This Row],[Толщ]],$F$62:$F$116,Таблица3[[#This Row],[Астра]])","v":0},{"$f":"SUMIFS($S$62:$S$116,$AC$62:$AC$116,Таблица3[[#This Row],[Толщ]],$C$62:$C$116,\"<\"&Таблица3[[#This Row],[Шир]],$D$62:$D$116,Таблица3[[#This Row],[Дл]],$F$62:$F$116,Таблица3[[#This Row],[Астра]])+SUMIFS($S$62:$S$116,$AC$62:$AC$116,Таблица3[[#This Row],[Толщ]],$C$62:$C$116,Таблица3[[#This Row],[Шир]],$D$62:$D$116,\"<\"&Таблица3[[#This Row],[Дл]],$F$62:$F$116,Таблица3[[#This Row],[Астра]])+SUMIFS($S$62:$S$116,$AC$62:$AC$116,Таблица3[[#This Row],[Толщ]],$C$62:$C$116,\"<\"&Таблица3[[#This Row],[Шир]],$D$62:$D$116,\"<\"&Таблица3[[#This Row],[Дл]],$F$62:$F$116,Таблица3[[#This Row],[Астра]])","v":0},{"$f":"Таблица3[[#This Row],[Ст16]]+Таблица3[[#This Row],[Ст17]]","v":0},{"$f":"Таблица3[[#This Row],[Ст18]]+Таблица3[[#This Row],[Столбец32]]","v":0},{"$f":"SUMIFS($V$62:$V$116,$C$62:$C$116,Таблица3[[#This Row],[Шир]],$D$62:$D$116,Таблица3[[#This Row],[Дл]],$AC$62:$AC$116,Таблица3[[#This Row],[Толщ]],$F$62:$F$116,Таблица3[[#This Row],[Астра]])","v":0},{"$f":"SUMIFS($V$62:$V$116,$AC$62:$AC$116,Таблица3[[#This Row],[Толщ]],$C$62:$C$116,\"<\"&Таблица3[[#This Row],[Шир]],$D$62:$D$116,Таблица3[[#This Row],[Дл]],$F$62:$F$116,Таблица3[[#This Row],[Астра]])+SUMIFS($V$62:$V$116,$AC$62:$AC$116,Таблица3[[#This Row],[Толщ]],$C$62:$C$116,Таблица3[[#This Row],[Шир]],$D$62:$D$116,\"<\"&Таблица3[[#This Row],[Дл]],$F$62:$F$116,Таблица3[[#This Row],[Астра]])+SUMIFS($V$62:$V$116,$AC$62:$AC$116,Таблица3[[#This Row],[Толщ]],$C$62:$C$116,\"<\"&Таблица3[[#This Row],[Шир]],$D$62:$D$116,\"<\"&Таблица3[[#This Row],[Дл]],$F$62:$F$116,Таблица3[[#This Row],[Астра]])","v":0},{"$f":"Таблица3[[#This Row],[Ст19]]+Таблица3[[#This Row],[Ст20]]","v":0},{"$f":"Таблица3[[#This Row],[Ст21]]-Таблица3[[#This Row],[Столбец32]]","v":0},null,"Лист лазер, 0.7 мм, лт","Лист лазер","Лист",7.8739999999999997,{"$f":"SUBSTITUTE(Таблица3[[#This Row],[Толщ]],\",\",\".\")","v":"0.7"},{"$f":"SUMIFS($AA$8:$AA$57,$H$8:$H$57,Таблица3[[#This Row],[Столбец28]],$G$8:$G$57,Таблица3[[#This Row],[Толщ]])","v":0}]
[{"$f":"IF(Таблица3[[#All],[Ст21]]=0,\"z\",\"\")","v":""},null,1250,2500,0.8,null,{"$f":"SUMIFS($G$62:$G$116,$D$62:$D$116,Таблица3[[#This Row],[Дл]],$C$62:$C$116,Таблица3[[#This Row],[Шир]],$AC$62:$AC$116,Таблица3[[#This Row],[Толщ]],$F$62:$F$116,Таблица3[[#This Row],[Астра]])","v":20},null,{"$f":"CONCATENATE(Таблица3[[#This Row],[Столбец29]],\" \",Таблица3[[#This Row],[Толщ]])","v":"Лист 0,8"},null,{"$f":"Таблица3[[#This Row],[Толщ]]","v":0.8},null,{"$f":"SUMIFS($M$62:$M$116,$C$62:$C$116,Таблица3[[#This Row],[Шир]],$D$62:$D$116,Таблица3[[#This Row],[Дл]],$AC$62:$AC$116,Таблица3[[#This Row],[Толщ]],$F$62:$F$116,Таблица3[[#This Row],[Астра]])","v":393.7},{"$f":"SUMIFS($M$62:$M$116,$AC$62:$AC$116,Таблица3[[#This Row],[Толщ]],$C$62:$C$116,\"<\"&Таблица3[[#This Row],[Шир]],$D$62:$D$116,Таблица3[[#This Row],[Дл]],$F$62:$F$116,Таблица3[[#This Row],[Астра]])+SUMIFS($M$62:$M$116,$AC$62:$AC$116,Таблица3[[#This Row],[Толщ]],$C$62:$C$116,Таблица3[[#This Row],[Шир]],$D$62:$D$116,\"<\"&Таблица3[[#This Row],[Дл]],$F$62:$F$116,Таблица3[[#This Row],[Астра]])+SUMIFS($M$62:$M$116,$AC$62:$AC$116,Таблица3[[#This Row],[Толщ]],$C$62:$C$116,\"<\"&Таблица3[[#This Row],[Шир]],$D$62:$D$116,\"<\"&Таблица3[[#This Row],[Дл]],$F$62:$F$116,Таблица3[[#This Row],[Астра]])","v":53.638821855999993},{"$f":"Таблица3[[#This Row],[Ст10]]+Таблица3[[#This Row],[Ст11]]","v":447.33882185599998},{"$f":"SUMIFS($P$62:$P$116,$C$62:$C$116,Таблица3[[#This Row],[Шир]],$D$62:$D$116,Таблица3[[#This Row],[Дл]],$AC$62:$AC$116,Таблица3[[#This Row],[Толщ]],$F$62:$F$116,Таблица3[[#This Row],[Астра]])","v":139.01222109341623},{"$f":"SUMIFS($P$62:$P$116,$AC$62:$AC$116,Таблица3[[#This Row],[Толщ]],$C$62:$C$116,\"<\"&Таблица3[[#This Row],[Шир]],$D$62:$D$116,Таблица3[[#This Row],[Дл]],$F$62:$F$116,Таблица3[[#This Row],[Астра]])+SUMIFS($P$62:$P$116,$AC$62:$AC$116,Таблица3[[#This Row],[Толщ]],$C$62:$C$116,Таблица3[[#This Row],[Шир]],$D$62:$D$116,\"<\"&Таблица3[[#This Row],[Дл]],$F$62:$F$116,Таблица3[[#This Row],[Астра]])+SUMIFS($P$62:$P$116,$AC$62:$AC$116,Таблица3[[#This Row],[Толщ]],$C$62:$C$116,\"<\"&Таблица3[[#This Row],[Шир]],$D$62:$D$116,\"<\"&Таблица3[[#This Row],[Дл]],$F$62:$F$116,Таблица3[[#This Row],[Астра]])","v":1.660141525042057},{"$f":"Таблица3[[#This Row],[Ст13]]+Таблица3[[#This Row],[Ст14]]","v":140.67236261845829},{"$f":"SUMIFS($S$62:$S$116,$C$62:$C$116,Таблица3[[#This Row],[Шир]],$D$62:$D$116,Таблица3[[#This Row],[Дл]],$AC$62:$AC$116,Таблица3[[#This Row],[Толщ]],$F$62:$F$116,Таблица3[[#This Row],[Астра]])","v":3.6797695830821571},{"$f":"SUMIFS($S$62:$S$116,$AC$62:$AC$116,Таблица3[[#This Row],[Толщ]],$C$62:$C$116,\"<\"&Таблица3[[#This Row],[Шир]],$D$62:$D$116,Таблица3[[#This Row],[Дл]],$F$62:$F$116,Таблица3[[#This Row],[Астра]])+SUMIFS($S$62:$S$116,$AC$62:$AC$116,Таблица3[[#This Row],[Толщ]],$C$62:$C$116,Таблица3[[#This Row],[Шир]],$D$62:$D$116,\"<\"&Таблица3[[#This Row],[Дл]],$F$62:$F$116,Таблица3[[#This Row],[Астра]])+SUMIFS($S$62:$S$116,$AC$62:$AC$116,Таблица3[[#This Row],[Толщ]],$C$62:$C$116,\"<\"&Таблица3[[#This Row],[Шир]],$D$62:$D$116,\"<\"&Таблица3[[#This Row],[Дл]],$F$62:$F$116,Таблица3[[#This Row],[Астра]])","v":2.5355049973626675},{"$f":"Таблица3[[#This Row],[Ст16]]+Таблица3[[#This Row],[Ст17]]","v":6.2152745804448246},{"$f":"Таблица3[[#This Row],[Ст18]]+Таблица3[[#This Row],[Столбец32]]","v":6.2152745804448246},{"$f":"SUMIFS($V$62:$V$116,$C$62:$C$116,Таблица3[[#This Row],[Шир]],$D$62:$D$116,Таблица3[[#This Row],[Дл]],$AC$62:$AC$116,Таблица3[[#This Row],[Толщ]],$F$62:$F$116,Таблица3[[#This Row],[Астра]])","v":251.0080093235016},{"$f":"SUMIFS($V$62:$V$116,$AC$62:$AC$116,Таблица3[[#This Row],[Толщ]],$C$62:$C$116,\"<\"&Таблица3[[#This Row],[Шир]],$D$62:$D$116,Таблица3[[#This Row],[Дл]],$F$62:$F$116,Таблица3[[#This Row],[Астра]])+SUMIFS($V$62:$V$116,$AC$62:$AC$116,Таблица3[[#This Row],[Толщ]],$C$62:$C$116,Таблица3[[#This Row],[Шир]],$D$62:$D$116,\"<\"&Таблица3[[#This Row],[Дл]],$F$62:$F$116,Таблица3[[#This Row],[Астра]])+SUMIFS($V$62:$V$116,$AC$62:$AC$116,Таблица3[[#This Row],[Толщ]],$C$62:$C$116,\"<\"&Таблица3[[#This Row],[Шир]],$D$62:$D$116,\"<\"&Таблица3[[#This Row],[Дл]],$F$62:$F$116,Таблица3[[#This Row],[Астра]])","v":49.443175333595271},{"$f":"Таблица3[[#This Row],[Ст19]]+Таблица3[[#This Row],[Ст20]]","v":300.45118465709686},{"$f":"Таблица3[[#This Row],[Ст21]]-Таблица3[[#This Row],[Столбец32]]","v":300.45118465709686},null,"Лист лазер, 0.8 мм, лт","Лист лазер","Лист",7.8739999999999997,{"$f":"SUBSTITUTE(Таблица3[[#This Row],[Толщ]],\",\",\".\")","v":"0.8"},{"$f":"SUMIFS($AA$8:$AA$57,$H$8:$H$57,Таблица3[[#This Row],[Столбец28]],$G$8:$G$57,Таблица3[[#This Row],[Толщ]])","v":0}]
[{"$f":"IF(Таблица3[[#All],[Ст21]]=0,\"z\",\"\")","v":"z"},null,1250,2500,1,null,{"$f":"SUMIFS($G$62:$G$116,$D$62:$D$116,Таблица3[[#This Row],[Дл]],$C$62:$C$116,Таблица3[[#This Row],[Шир]],$AC$62:$AC$116,Таблица3[[#This Row],[Толщ]],$F$62:$F$116,Таблица3[[#This Row],[Астра]])","v":0},null,{"$f":"CONCATENATE(Таблица3[[#This Row],[Столбец29]],\" \",Таблица3[[#This Row],[Толщ]])","v":"Лист 1"},null,{"$f":"Таблица3[[#This Row],[Толщ]]","v":1},null,{"$f":"SUMIFS($M$62:$M$116,$C$62:$C$116,Таблица3[[#This Row],[Шир]],$D$62:$D$116,Таблица3[[#This Row],[Дл]],$AC$62:$AC$116,Таблица3[[#This Row],[Толщ]],$F$62:$F$116,Таблица3[[#This Row],[Астра]])","v":0},{"$f":"SUMIFS($M$62:$M$116,$AC$62:$AC$116,Таблица3[[#This Row],[Толщ]],$C$62:$C$116,\"<\"&Таблица3[[#This Row],[Шир]],$D$62:$D$116,Таблица3[[#This Row],[Дл]],$F$62:$F$116,Таблица3[[#This Row],[Астра]])+SUMIFS($M$62:$M$116,$AC$62:$AC$116,Таблица3[[#This Row],[Толщ]],$C$62:$C$116,Таблица3[[#This Row],[Шир]],$D$62:$D$116,\"<\"&Таблица3[[#This Row],[Дл]],$F$62:$F$116,Таблица3[[#This Row],[Астра]])+SUMIFS($M$62:$M$116,$AC$62:$AC$116,Таблица3[[#This Row],[Толщ]],$C$62:$C$116,\"<\"&Таблица3[[#This Row],[Шир]],$D$62:$D$116,\"<\"&Таблица3[[#This Row],[Дл]],$F$62:$F$116,Таблица3[[#This Row],[Астра]])","v":0},{"$f":"Таблица3[[#This Row],[Ст10]]+Таблица3[[#This Row],[Ст11]]","v":0},{"$f":"SUMIFS($P$62:$P$116,$C$62:$C$116,Таблица3[[#This Row],[Шир]],$D$62:$D$116,Таблица3[[#This Row],[Дл]],$AC$62:$AC$116,Таблица3[[#This Row],[Толщ]],$F$62:$F$116,Таблица3[[#This Row],[Астра]])","v":0},{"$f":"SUMIFS($P$62:$P$116,$AC$62:$AC$116,Таблица3[[#This Row],[Толщ]],$C$62:$C$116,\"<\"&Таблица3[[#This Row],[Шир]],$D$62:$D$116,Таблица3[[#This Row],[Дл]],$F$62:$F$116,Таблица3[[#This Row],[Астра]])+SUMIFS($P$62:$P$116,$AC$62:$AC$116,Таблица3[[#This Row],[Толщ]],$C$62:$C$116,Таблица3[[#This Row],[Шир]],$D$62:$D$116,\"<\"&Таблица3[[#This Row],[Дл]],$F$62:$F$116,Таблица3[[#This Row],[Астра]])+SUMIFS($P$62:$P$116,$AC$62:$AC$116,Таблица3[[#This Row],[Толщ]],$C$62:$C$116,\"<\"&Таблица3[[#This Row],[Шир]],$D$62:$D$116,\"<\"&Таблица3[[#This Row],[Дл]],$F$62:$F$116,Таблица3[[#This Row],[Астра]])","v":0},{"$f":"Таблица3[[#This Row],[Ст13]]+Таблица3[[#This Row],[Ст14]]","v":0},{"$f":"SUMIFS($S$62:$S$116,$C$62:$C$116,Таблица3[[#This Row],[Шир]],$D$62:$D$116,Таблица3[[#This Row],[Дл]],$AC$62:$AC$116,Таблица3[[#This Row],[Толщ]],$F$62:$F$116,Таблица3[[#This Row],[Астра]])","v":0},{"$f":"SUMIFS($S$62:$S$116,$AC$62:$AC$116,Таблица3[[#This Row],[Толщ]],$C$62:$C$116,\"<\"&Таблица3[[#This Row],[Шир]],$D$62:$D$116,Таблица3[[#This Row],[Дл]],$F$62:$F$116,Таблица3[[#This Row],[Астра]])+SUMIFS($S$62:$S$116,$AC$62:$AC$116,Таблица3[[#This Row],[Толщ]],$C$62:$C$116,Таблица3[[#This Row],[Шир]],$D$62:$D$116,\"<\"&Таблица3[[#This Row],[Дл]],$F$62:$F$116,Таблица3[[#This Row],[Астра]])+SUMIFS($S$62:$S$116,$AC$62:$AC$116,Таблица3[[#This Row],[Толщ]],$C$62:$C$116,\"<\"&Таблица3[[#This Row],[Шир]],$D$62:$D$116,\"<\"&Таблица3[[#This Row],[Дл]],$F$62:$F$116,Таблица3[[#This Row],[Астра]])","v":0},{"$f":"Таблица3[[#This Row],[Ст16]]+Таблица3[[#This Row],[Ст17]]","v":0},{"$f":"Таблица3[[#This Row],[Ст18]]+Таблица3[[#This Row],[Столбец32]]","v":0},{"$f":"SUMIFS($V$62:$V$116,$C$62:$C$116,Таблица3[[#This Row],[Шир]],$D$62:$D$116,Таблица3[[#This Row],[Дл]],$AC$62:$AC$116,Таблица3[[#This Row],[Толщ]],$F$62:$F$116,Таблица3[[#This Row],[Астра]])","v":0},{"$f":"SUMIFS($V$62:$V$116,$AC$62:$AC$116,Таблица3[[#This Row],[Толщ]],$C$62:$C$116,\"<\"&Таблица3[[#This Row],[Шир]],$D$62:$D$116,Таблица3[[#This Row],[Дл]],$F$62:$F$116,Таблица3[[#This Row],[Астра]])+SUMIFS($V$62:$V$116,$AC$62:$AC$116,Таблица3[[#This Row],[Толщ]],$C$62:$C$116,Таблица3[[#This Row],[Шир]],$D$62:$D$116,\"<\"&Таблица3[[#This Row],[Дл]],$F$62:$F$116,Таблица3[[#This Row],[Астра]])+SUMIFS($V$62:$V$116,$AC$62:$AC$116,Таблица3[[#This Row],[Толщ]],$C$62:$C$116,\"<\"&Таблица3[[#This Row],[Шир]],$D$62:$D$116,\"<\"&Таблица3[[#This Row],[Дл]],$F$62:$F$116,Таблица3[[#This Row],[Астра]])","v":0},{"$f":"Таблица3[[#This Row],[Ст19]]+Таблица3[[#This Row],[Ст20]]","v":0},{"$f":"Таблица3[[#This Row],[Ст21]]-Таблица3[[#This Row],[Столбец32]]","v":0},null,"Лист лазер, 1.0 мм, лт","Лист лазер","Лист",7.8739999999999997,{"$f":"SUBSTITUTE(Таблица3[[#This Row],[Толщ]],\",\",\".\")","v":"1"},{"$f":"SUMIFS($AA$8:$AA$57,$H$8:$H$57,Таблица3[[#This Row],[Столбец28]],$G$8:$G$57,Таблица3[[#This Row],[Толщ]])","v":0}]
[{"$f":"IF(Таблица3[[#All],[Ст21]]=0,\"z\",\"\")","v":"z"},null,1250,2500,1.2,null,{"$f":"SUMIFS($G$62:$G$116,$D$62:$D$116,Таблица3[[#This Row],[Дл]],$C$62:$C$116,Таблица3[[#This Row],[Шир]],$AC$62:$AC$116,Таблица3[[#This Row],[Толщ]],$F$62:$F$116,Таблица3[[#This Row],[Астра]])","v":0},null,{"$f":"CONCATENATE(Таблица3[[#This Row],[Столбец29]],\" \",Таблица3[[#This Row],[Толщ]])","v":"Лист 1,2"},null,{"$f":"Таблица3[[#This Row],[Толщ]]","v":1.2},null,{"$f":"SUMIFS($M$62:$M$116,$C$62:$C$116,Таблица3[[#This Row],[Шир]],$D$62:$D$116,Таблица3[[#This Row],[Дл]],$AC$62:$AC$116,Таблица3[[#This Row],[Толщ]],$F$62:$F$116,Таблица3[[#This Row],[Астра]])","v":0},{"$f":"SUMIFS($M$62:$M$116,$AC$62:$AC$116,Таблица3[[#This Row],[Толщ]],$C$62:$C$116,\"<\"&Таблица3[[#This Row],[Шир]],$D$62:$D$116,Таблица3[[#This Row],[Дл]],$F$62:$F$116,Таблица3[[#This Row],[Астра]])+SUMIFS($M$62:$M$116,$AC$62:$AC$116,Таблица3[[#This Row],[Толщ]],$C$62:$C$116,Таблица3[[#This Row],[Шир]],$D$62:$D$116,\"<\"&Таблица3[[#This Row],[Дл]],$F$62:$F$116,Таблица3[[#This Row],[Астра]])+SUMIFS($M$62:$M$116,$AC$62:$AC$116,Таблица3[[#This Row],[Толщ]],$C$62:$C$116,\"<\"&Таблица3[[#This Row],[Шир]],$D$62:$D$116,\"<\"&Таблица3[[#This Row],[Дл]],$F$62:$F$116,Таблица3[[#This Row],[Астра]])","v":0},{"$f":"Таблица3[[#This Row],[Ст10]]+Таблица3[[#This Row],[Ст11]]","v":0},{"$f":"SUMIFS($P$62:$P$116,$C$62:$C$116,Таблица3[[#This Row],[Шир]],$D$62:$D$116,Таблица3[[#This Row],[Дл]],$AC$62:$AC$116,Таблица3[[#This Row],[Толщ]],$F$62:$F$116,Таблица3[[#This Row],[Астра]])","v":0},{"$f":"SUMIFS($P$62:$P$116,$AC$62:$AC$116,Таблица3[[#This Row],[Толщ]],$C$62:$C$116,\"<\"&Таблица3[[#This Row],[Шир]],$D$62:$D$116,Таблица3[[#This Row],[Дл]],$F$62:$F$116,Таблица3[[#This Row],[Астра]])+SUMIFS($P$62:$P$116,$AC$62:$AC$116,Таблица3[[#This Row],[Толщ]],$C$62:$C$116,Таблица3[[#This Row],[Шир]],$D$62:$D$116,\"<\"&Таблица3[[#This Row],[Дл]],$F$62:$F$116,Таблица3[[#This Row],[Астра]])+SUMIFS($P$62:$P$116,$AC$62:$AC$116,Таблица3[[#This Row],[Толщ]],$C$62:$C$116,\"<\"&Таблица3[[#This Row],[Шир]],$D$62:$D$116,\"<\"&Таблица3[[#This Row],[Дл]],$F$62:$F$116,Таблица3[[#This Row],[Астра]])","v":0},{"$f":"Таблица3[[#This Row],[Ст13]]+Таблица3[[#This Row],[Ст14]]","v":0},{"$f":"SUMIFS($S$62:$S$116,$C$62:$C$116,Таблица3[[#This Row],[Шир]],$D$62:$D$116,Таблица3[[#This Row],[Дл]],$AC$62:$AC$116,Таблица3[[#This Row],[Толщ]],$F$62:$F$116,Таблица3[[#This Row],[Астра]])","v":0},{"$f":"SUMIFS($S$62:$S$116,$AC$62:$AC$116,Таблица3[[#This Row],[Толщ]],$C$62:$C$116,\"<\"&Таблица3[[#This Row],[Шир]],$D$62:$D$116,Таблица3[[#This Row],[Дл]],$F$62:$F$116,Таблица3[[#This Row],[Астра]])+SUMIFS($S$62:$S$116,$AC$62:$AC$116,Таблица3[[#This Row],[Толщ]],$C$62:$C$116,Таблица3[[#This Row],[Шир]],$D$62:$D$116,\"<\"&Таблица3[[#This Row],[Дл]],$F$62:$F$116,Таблица3[[#This Row],[Астра]])+SUMIFS($S$62:$S$116,$AC$62:$AC$116,Таблица3[[#This Row],[Толщ]],$C$62:$C$116,\"<\"&Таблица3[[#This Row],[Шир]],$D$62:$D$116,\"<\"&Таблица3[[#This Row],[Дл]],$F$62:$F$116,Таблица3[[#This Row],[Астра]])","v":0},{"$f":"Таблица3[[#This Row],[Ст16]]+Таблица3[[#This Row],[Ст17]]","v":0},{"$f":"Таблица3[[#This Row],[Ст18]]+Таблица3[[#This Row],[Столбец32]]","v":0},{"$f":"SUMIFS($V$62:$V$116,$C$62:$C$116,Таблица3[[#This Row],[Шир]],$D$62:$D$116,Таблица3[[#This Row],[Дл]],$AC$62:$AC$116,Таблица3[[#This Row],[Толщ]],$F$62:$F$116,Таблица3[[#This Row],[Астра]])","v":0},{"$f":"SUMIFS($V$62:$V$116,$AC$62:$AC$116,Таблица3[[#This Row],[Толщ]],$C$62:$C$116,\"<\"&Таблица3[[#This Row],[Шир]],$D$62:$D$116,Таблица3[[#This Row],[Дл]],$F$62:$F$116,Таблица3[[#This Row],[Астра]])+SUMIFS($V$62:$V$116,$AC$62:$AC$116,Таблица3[[#This Row],[Толщ]],$C$62:$C$116,Таблица3[[#This Row],[Шир]],$D$62:$D$116,\"<\"&Таблица3[[#This Row],[Дл]],$F$62:$F$116,Таблица3[[#This Row],[Астра]])+SUMIFS($V$62:$V$116,$AC$62:$AC$116,Таблица3[[#This Row],[Толщ]],$C$62:$C$116,\"<\"&Таблица3[[#This Row],[Шир]],$D$62:$D$116,\"<\"&Таблица3[[#This Row],[Дл]],$F$62:$F$116,Таблица3[[#This Row],[Астра]])","v":0},{"$f":"Таблица3[[#This Row],[Ст19]]+Таблица3[[#This Row],[Ст20]]","v":0},{"$f":"Таблица3[[#This Row],[Ст21]]-Таблица3[[#This Row],[Столбец32]]","v":0},null,"Лист лазер, 1.2 мм, лт","Лист лазер","Лист",7.8739999999999997,{"$f":"SUBSTITUTE(Таблица3[[#This Row],[Толщ]],\",\",\".\")","v":"1.2"},{"$f":"SUMIFS($AA$8:$AA$57,$H$8:$H$57,Таблица3[[#This Row],[Столбец28]],$G$8:$G$57,Таблица3[[#This Row],[Толщ]])","v":0}]
[{"$f":"IF(Таблица3[[#All],[Ст21]]=0,\"z\",\"\")","v":"z"},null,1250,2500,1.5,null,{"$f":"SUMIFS($G$62:$G$116,$D$62:$D$116,Таблица3[[#This Row],[Дл]],$C$62:$C$116,Таблица3[[#This Row],[Шир]],$AC$62:$AC$116,Таблица3[[#This Row],[Толщ]],$F$62:$F$116,Таблица3[[#This Row],[Астра]])","v":0},null,{"$f":"CONCATENATE(Таблица3[[#This Row],[Столбец29]],\" \",Таблица3[[#This Row],[Толщ]])","v":"Лист 1,5"},null,{"$f":"Таблица3[[#This Row],[Толщ]]","v":1.5},null,{"$f":"SUMIFS($M$62:$M$116,$C$62:$C$116,Таблица3[[#This Row],[Шир]],$D$62:$D$116,Таблица3[[#This Row],[Дл]],$AC$62:$AC$116,Таблица3[[#This Row],[Толщ]],$F$62:$F$116,Таблица3[[#This Row],[Астра]])","v":0},{"$f":"SUMIFS($M$62:$M$116,$AC$62:$AC$116,Таблица3[[#This Row],[Толщ]],$C$62:$C$116,\"<\"&Таблица3[[#This Row],[Шир]],$D$62:$D$116,Таблица3[[#This Row],[Дл]],$F$62:$F$116,Таблица3[[#This Row],[Астра]])+SUMIFS($M$62:$M$116,$AC$62:$AC$116,Таблица3[[#This Row],[Толщ]],$C$62:$C$116,Таблица3[[#This Row],[Шир]],$D$62:$D$116,\"<\"&Таблица3[[#This Row],[Дл]],$F$62:$F$116,Таблица3[[#This Row],[Астра]])+SUMIFS($M$62:$M$116,$AC$62:$AC$116,Таблица3[[#This Row],[Толщ]],$C$62:$C$116,\"<\"&Таблица3[[#This Row],[Шир]],$D$62:$D$116,\"<\"&Таблица3[[#This Row],[Дл]],$F$62:$F$116,Таблица3[[#This Row],[Астра]])","v":0},{"$f":"Таблица3[[#This Row],[Ст10]]+Таблица3[[#This Row],[Ст11]]","v":0},{"$f":"SUMIFS($P$62:$P$116,$C$62:$C$116,Таблица3[[#This Row],[Шир]],$D$62:$D$116,Таблица3[[#This Row],[Дл]],$AC$62:$AC$116,Таблица3[[#This Row],[Толщ]],$F$62:$F$116,Таблица3[[#This Row],[Астра]])","v":0},{"$f":"SUMIFS($P$62:$P$116,$AC$62:$AC$116,Таблица3[[#This Row],[Толщ]],$C$62:$C$116,\"<\"&Таблица3[[#This Row],[Шир]],$D$62:$D$116,Таблица3[[#This Row],[Дл]],$F$62:$F$116,Таблица3[[#This Row],[Астра]])+SUMIFS($P$62:$P$116,$AC$62:$AC$116,Таблица3[[#This Row],[Толщ]],$C$62:$C$116,Таблица3[[#This Row],[Шир]],$D$62:$D$116,\"<\"&Таблица3[[#This Row],[Дл]],$F$62:$F$116,Таблица3[[#This Row],[Астра]])+SUMIFS($P$62:$P$116,$AC$62:$AC$116,Таблица3[[#This Row],[Толщ]],$C$62:$C$116,\"<\"&Таблица3[[#This Row],[Шир]],$D$62:$D$116,\"<\"&Таблица3[[#This Row],[Дл]],$F$62:$F$116,Таблица3[[#This Row],[Астра]])","v":0},{"$f":"Таблица3[[#This Row],[Ст13]]+Таблица3[[#This Row],[Ст14]]","v":0},{"$f":"SUMIFS($S$62:$S$116,$C$62:$C$116,Таблица3[[#This Row],[Шир]],$D$62:$D$116,Таблица3[[#This Row],[Дл]],$AC$62:$AC$116,Таблица3[[#This Row],[Толщ]],$F$62:$F$116,Таблица3[[#This Row],[Астра]])","v":0},{"$f":"SUMIFS($S$62:$S$116,$AC$62:$AC$116,Таблица3[[#This Row],[Толщ]],$C$62:$C$116,\"<\"&Таблица3[[#This Row],[Шир]],$D$62:$D$116,Таблица3[[#This Row],[Дл]],$F$62:$F$116,Таблица3[[#This Row],[Астра]])+SUMIFS($S$62:$S$116,$AC$62:$AC$116,Таблица3[[#This Row],[Толщ]],$C$62:$C$116,Таблица3[[#This Row],[Шир]],$D$62:$D$116,\"<\"&Таблица3[[#This Row],[Дл]],$F$62:$F$116,Таблица3[[#This Row],[Астра]])+SUMIFS($S$62:$S$116,$AC$62:$AC$116,Таблица3[[#This Row],[Толщ]],$C$62:$C$116,\"<\"&Таблица3[[#This Row],[Шир]],$D$62:$D$116,\"<\"&Таблица3[[#This Row],[Дл]],$F$62:$F$116,Таблица3[[#This Row],[Астра]])","v":0},{"$f":"Таблица3[[#This Row],[Ст16]]+Таблица3[[#This Row],[Ст17]]","v":0},{"$f":"Таблица3[[#This Row],[Ст18]]+Таблица3[[#This Row],[Столбец32]]","v":0},{"$f":"SUMIFS($V$62:$V$116,$C$62:$C$116,Таблица3[[#This Row],[Шир]],$D$62:$D$116,Таблица3[[#This Row],[Дл]],$AC$62:$AC$116,Таблица3[[#This Row],[Толщ]],$F$62:$F$116,Таблица3[[#This Row],[Астра]])","v":0},{"$f":"SUMIFS($V$62:$V$116,$AC$62:$AC$116,Таблица3[[#This Row],[Толщ]],$C$62:$C$116,\"<\"&Таблица3[[#This Row],[Шир]],$D$62:$D$116,Таблица3[[#This Row],[Дл]],$F$62:$F$116,Таблица3[[#This Row],[Астра]])+SUMIFS($V$62:$V$116,$AC$62:$AC$116,Таблица3[[#This Row],[Толщ]],$C$62:$C$116,Таблица3[[#This Row],[Шир]],$D$62:$D$116,\"<\"&Таблица3[[#This Row],[Дл]],$F$62:$F$116,Таблица3[[#This Row],[Астра]])+SUMIFS($V$62:$V$116,$AC$62:$AC$116,Таблица3[[#This Row],[Толщ]],$C$62:$C$116,\"<\"&Таблица3[[#This Row],[Шир]],$D$62:$D$116,\"<\"&Таблица3[[#This Row],[Дл]],$F$62:$F$116,Таблица3[[#This Row],[Астра]])","v":0},{"$f":"Таблица3[[#This Row],[Ст19]]+Таблица3[[#This Row],[Ст20]]","v":0},{"$f":"Таблица3[[#This Row],[Ст21]]-Таблица3[[#This Row],[Столбец32]]","v":0},null,"Лист лазер, 1.5 мм, лт","Лист лазер","Лист",7.8739999999999997,{"$f":"SUBSTITUTE(Таблица3[[#This Row],[Толщ]],\",\",\".\")","v":"1.5"},{"$f":"SUMIFS($AA$8:$AA$57,$H$8:$H$57,Таблица3[[#This Row],[Столбец28]],$G$8:$G$57,Таблица3[[#This Row],[Толщ]])","v":0}]
[{"$f":"IF(Таблица3[[#All],[Ст21]]=0,\"z\",\"\")","v":"z"},null,1250,2500,10,null,{"$f":"SUMIFS($G$62:$G$116,$D$62:$D$116,Таблица3[[#This Row],[Дл]],$C$62:$C$116,Таблица3[[#This Row],[Шир]],$AC$62:$AC$116,Таблица3[[#This Row],[Толщ]],$F$62:$F$116,Таблица3[[#This Row],[Астра]])","v":0},null,{"$f":"CONCATENATE(Таблица3[[#This Row],[Столбец29]],\" \",Таблица3[[#This Row],[Толщ]])","v":"Лист 10"},null,{"$f":"Таблица3[[#This Row],[Толщ]]","v":10},null,{"$f":"SUMIFS($M$62:$M$116,$C$62:$C$116,Таблица3[[#This Row],[Шир]],$D$62:$D$116,Таблица3[[#This Row],[Дл]],$AC$62:$AC$116,Таблица3[[#This Row],[Толщ]],$F$62:$F$116,Таблица3[[#This Row],[Астра]])","v":0},{"$f":"SUMIFS($M$62:$M$116,$AC$62:$AC$116,Таблица3[[#This Row],[Толщ]],$C$62:$C$116,\"<\"&Таблица3[[#This Row],[Шир]],$D$62:$D$116,Таблица3[[#This Row],[Дл]],$F$62:$F$116,Таблица3[[#This Row],[Астра]])+SUMIFS($M$62:$M$116,$AC$62:$AC$116,Таблица3[[#This Row],[Толщ]],$C$62:$C$116,Таблица3[[#This Row],[Шир]],$D$62:$D$116,\"<\"&Таблица3[[#This Row],[Дл]],$F$62:$F$116,Таблица3[[#This Row],[Астра]])+SUMIFS($M$62:$M$116,$AC$62:$AC$116,Таблица3[[#This Row],[Толщ]],$C$62:$C$116,\"<\"&Таблица3[[#This Row],[Шир]],$D$62:$D$116,\"<\"&Таблица3[[#This Row],[Дл]],$F$62:$F$116,Таблица3[[#This Row],[Астра]])","v":0},{"$f":"Таблица3[[#This Row],[Ст10]]+Таблица3[[#This Row],[Ст11]]","v":0},{"$f":"SUMIFS($P$62:$P$116,$C$62:$C$116,Таблица3[[#This Row],[Шир]],$D$62:$D$116,Таблица3[[#This Row],[Дл]],$AC$62:$AC$116,Таблица3[[#This Row],[Толщ]],$F$62:$F$116,Таблица3[[#This Row],[Астра]])","v":0},{"$f":"SUMIFS($P$62:$P$116,$AC$62:$AC$116,Таблица3[[#This Row],[Толщ]],$C$62:$C$116,\"<\"&Таблица3[[#This Row],[Шир]],$D$62:$D$116,Таблица3[[#This Row],[Дл]],$F$62:$F$116,Таблица3[[#This Row],[Астра]])+SUMIFS($P$62:$P$116,$AC$62:$AC$116,Таблица3[[#This Row],[Толщ]],$C$62:$C$116,Таблица3[[#This Row],[Шир]],$D$62:$D$116,\"<\"&Таблица3[[#This Row],[Дл]],$F$62:$F$116,Таблица3[[#This Row],[Астра]])+SUMIFS($P$62:$P$116,$AC$62:$AC$116,Таблица3[[#This Row],[Толщ]],$C$62:$C$116,\"<\"&Таблица3[[#This Row],[Шир]],$D$62:$D$116,\"<\"&Таблица3[[#This Row],[Дл]],$F$62:$F$116,Таблица3[[#This Row],[Астра]])","v":0},{"$f":"Таблица3[[#This Row],[Ст13]]+Таблица3[[#This Row],[Ст14]]","v":0},{"$f":"SUMIFS($S$62:$S$116,$C$62:$C$116,Таблица3[[#This Row],[Шир]],$D$62:$D$116,Таблица3[[#This Row],[Дл]],$AC$62:$AC$116,Таблица3[[#This Row],[Толщ]],$F$62:$F$116,Таблица3[[#This Row],[Астра]])","v":0},{"$f":"SUMIFS($S$62:$S$116,$AC$62:$AC$116,Таблица3[[#This Row],[Толщ]],$C$62:$C$116,\"<\"&Таблица3[[#This Row],[Шир]],$D$62:$D$116,Таблица3[[#This Row],[Дл]],$F$62:$F$116,Таблица3[[#This Row],[Астра]])+SUMIFS($S$62:$S$116,$AC$62:$AC$116,Таблица3[[#This Row],[Толщ]],$C$62:$C$116,Таблица3[[#This Row],[Шир]],$D$62:$D$116,\"<\"&Таблица3[[#This Row],[Дл]],$F$62:$F$116,Таблица3[[#This Row],[Астра]])+SUMIFS($S$62:$S$116,$AC$62:$AC$116,Таблица3[[#This Row],[Толщ]],$C$62:$C$116,\"<\"&Таблица3[[#This Row],[Шир]],$D$62:$D$116,\"<\"&Таблица3[[#This Row],[Дл]],$F$62:$F$116,Таблица3[[#This Row],[Астра]])","v":0},{"$f":"Таблица3[[#This Row],[Ст16]]+Таблица3[[#This Row],[Ст17]]","v":0},{"$f":"Таблица3[[#This Row],[Ст18]]+Таблица3[[#This Row],[Столбец32]]","v":0},{"$f":"SUMIFS($V$62:$V$116,$C$62:$C$116,Таблица3[[#This Row],[Шир]],$D$62:$D$116,Таблица3[[#This Row],[Дл]],$AC$62:$AC$116,Таблица3[[#This Row],[Толщ]],$F$62:$F$116,Таблица3[[#This Row],[Астра]])","v":0},{"$f":"SUMIFS($V$62:$V$116,$AC$62:$AC$116,Таблица3[[#This Row],[Толщ]],$C$62:$C$116,\"<\"&Таблица3[[#This Row],[Шир]],$D$62:$D$116,Таблица3[[#This Row],[Дл]],$F$62:$F$116,Таблица3[[#This Row],[Астра]])+SUMIFS($V$62:$V$116,$AC$62:$AC$116,Таблица3[[#This Row],[Толщ]],$C$62:$C$116,Таблица3[[#This Row],[Шир]],$D$62:$D$116,\"<\"&Таблица3[[#This Row],[Дл]],$F$62:$F$116,Таблица3[[#This Row],[Астра]])+SUMIFS($V$62:$V$116,$AC$62:$AC$116,Таблица3[[#This Row],[Толщ]],$C$62:$C$116,\"<\"&Таблица3[[#This Row],[Шир]],$D$62:$D$116,\"<\"&Таблица3[[#This Row],[Дл]],$F$62:$F$116,Таблица3[[#This Row],[Астра]])","v":0},{"$f":"Таблица3[[#This Row],[Ст19]]+Таблица3[[#This Row],[Ст20]]","v":0},{"$f":"Таблица3[[#This Row],[Ст21]]-Таблица3[[#This Row],[Столбец32]]","v":0},null,"Лист лазер, 10.0 мм, лт","Лист лазер","Лист",7.8739999999999997,{"$f":"SUBSTITUTE(Таблица3[[#This Row],[Толщ]],\",\",\".\")","v":"10"},{"$f":"SUMIFS($AA$8:$AA$57,$H$8:$H$57,Таблица3[[#This Row],[Столбец28]],$G$8:$G$57,Таблица3[[#This Row],[Толщ]])","v":0}]
[{"$f":"IF(Таблица3[[#All],[Ст21]]=0,\"z\",\"\")","v":"z"},null,1250,2500,2,null,{"$f":"SUMIFS($G$62:$G$116,$D$62:$D$116,Таблица3[[#This Row],[Дл]],$C$62:$C$116,Таблица3[[#This Row],[Шир]],$AC$62:$AC$116,Таблица3[[#This Row],[Толщ]],$F$62:$F$116,Таблица3[[#This Row],[Астра]])","v":0},null,{"$f":"CONCATENATE(Таблица3[[#This Row],[Столбец29]],\" \",Таблица3[[#This Row],[Толщ]])","v":"Лист 2"},null,{"$f":"Таблица3[[#This Row],[Толщ]]","v":2},null,{"$f":"SUMIFS($M$62:$M$116,$C$62:$C$116,Таблица3[[#This Row],[Шир]],$D$62:$D$116,Таблица3[[#This Row],[Дл]],$AC$62:$AC$116,Таблица3[[#This Row],[Толщ]],$F$62:$F$116,Таблица3[[#This Row],[Астра]])","v":0},{"$f":"SUMIFS($M$62:$M$116,$AC$62:$AC$116,Таблица3[[#This Row],[Толщ]],$C$62:$C$116,\"<\"&Таблица3[[#This Row],[Шир]],$D$62:$D$116,Таблица3[[#This Row],[Дл]],$F$62:$F$116,Таблица3[[#This Row],[Астра]])+SUMIFS($M$62:$M$116,$AC$62:$AC$116,Таблица3[[#This Row],[Толщ]],$C$62:$C$116,Таблица3[[#This Row],[Шир]],$D$62:$D$116,\"<\"&Таблица3[[#This Row],[Дл]],$F$62:$F$116,Таблица3[[#This Row],[Астра]])+SUMIFS($M$62:$M$116,$AC$62:$AC$116,Таблица3[[#This Row],[Толщ]],$C$62:$C$116,\"<\"&Таблица3[[#This Row],[Шир]],$D$62:$D$116,\"<\"&Таблица3[[#This Row],[Дл]],$F$62:$F$116,Таблица3[[#This Row],[Астра]])","v":0},{"$f":"Таблица3[[#This Row],[Ст10]]+Таблица3[[#This Row],[Ст11]]","v":0},{"$f":"SUMIFS($P$62:$P$116,$C$62:$C$116,Таблица3[[#This Row],[Шир]],$D$62:$D$116,Таблица3[[#This Row],[Дл]],$AC$62:$AC$116,Таблица3[[#This Row],[Толщ]],$F$62:$F$116,Таблица3[[#This Row],[Астра]])","v":0},{"$f":"SUMIFS($P$62:$P$116,$AC$62:$AC$116,Таблица3[[#This Row],[Толщ]],$C$62:$C$116,\"<\"&Таблица3[[#This Row],[Шир]],$D$62:$D$116,Таблица3[[#This Row],[Дл]],$F$62:$F$116,Таблица3[[#This Row],[Астра]])+SUMIFS($P$62:$P$116,$AC$62:$AC$116,Таблица3[[#This Row],[Толщ]],$C$62:$C$116,Таблица3[[#This Row],[Шир]],$D$62:$D$116,\"<\"&Таблица3[[#This Row],[Дл]],$F$62:$F$116,Таблица3[[#This Row],[Астра]])+SUMIFS($P$62:$P$116,$AC$62:$AC$116,Таблица3[[#This Row],[Толщ]],$C$62:$C$116,\"<\"&Таблица3[[#This Row],[Шир]],$D$62:$D$116,\"<\"&Таблица3[[#This Row],[Дл]],$F$62:$F$116,Таблица3[[#This Row],[Астра]])","v":0},{"$f":"Таблица3[[#This Row],[Ст13]]+Таблица3[[#This Row],[Ст14]]","v":0},{"$f":"SUMIFS($S$62:$S$116,$C$62:$C$116,Таблица3[[#This Row],[Шир]],$D$62:$D$116,Таблица3[[#This Row],[Дл]],$AC$62:$AC$116,Таблица3[[#This Row],[Толщ]],$F$62:$F$116,Таблица3[[#This Row],[Астра]])","v":0},{"$f":"SUMIFS($S$62:$S$116,$AC$62:$AC$116,Таблица3[[#This Row],[Толщ]],$C$62:$C$116,\"<\"&Таблица3[[#This Row],[Шир]],$D$62:$D$116,Таблица3[[#This Row],[Дл]],$F$62:$F$116,Таблица3[[#This Row],[Астра]])+SUMIFS($S$62:$S$116,$AC$62:$AC$116,Таблица3[[#This Row],[Толщ]],$C$62:$C$116,Таблица3[[#This Row],[Шир]],$D$62:$D$116,\"<\"&Таблица3[[#This Row],[Дл]],$F$62:$F$116,Таблица3[[#This Row],[Астра]])+SUMIFS($S$62:$S$116,$AC$62:$AC$116,Таблица3[[#This Row],[Толщ]],$C$62:$C$116,\"<\"&Таблица3[[#This Row],[Шир]],$D$62:$D$116,\"<\"&Таблица3[[#This Row],[Дл]],$F$62:$F$116,Таблица3[[#This Row],[Астра]])","v":0},{"$f":"Таблица3[[#This Row],[Ст16]]+Таблица3[[#This Row],[Ст17]]","v":0},{"$f":"Таблица3[[#This Row],[Ст18]]+Таблица3[[#This Row],[Столбец32]]","v":124.10683839999997},{"$f":"SUMIFS($V$62:$V$116,$C$62:$C$116,Таблица3[[#This Row],[Шир]],$D$62:$D$116,Таблица3[[#This Row],[Дл]],$AC$62:$AC$116,Таблица3[[#This Row],[Толщ]],$F$62:$F$116,Таблица3[[#This Row],[Астра]])","v":0},{"$f":"SUMIFS($V$62:$V$116,$AC$62:$AC$116,Таблица3[[#This Row],[Толщ]],$C$62:$C$116,\"<\"&Таблица3[[#This Row],[Шир]],$D$62:$D$116,Таблица3[[#This Row],[Дл]],$F$62:$F$116,Таблица3[[#This Row],[Астра]])+SUMIFS($V$62:$V$116,$AC$62:$AC$116,Таблица3[[#This Row],[Толщ]],$C$62:$C$116,Таблица3[[#This Row],[Шир]],$D$62:$D$116,\"<\"&Таблица3[[#This Row],[Дл]],$F$62:$F$116,Таблица3[[#This Row],[Астра]])+SUMIFS($V$62:$V$116,$AC$62:$AC$116,Таблица3[[#This Row],[Толщ]],$C$62:$C$116,\"<\"&Таблица3[[#This Row],[Шир]],$D$62:$D$116,\"<\"&Таблица3[[#This Row],[Дл]],$F$62:$F$116,Таблица3[[#This Row],[Астра]])","v":0},{"$f":"Таблица3[[#This Row],[Ст19]]+Таблица3[[#This Row],[Ст20]]","v":0},{"$f":"Таблица3[[#This Row],[Ст21]]-Таблица3[[#This Row],[Столбец32]]","v":-124.10683839999997},null,"Лист лазер, 2.0 мм, лт","Лист лазер","Лист",7.8739999999999997,{"$f":"SUBSTITUTE(Таблица3[[#This Row],[Толщ]],\",\",\".\")","v":"2"},{"$f":"SUMIFS($AA$8:$AA$57,$H$8:$H$57,Таблица3[[#This Row],[Столбец28]],$G$8:$G$57,Таблица3[[#This Row],[Толщ]])","v":124.10683839999997}]
[{"$f":"IF(Таблица3[[#All],[Ст21]]=0,\"z\",\"\")","v":"z"},null,1250,2500,2.5,null,{"$f":"SUMIFS($G$62:$G$116,$D$62:$D$116,Таблица3[[#This Row],[Дл]],$C$62:$C$116,Таблица3[[#This Row],[Шир]],$AC$62:$AC$116,Таблица3[[#This Row],[Толщ]],$F$62:$F$116,Таблица3[[#This Row],[Астра]])","v":0},null,{"$f":"CONCATENATE(Таблица3[[#This Row],[Столбец29]],\" \",Таблица3[[#This Row],[Толщ]])","v":"Лист 2,5"},null,{"$f":"Таблица3[[#This Row],[Толщ]]","v":2.5},null,{"$f":"SUMIFS($M$62:$M$116,$C$62:$C$116,Таблица3[[#This Row],[Шир]],$D$62:$D$116,Таблица3[[#This Row],[Дл]],$AC$62:$AC$116,Таблица3[[#This Row],[Толщ]],$F$62:$F$116,Таблица3[[#This Row],[Астра]])","v":0},{"$f":"SUMIFS($M$62:$M$116,$AC$62:$AC$116,Таблица3[[#This Row],[Толщ]],$C$62:$C$116,\"<\"&Таблица3[[#This Row],[Шир]],$D$62:$D$116,Таблица3[[#This Row],[Дл]],$F$62:$F$116,Таблица3[[#This Row],[Астра]])+SUMIFS($M$62:$M$116,$AC$62:$AC$116,Таблица3[[#This Row],[Толщ]],$C$62:$C$116,Таблица3[[#This Row],[Шир]],$D$62:$D$116,\"<\"&Таблица3[[#This Row],[Дл]],$F$62:$F$116,Таблица3[[#This Row],[Астра]])+SUMIFS($M$62:$M$116,$AC$62:$AC$116,Таблица3[[#This Row],[Толщ]],$C$62:$C$116,\"<\"&Таблица3[[#This Row],[Шир]],$D$62:$D$116,\"<\"&Таблица3[[#This Row],[Дл]],$F$62:$F$116,Таблица3[[#This Row],[Астра]])","v":0},{"$f":"Таблица3[[#This Row],[Ст10]]+Таблица3[[#This Row],[Ст11]]","v":0},{"$f":"SUMIFS($P$62:$P$116,$C$62:$C$116,Таблица3[[#This Row],[Шир]],$D$62:$D$116,Таблица3[[#This Row],[Дл]],$AC$62:$AC$116,Таблица3[[#This Row],[Толщ]],$F$62:$F$116,Таблица3[[#This Row],[Астра]])","v":0},{"$f":"SUMIFS($P$62:$P$116,$AC$62:$AC$116,Таблица3[[#This Row],[Толщ]],$C$62:$C$116,\"<\"&Таблица3[[#This Row],[Шир]],$D$62:$D$116,Таблица3[[#This Row],[Дл]],$F$62:$F$116,Таблица3[[#This Row],[Астра]])+SUMIFS($P$62:$P$116,$AC$62:$AC$116,Таблица3[[#This Row],[Толщ]],$C$62:$C$116,Таблица3[[#This Row],[Шир]],$D$62:$D$116,\"<\"&Таблица3[[#This Row],[Дл]],$F$62:$F$116,Таблица3[[#This Row],[Астра]])+SUMIFS($P$62:$P$116,$AC$62:$AC$116,Таблица3[[#This Row],[Толщ]],$C$62:$C$116,\"<\"&Таблица3[[#This Row],[Шир]],$D$62:$D$116,\"<\"&Таблица3[[#This Row],[Дл]],$F$62:$F$116,Таблица3[[#This Row],[Астра]])","v":0},{"$f":"Таблица3[[#This Row],[Ст13]]+Таблица3[[#This Row],[Ст14]]","v":0},{"$f":"SUMIFS($S$62:$S$116,$C$62:$C$116,Таблица3[[#This Row],[Шир]],$D$62:$D$116,Таблица3[[#This Row],[Дл]],$AC$62:$AC$116,Таблица3[[#This Row],[Толщ]],$F$62:$F$116,Таблица3[[#This Row],[Астра]])","v":0},{"$f":"SUMIFS($S$62:$S$116,$AC$62:$AC$116,Таблица3[[#This Row],[Толщ]],$C$62:$C$116,\"<\"&Таблица3[[#This Row],[Шир]],$D$62:$D$116,Таблица3[[#This Row],[Дл]],$F$62:$F$116,Таблица3[[#This Row],[Астра]])+SUMIFS($S$62:$S$116,$AC$62:$AC$116,Таблица3[[#This Row],[Толщ]],$C$62:$C$116,Таблица3[[#This Row],[Шир]],$D$62:$D$116,\"<\"&Таблица3[[#This Row],[Дл]],$F$62:$F$116,Таблица3[[#This Row],[Астра]])+SUMIFS($S$62:$S$116,$AC$62:$AC$116,Таблица3[[#This Row],[Толщ]],$C$62:$C$116,\"<\"&Таблица3[[#This Row],[Шир]],$D$62:$D$116,\"<\"&Таблица3[[#This Row],[Дл]],$F$62:$F$116,Таблица3[[#This Row],[Астра]])","v":0},{"$f":"Таблица3[[#This Row],[Ст16]]+Таблица3[[#This Row],[Ст17]]","v":0},{"$f":"Таблица3[[#This Row],[Ст18]]+Таблица3[[#This Row],[Столбец32]]","v":0},{"$f":"SUMIFS($V$62:$V$116,$C$62:$C$116,Таблица3[[#This Row],[Шир]],$D$62:$D$116,Таблица3[[#This Row],[Дл]],$AC$62:$AC$116,Таблица3[[#This Row],[Толщ]],$F$62:$F$116,Таблица3[[#This Row],[Астра]])","v":0},{"$f":"SUMIFS($V$62:$V$116,$AC$62:$AC$116,Таблица3[[#This Row],[Толщ]],$C$62:$C$116,\"<\"&Таблица3[[#This Row],[Шир]],$D$62:$D$116,Таблица3[[#This Row],[Дл]],$F$62:$F$116,Таблица3[[#This Row],[Астра]])+SUMIFS($V$62:$V$116,$AC$62:$AC$116,Таблица3[[#This Row],[Толщ]],$C$62:$C$116,Таблица3[[#This Row],[Шир]],$D$62:$D$116,\"<\"&Таблица3[[#This Row],[Дл]],$F$62:$F$116,Таблица3[[#This Row],[Астра]])+SUMIFS($V$62:$V$116,$AC$62:$AC$116,Таблица3[[#This Row],[Толщ]],$C$62:$C$116,\"<\"&Таблица3[[#This Row],[Шир]],$D$62:$D$116,\"<\"&Таблица3[[#This Row],[Дл]],$F$62:$F$116,Таблица3[[#This Row],[Астра]])","v":0},{"$f":"Таблица3[[#This Row],[Ст19]]+Таблица3[[#This Row],[Ст20]]","v":0},{"$f":"Таблица3[[#This Row],[Ст21]]-Таблица3[[#This Row],[Столбец32]]","v":0},null,"Лист лазер, 2.5 мм, лт","Лист лазер","Лист",7.8739999999999997,{"$f":"SUBSTITUTE(Таблица3[[#This Row],[Толщ]],\",\",\".\")","v":"2.5"},{"$f":"SUMIFS($AA$8:$AA$57,$H$8:$H$57,Таблица3[[#This Row],[Столбец28]],$G$8:$G$57,Таблица3[[#This Row],[Толщ]])","v":0}]
[{"$f":"IF(Таблица3[[#All],[Ст21]]=0,\"z\",\"\")","v":"z"},null,1250,2500,3,null,{"$f":"SUMIFS($G$62:$G$116,$D$62:$D$116,Таблица3[[#This Row],[Дл]],$C$62:$C$116,Таблица3[[#This Row],[Шир]],$AC$62:$AC$116,Таблица3[[#This Row],[Толщ]],$F$62:$F$116,Таблица3[[#This Row],[Астра]])","v":0},null,{"$f":"CONCATENATE(Таблица3[[#This Row],[Столбец29]],\" \",Таблица3[[#This Row],[Толщ]])","v":"Лист 3"},null,{"$f":"Таблица3[[#This Row],[Толщ]]","v":3},null,{"$f":"SUMIFS($M$62:$M$116,$C$62:$C$116,Таблица3[[#This Row],[Шир]],$D$62:$D$116,Таблица3[[#This Row],[Дл]],$AC$62:$AC$116,Таблица3[[#This Row],[Толщ]],$F$62:$F$116,Таблица3[[#This Row],[Астра]])","v":0},{"$f":"SUMIFS($M$62:$M$116,$AC$62:$AC$116,Таблица3[[#This Row],[Толщ]],$C$62:$C$116,\"<\"&Таблица3[[#This Row],[Шир]],$D$62:$D$116,Таблица3[[#This Row],[Дл]],$F$62:$F$116,Таблица3[[#This Row],[Астра]])+SUMIFS($M$62:$M$116,$AC$62:$AC$116,Таблица3[[#This Row],[Толщ]],$C$62:$C$116,Таблица3[[#This Row],[Шир]],$D$62:$D$116,\"<\"&Таблица3[[#This Row],[Дл]],$F$62:$F$116,Таблица3[[#This Row],[Астра]])+SUMIFS($M$62:$M$116,$AC$62:$AC$116,Таблица3[[#This Row],[Толщ]],$C$62:$C$116,\"<\"&Таблица3[[#This Row],[Шир]],$D$62:$D$116,\"<\"&Таблица3[[#This Row],[Дл]],$F$62:$F$116,Таблица3[[#This Row],[Астра]])","v":0},{"$f":"Таблица3[[#This Row],[Ст10]]+Таблица3[[#This Row],[Ст11]]","v":0},{"$f":"SUMIFS($P$62:$P$116,$C$62:$C$116,Таблица3[[#This Row],[Шир]],$D$62:$D$116,Таблица3[[#This Row],[Дл]],$AC$62:$AC$116,Таблица3[[#This Row],[Толщ]],$F$62:$F$116,Таблица3[[#This Row],[Астра]])","v":0},{"$f":"SUMIFS($P$62:$P$116,$AC$62:$AC$116,Таблица3[[#This Row],[Толщ]],$C$62:$C$116,\"<\"&Таблица3[[#This Row],[Шир]],$D$62:$D$116,Таблица3[[#This Row],[Дл]],$F$62:$F$116,Таблица3[[#This Row],[Астра]])+SUMIFS($P$62:$P$116,$AC$62:$AC$116,Таблица3[[#This Row],[Толщ]],$C$62:$C$116,Таблица3[[#This Row],[Шир]],$D$62:$D$116,\"<\"&Таблица3[[#This Row],[Дл]],$F$62:$F$116,Таблица3[[#This Row],[Астра]])+SUMIFS($P$62:$P$116,$AC$62:$AC$116,Таблица3[[#This Row],[Толщ]],$C$62:$C$116,\"<\"&Таблица3[[#This Row],[Шир]],$D$62:$D$116,\"<\"&Таблица3[[#This Row],[Дл]],$F$62:$F$116,Таблица3[[#This Row],[Астра]])","v":0},{"$f":"Таблица3[[#This Row],[Ст13]]+Таблица3[[#This Row],[Ст14]]","v":0},{"$f":"SUMIFS($S$62:$S$116,$C$62:$C$116,Таблица3[[#This Row],[Шир]],$D$62:$D$116,Таблица3[[#This Row],[Дл]],$AC$62:$AC$116,Таблица3[[#This Row],[Толщ]],$F$62:$F$116,Таблица3[[#This Row],[Астра]])","v":0},{"$f":"SUMIFS($S$62:$S$116,$AC$62:$AC$116,Таблица3[[#This Row],[Толщ]],$C$62:$C$116,\"<\"&Таблица3[[#This Row],[Шир]],$D$62:$D$116,Таблица3[[#This Row],[Дл]],$F$62:$F$116,Таблица3[[#This Row],[Астра]])+SUMIFS($S$62:$S$116,$AC$62:$AC$116,Таблица3[[#This Row],[Толщ]],$C$62:$C$116,Таблица3[[#This Row],[Шир]],$D$62:$D$116,\"<\"&Таблица3[[#This Row],[Дл]],$F$62:$F$116,Таблица3[[#This Row],[Астра]])+SUMIFS($S$62:$S$116,$AC$62:$AC$116,Таблица3[[#This Row],[Толщ]],$C$62:$C$116,\"<\"&Таблица3[[#This Row],[Шир]],$D$62:$D$116,\"<\"&Таблица3[[#This Row],[Дл]],$F$62:$F$116,Таблица3[[#This Row],[Астра]])","v":0},{"$f":"Таблица3[[#This Row],[Ст16]]+Таблица3[[#This Row],[Ст17]]","v":0},{"$f":"Таблица3[[#This Row],[Ст18]]+Таблица3[[#This Row],[Столбец32]]","v":0},{"$f":"SUMIFS($V$62:$V$116,$C$62:$C$116,Таблица3[[#This Row],[Шир]],$D$62:$D$116,Таблица3[[#This Row],[Дл]],$AC$62:$AC$116,Таблица3[[#This Row],[Толщ]],$F$62:$F$116,Таблица3[[#This Row],[Астра]])","v":0},{"$f":"SUMIFS($V$62:$V$116,$AC$62:$AC$116,Таблица3[[#This Row],[Толщ]],$C$62:$C$116,\"<\"&Таблица3[[#This Row],[Шир]],$D$62:$D$116,Таблица3[[#This Row],[Дл]],$F$62:$F$116,Таблица3[[#This Row],[Астра]])+SUMIFS($V$62:$V$116,$AC$62:$AC$116,Таблица3[[#This Row],[Толщ]],$C$62:$C$116,Таблица3[[#This Row],[Шир]],$D$62:$D$116,\"<\"&Таблица3[[#This Row],[Дл]],$F$62:$F$116,Таблица3[[#This Row],[Астра]])+SUMIFS($V$62:$V$116,$AC$62:$AC$116,Таблица3[[#This Row],[Толщ]],$C$62:$C$116,\"<\"&Таблица3[[#This Row],[Шир]],$D$62:$D$116,\"<\"&Таблица3[[#This Row],[Дл]],$F$62:$F$116,Таблица3[[#This Row],[Астра]])","v":0},{"$f":"Таблица3[[#This Row],[Ст19]]+Таблица3[[#This Row],[Ст20]]","v":0},{"$f":"Таблица3[[#This Row],[Ст21]]-Таблица3[[#This Row],[Столбец32]]","v":0},null,"Лист лазер, 3.0 мм, лт","Лист лазер","Лист",7.8739999999999997,{"$f":"SUBSTITUTE(Таблица3[[#This Row],[Толщ]],\",\",\".\")","v":"3"},{"$f":"SUMIFS($AA$8:$AA$57,$H$8:$H$57,Таблица3[[#This Row],[Столбец28]],$G$8:$G$57,Таблица3[[#This Row],[Толщ]])","v":0}]
[{"$f":"IF(Таблица3[[#All],[Ст21]]=0,\"z\",\"\")","v":"z"},null,1250,2500,4,null,{"$f":"SUMIFS($G$62:$G$116,$D$62:$D$116,Таблица3[[#This Row],[Дл]],$C$62:$C$116,Таблица3[[#This Row],[Шир]],$AC$62:$AC$116,Таблица3[[#This Row],[Толщ]],$F$62:$F$116,Таблица3[[#This Row],[Астра]])","v":0},null,{"$f":"CONCATENATE(Таблица3[[#This Row],[Столбец29]],\" \",Таблица3[[#This Row],[Толщ]])","v":"Лист 4"},null,{"$f":"Таблица3[[#This Row],[Толщ]]","v":4},null,{"$f":"SUMIFS($M$62:$M$116,$C$62:$C$116,Таблица3[[#This Row],[Шир]],$D$62:$D$116,Таблица3[[#This Row],[Дл]],$AC$62:$AC$116,Таблица3[[#This Row],[Толщ]],$F$62:$F$116,Таблица3[[#This Row],[Астра]])","v":0},{"$f":"SUMIFS($M$62:$M$116,$AC$62:$AC$116,Таблица3[[#This Row],[Толщ]],$C$62:$C$116,\"<\"&Таблица3[[#This Row],[Шир]],$D$62:$D$116,Таблица3[[#This Row],[Дл]],$F$62:$F$116,Таблица3[[#This Row],[Астра]])+SUMIFS($M$62:$M$116,$AC$62:$AC$116,Таблица3[[#This Row],[Толщ]],$C$62:$C$116,Таблица3[[#This Row],[Шир]],$D$62:$D$116,\"<\"&Таблица3[[#This Row],[Дл]],$F$62:$F$116,Таблица3[[#This Row],[Астра]])+SUMIFS($M$62:$M$116,$AC$62:$AC$116,Таблица3[[#This Row],[Толщ]],$C$62:$C$116,\"<\"&Таблица3[[#This Row],[Шир]],$D$62:$D$116,\"<\"&Таблица3[[#This Row],[Дл]],$F$62:$F$116,Таблица3[[#This Row],[Астра]])","v":0},{"$f":"Таблица3[[#This Row],[Ст10]]+Таблица3[[#This Row],[Ст11]]","v":0},{"$f":"SUMIFS($P$62:$P$116,$C$62:$C$116,Таблица3[[#This Row],[Шир]],$D$62:$D$116,Таблица3[[#This Row],[Дл]],$AC$62:$AC$116,Таблица3[[#This Row],[Толщ]],$F$62:$F$116,Таблица3[[#This Row],[Астра]])","v":0},{"$f":"SUMIFS($P$62:$P$116,$AC$62:$AC$116,Таблица3[[#This Row],[Толщ]],$C$62:$C$116,\"<\"&Таблица3[[#This Row],[Шир]],$D$62:$D$116,Таблица3[[#This Row],[Дл]],$F$62:$F$116,Таблица3[[#This Row],[Астра]])+SUMIFS($P$62:$P$116,$AC$62:$AC$116,Таблица3[[#This Row],[Толщ]],$C$62:$C$116,Таблица3[[#This Row],[Шир]],$D$62:$D$116,\"<\"&Таблица3[[#This Row],[Дл]],$F$62:$F$116,Таблица3[[#This Row],[Астра]])+SUMIFS($P$62:$P$116,$AC$62:$AC$116,Таблица3[[#This Row],[Толщ]],$C$62:$C$116,\"<\"&Таблица3[[#This Row],[Шир]],$D$62:$D$116,\"<\"&Таблица3[[#This Row],[Дл]],$F$62:$F$116,Таблица3[[#This Row],[Астра]])","v":0},{"$f":"Таблица3[[#This Row],[Ст13]]+Таблица3[[#This Row],[Ст14]]","v":0},{"$f":"SUMIFS($S$62:$S$116,$C$62:$C$116,Таблица3[[#This Row],[Шир]],$D$62:$D$116,Таблица3[[#This Row],[Дл]],$AC$62:$AC$116,Таблица3[[#This Row],[Толщ]],$F$62:$F$116,Таблица3[[#This Row],[Астра]])","v":0},{"$f":"SUMIFS($S$62:$S$116,$AC$62:$AC$116,Таблица3[[#This Row],[Толщ]],$C$62:$C$116,\"<\"&Таблица3[[#This Row],[Шир]],$D$62:$D$116,Таблица3[[#This Row],[Дл]],$F$62:$F$116,Таблица3[[#This Row],[Астра]])+SUMIFS($S$62:$S$116,$AC$62:$AC$116,Таблица3[[#This Row],[Толщ]],$C$62:$C$116,Таблица3[[#This Row],[Шир]],$D$62:$D$116,\"<\"&Таблица3[[#This Row],[Дл]],$F$62:$F$116,Таблица3[[#This Row],[Астра]])+SUMIFS($S$62:$S$116,$AC$62:$AC$116,Таблица3[[#This Row],[Толщ]],$C$62:$C$116,\"<\"&Таблица3[[#This Row],[Шир]],$D$62:$D$116,\"<\"&Таблица3[[#This Row],[Дл]],$F$62:$F$116,Таблица3[[#This Row],[Астра]])","v":0},{"$f":"Таблица3[[#This Row],[Ст16]]+Таблица3[[#This Row],[Ст17]]","v":0},{"$f":"Таблица3[[#This Row],[Ст18]]+Таблица3[[#This Row],[Столбец32]]","v":0},{"$f":"SUMIFS($V$62:$V$116,$C$62:$C$116,Таблица3[[#This Row],[Шир]],$D$62:$D$116,Таблица3[[#This Row],[Дл]],$AC$62:$AC$116,Таблица3[[#This Row],[Толщ]],$F$62:$F$116,Таблица3[[#This Row],[Астра]])","v":0},{"$f":"SUMIFS($V$62:$V$116,$AC$62:$AC$116,Таблица3[[#This Row],[Толщ]],$C$62:$C$116,\"<\"&Таблица3[[#This Row],[Шир]],$D$62:$D$116,Таблица3[[#This Row],[Дл]],$F$62:$F$116,Таблица3[[#This Row],[Астра]])+SUMIFS($V$62:$V$116,$AC$62:$AC$116,Таблица3[[#This Row],[Толщ]],$C$62:$C$116,Таблица3[[#This Row],[Шир]],$D$62:$D$116,\"<\"&Таблица3[[#This Row],[Дл]],$F$62:$F$116,Таблица3[[#This Row],[Астра]])+SUMIFS($V$62:$V$116,$AC$62:$AC$116,Таблица3[[#This Row],[Толщ]],$C$62:$C$116,\"<\"&Таблица3[[#This Row],[Шир]],$D$62:$D$116,\"<\"&Таблица3[[#This Row],[Дл]],$F$62:$F$116,Таблица3[[#This Row],[Астра]])","v":0},{"$f":"Таблица3[[#This Row],[Ст19]]+Таблица3[[#This Row],[Ст20]]","v":0},{"$f":"Таблица3[[#This Row],[Ст21]]-Таблица3[[#This Row],[Столбец32]]","v":0},null,"Лист лазер, 4.0 мм, лт","Лист лазер","Лист",7.8739999999999997,{"$f":"SUBSTITUTE(Таблица3[[#This Row],[Толщ]],\",\",\".\")","v":"4"},{"$f":"SUMIFS($AA$8:$AA$57,$H$8:$H$57,Таблица3[[#This Row],[Столбец28]],$G$8:$G$57,Таблица3[[#This Row],[Толщ]])","v":0}]
[{"$f":"IF(Таблица3[[#All],[Ст21]]=0,\"z\",\"\")","v":"z"},null,1250,2500,5,null,{"$f":"SUMIFS($G$62:$G$116,$D$62:$D$116,Таблица3[[#This Row],[Дл]],$C$62:$C$116,Таблица3[[#This Row],[Шир]],$AC$62:$AC$116,Таблица3[[#This Row],[Толщ]],$F$62:$F$116,Таблица3[[#This Row],[Астра]])","v":0},null,{"$f":"CONCATENATE(Таблица3[[#This Row],[Столбец29]],\" \",Таблица3[[#This Row],[Толщ]])","v":"Лист 5"},null,{"$f":"Таблица3[[#This Row],[Толщ]]","v":5},null,{"$f":"SUMIFS($M$62:$M$116,$C$62:$C$116,Таблица3[[#This Row],[Шир]],$D$62:$D$116,Таблица3[[#This Row],[Дл]],$AC$62:$AC$116,Таблица3[[#This Row],[Толщ]],$F$62:$F$116,Таблица3[[#This Row],[Астра]])","v":0},{"$f":"SUMIFS($M$62:$M$116,$AC$62:$AC$116,Таблица3[[#This Row],[Толщ]],$C$62:$C$116,\"<\"&Таблица3[[#This Row],[Шир]],$D$62:$D$116,Таблица3[[#This Row],[Дл]],$F$62:$F$116,Таблица3[[#This Row],[Астра]])+SUMIFS($M$62:$M$116,$AC$62:$AC$116,Таблица3[[#This Row],[Толщ]],$C$62:$C$116,Таблица3[[#This Row],[Шир]],$D$62:$D$116,\"<\"&Таблица3[[#This Row],[Дл]],$F$62:$F$116,Таблица3[[#This Row],[Астра]])+SUMIFS($M$62:$M$116,$AC$62:$AC$116,Таблица3[[#This Row],[Толщ]],$C$62:$C$116,\"<\"&Таблица3[[#This Row],[Шир]],$D$62:$D$116,\"<\"&Таблица3[[#This Row],[Дл]],$F$62:$F$116,Таблица3[[#This Row],[Астра]])","v":0},{"$f":"Таблица3[[#This Row],[Ст10]]+Таблица3[[#This Row],[Ст11]]","v":0},{"$f":"SUMIFS($P$62:$P$116,$C$62:$C$116,Таблица3[[#This Row],[Шир]],$D$62:$D$116,Таблица3[[#This Row],[Дл]],$AC$62:$AC$116,Таблица3[[#This Row],[Толщ]],$F$62:$F$116,Таблица3[[#This Row],[Астра]])","v":0},{"$f":"SUMIFS($P$62:$P$116,$AC$62:$AC$116,Таблица3[[#This Row],[Толщ]],$C$62:$C$116,\"<\"&Таблица3[[#This Row],[Шир]],$D$62:$D$116,Таблица3[[#This Row],[Дл]],$F$62:$F$116,Таблица3[[#This Row],[Астра]])+SUMIFS($P$62:$P$116,$AC$62:$AC$116,Таблица3[[#This Row],[Толщ]],$C$62:$C$116,Таблица3[[#This Row],[Шир]],$D$62:$D$116,\"<\"&Таблица3[[#This Row],[Дл]],$F$62:$F$116,Таблица3[[#This Row],[Астра]])+SUMIFS($P$62:$P$116,$AC$62:$AC$116,Таблица3[[#This Row],[Толщ]],$C$62:$C$116,\"<\"&Таблица3[[#This Row],[Шир]],$D$62:$D$116,\"<\"&Таблица3[[#This Row],[Дл]],$F$62:$F$116,Таблица3[[#This Row],[Астра]])","v":0},{"$f":"Таблица3[[#This Row],[Ст13]]+Таблица3[[#This Row],[Ст14]]","v":0},{"$f":"SUMIFS($S$62:$S$116,$C$62:$C$116,Таблица3[[#This Row],[Шир]],$D$62:$D$116,Таблица3[[#This Row],[Дл]],$AC$62:$AC$116,Таблица3[[#This Row],[Толщ]],$F$62:$F$116,Таблица3[[#This Row],[Астра]])","v":0},{"$f":"SUMIFS($S$62:$S$116,$AC$62:$AC$116,Таблица3[[#This Row],[Толщ]],$C$62:$C$116,\"<\"&Таблица3[[#This Row],[Шир]],$D$62:$D$116,Таблица3[[#This Row],[Дл]],$F$62:$F$116,Таблица3[[#This Row],[Астра]])+SUMIFS($S$62:$S$116,$AC$62:$AC$116,Таблица3[[#This Row],[Толщ]],$C$62:$C$116,Таблица3[[#This Row],[Шир]],$D$62:$D$116,\"<\"&Таблица3[[#This Row],[Дл]],$F$62:$F$116,Таблица3[[#This Row],[Астра]])+SUMIFS($S$62:$S$116,$AC$62:$AC$116,Таблица3[[#This Row],[Толщ]],$C$62:$C$116,\"<\"&Таблица3[[#This Row],[Шир]],$D$62:$D$116,\"<\"&Таблица3[[#This Row],[Дл]],$F$62:$F$116,Таблица3[[#This Row],[Астра]])","v":0},{"$f":"Таблица3[[#This Row],[Ст16]]+Таблица3[[#This Row],[Ст17]]","v":0},{"$f":"Таблица3[[#This Row],[Ст18]]+Таблица3[[#This Row],[Столбец32]]","v":0},{"$f":"SUMIFS($V$62:$V$116,$C$62:$C$116,Таблица3[[#This Row],[Шир]],$D$62:$D$116,Таблица3[[#This Row],[Дл]],$AC$62:$AC$116,Таблица3[[#This Row],[Толщ]],$F$62:$F$116,Таблица3[[#This Row],[Астра]])","v":0},{"$f":"SUMIFS($V$62:$V$116,$AC$62:$AC$116,Таблица3[[#This Row],[Толщ]],$C$62:$C$116,\"<\"&Таблица3[[#This Row],[Шир]],$D$62:$D$116,Таблица3[[#This Row],[Дл]],$F$62:$F$116,Таблица3[[#This Row],[Астра]])+SUMIFS($V$62:$V$116,$AC$62:$AC$116,Таблица3[[#This Row],[Толщ]],$C$62:$C$116,Таблица3[[#This Row],[Шир]],$D$62:$D$116,\"<\"&Таблица3[[#This Row],[Дл]],$F$62:$F$116,Таблица3[[#This Row],[Астра]])+SUMIFS($V$62:$V$116,$AC$62:$AC$116,Таблица3[[#This Row],[Толщ]],$C$62:$C$116,\"<\"&Таблица3[[#This Row],[Шир]],$D$62:$D$116,\"<\"&Таблица3[[#This Row],[Дл]],$F$62:$F$116,Таблица3[[#This Row],[Астра]])","v":0},{"$f":"Таблица3[[#This Row],[Ст19]]+Таблица3[[#This Row],[Ст20]]","v":0},{"$f":"Таблица3[[#This Row],[Ст21]]-Таблица3[[#This Row],[Столбец32]]","v":0},null,"Лист лазер, 5.0 мм, лт","Лист лазер","Лист",7.8739999999999997,{"$f":"SUBSTITUTE(Таблица3[[#This Row],[Толщ]],\",\",\".\")","v":"5"},{"$f":"SUMIFS($AA$8:$AA$57,$H$8:$H$57,Таблица3[[#This Row],[Столбец28]],$G$8:$G$57,Таблица3[[#This Row],[Толщ]])","v":0}]
[{"$f":"IF(Таблица3[[#All],[Ст21]]=0,\"z\",\"\")","v":"z"},null,1250,2500,6,null,{"$f":"SUMIFS($G$62:$G$116,$D$62:$D$116,Таблица3[[#This Row],[Дл]],$C$62:$C$116,Таблица3[[#This Row],[Шир]],$AC$62:$AC$116,Таблица3[[#This Row],[Толщ]],$F$62:$F$116,Таблица3[[#This Row],[Астра]])","v":0},null,{"$f":"CONCATENATE(Таблица3[[#This Row],[Столбец29]],\" \",Таблица3[[#This Row],[Толщ]])","v":"Лист 6"},null,{"$f":"Таблица3[[#This Row],[Толщ]]","v":6},null,{"$f":"SUMIFS($M$62:$M$116,$C$62:$C$116,Таблица3[[#This Row],[Шир]],$D$62:$D$116,Таблица3[[#This Row],[Дл]],$AC$62:$AC$116,Таблица3[[#This Row],[Толщ]],$F$62:$F$116,Таблица3[[#This Row],[Астра]])","v":0},{"$f":"SUMIFS($M$62:$M$116,$AC$62:$AC$116,Таблица3[[#This Row],[Толщ]],$C$62:$C$116,\"<\"&Таблица3[[#This Row],[Шир]],$D$62:$D$116,Таблица3[[#This Row],[Дл]],$F$62:$F$116,Таблица3[[#This Row],[Астра]])+SUMIFS($M$62:$M$116,$AC$62:$AC$116,Таблица3[[#This Row],[Толщ]],$C$62:$C$116,Таблица3[[#This Row],[Шир]],$D$62:$D$116,\"<\"&Таблица3[[#This Row],[Дл]],$F$62:$F$116,Таблица3[[#This Row],[Астра]])+SUMIFS($M$62:$M$116,$AC$62:$AC$116,Таблица3[[#This Row],[Толщ]],$C$62:$C$116,\"<\"&Таблица3[[#This Row],[Шир]],$D$62:$D$116,\"<\"&Таблица3[[#This Row],[Дл]],$F$62:$F$116,Таблица3[[#This Row],[Астра]])","v":0},{"$f":"Таблица3[[#This Row],[Ст10]]+Таблица3[[#This Row],[Ст11]]","v":0},{"$f":"SUMIFS($P$62:$P$116,$C$62:$C$116,Таблица3[[#This Row],[Шир]],$D$62:$D$116,Таблица3[[#This Row],[Дл]],$AC$62:$AC$116,Таблица3[[#This Row],[Толщ]],$F$62:$F$116,Таблица3[[#This Row],[Астра]])","v":0},{"$f":"SUMIFS($P$62:$P$116,$AC$62:$AC$116,Таблица3[[#This Row],[Толщ]],$C$62:$C$116,\"<\"&Таблица3[[#This Row],[Шир]],$D$62:$D$116,Таблица3[[#This Row],[Дл]],$F$62:$F$116,Таблица3[[#This Row],[Астра]])+SUMIFS($P$62:$P$116,$AC$62:$AC$116,Таблица3[[#This Row],[Толщ]],$C$62:$C$116,Таблица3[[#This Row],[Шир]],$D$62:$D$116,\"<\"&Таблица3[[#This Row],[Дл]],$F$62:$F$116,Таблица3[[#This Row],[Астра]])+SUMIFS($P$62:$P$116,$AC$62:$AC$116,Таблица3[[#This Row],[Толщ]],$C$62:$C$116,\"<\"&Таблица3[[#This Row],[Шир]],$D$62:$D$116,\"<\"&Таблица3[[#This Row],[Дл]],$F$62:$F$116,Таблица3[[#This Row],[Астра]])","v":0},{"$f":"Таблица3[[#This Row],[Ст13]]+Таблица3[[#This Row],[Ст14]]","v":0},{"$f":"SUMIFS($S$62:$S$116,$C$62:$C$116,Таблица3[[#This Row],[Шир]],$D$62:$D$116,Таблица3[[#This Row],[Дл]],$AC$62:$AC$116,Таблица3[[#This Row],[Толщ]],$F$62:$F$116,Таблица3[[#This Row],[Астра]])","v":0},{"$f":"SUMIFS($S$62:$S$116,$AC$62:$AC$116,Таблица3[[#This Row],[Толщ]],$C$62:$C$116,\"<\"&Таблица3[[#This Row],[Шир]],$D$62:$D$116,Таблица3[[#This Row],[Дл]],$F$62:$F$116,Таблица3[[#This Row],[Астра]])+SUMIFS($S$62:$S$116,$AC$62:$AC$116,Таблица3[[#This Row],[Толщ]],$C$62:$C$116,Таблица3[[#This Row],[Шир]],$D$62:$D$116,\"<\"&Таблица3[[#This Row],[Дл]],$F$62:$F$116,Таблица3[[#This Row],[Астра]])+SUMIFS($S$62:$S$116,$AC$62:$AC$116,Таблица3[[#This Row],[Толщ]],$C$62:$C$116,\"<\"&Таблица3[[#This Row],[Шир]],$D$62:$D$116,\"<\"&Таблица3[[#This Row],[Дл]],$F$62:$F$116,Таблица3[[#This Row],[Астра]])","v":0},{"$f":"Таблица3[[#This Row],[Ст16]]+Таблица3[[#This Row],[Ст17]]","v":0},{"$f":"Таблица3[[#This Row],[Ст18]]+Таблица3[[#This Row],[Столбец32]]","v":0},{"$f":"SUMIFS($V$62:$V$116,$C$62:$C$116,Таблица3[[#This Row],[Шир]],$D$62:$D$116,Таблица3[[#This Row],[Дл]],$AC$62:$AC$116,Таблица3[[#This Row],[Толщ]],$F$62:$F$116,Таблица3[[#This Row],[Астра]])","v":0},{"$f":"SUMIFS($V$62:$V$116,$AC$62:$AC$116,Таблица3[[#This Row],[Толщ]],$C$62:$C$116,\"<\"&Таблица3[[#This Row],[Шир]],$D$62:$D$116,Таблица3[[#This Row],[Дл]],$F$62:$F$116,Таблица3[[#This Row],[Астра]])+SUMIFS($V$62:$V$116,$AC$62:$AC$116,Таблица3[[#This Row],[Толщ]],$C$62:$C$116,Таблица3[[#This Row],[Шир]],$D$62:$D$116,\"<\"&Таблица3[[#This Row],[Дл]],$F$62:$F$116,Таблица3[[#This Row],[Астра]])+SUMIFS($V$62:$V$116,$AC$62:$AC$116,Таблица3[[#This Row],[Толщ]],$C$62:$C$116,\"<\"&Таблица3[[#This Row],[Шир]],$D$62:$D$116,\"<\"&Таблица3[[#This Row],[Дл]],$F$62:$F$116,Таблица3[[#This Row],[Астра]])","v":0},{"$f":"Таблица3[[#This Row],[Ст19]]+Таблица3[[#This Row],[Ст20]]","v":0},{"$f":"Таблица3[[#This Row],[Ст21]]-Таблица3[[#This Row],[Столбец32]]","v":0},null,"Лист лазер, 6.0 мм, лт","Лист лазер","Лист",7.8739999999999997,{"$f":"SUBSTITUTE(Таблица3[[#This Row],[Толщ]],\",\",\".\")","v":"6"},{"$f":"SUMIFS($AA$8:$AA$57,$H$8:$H$57,Таблица3[[#This Row],[Столбец28]],$G$8:$G$57,Таблица3[[#This Row],[Толщ]])","v":0}]
[{"$f":"IF(Таблица3[[#All],[Ст21]]=0,\"z\",\"\")","v":"z"},null,1250,2500,7,null,{"$f":"SUMIFS($G$62:$G$116,$D$62:$D$116,Таблица3[[#This Row],[Дл]],$C$62:$C$116,Таблица3[[#This Row],[Шир]],$AC$62:$AC$116,Таблица3[[#This Row],[Толщ]],$F$62:$F$116,Таблица3[[#This Row],[Астра]])","v":0},null,{"$f":"CONCATENATE(Таблица3[[#This Row],[Столбец29]],\" \",Таблица3[[#This Row],[Толщ]])","v":"Лист 7"},null,{"$f":"Таблица3[[#This Row],[Толщ]]","v":7},null,{"$f":"SUMIFS($M$62:$M$116,$C$62:$C$116,Таблица3[[#This Row],[Шир]],$D$62:$D$116,Таблица3[[#This Row],[Дл]],$AC$62:$AC$116,Таблица3[[#This Row],[Толщ]],$F$62:$F$116,Таблица3[[#This Row],[Астра]])","v":0},{"$f":"SUMIFS($M$62:$M$116,$AC$62:$AC$116,Таблица3[[#This Row],[Толщ]],$C$62:$C$116,\"<\"&Таблица3[[#This Row],[Шир]],$D$62:$D$116,Таблица3[[#This Row],[Дл]],$F$62:$F$116,Таблица3[[#This Row],[Астра]])+SUMIFS($M$62:$M$116,$AC$62:$AC$116,Таблица3[[#This Row],[Толщ]],$C$62:$C$116,Таблица3[[#This Row],[Шир]],$D$62:$D$116,\"<\"&Таблица3[[#This Row],[Дл]],$F$62:$F$116,Таблица3[[#This Row],[Астра]])+SUMIFS($M$62:$M$116,$AC$62:$AC$116,Таблица3[[#This Row],[Толщ]],$C$62:$C$116,\"<\"&Таблица3[[#This Row],[Шир]],$D$62:$D$116,\"<\"&Таблица3[[#This Row],[Дл]],$F$62:$F$116,Таблица3[[#This Row],[Астра]])","v":0},{"$f":"Таблица3[[#This Row],[Ст10]]+Таблица3[[#This Row],[Ст11]]","v":0},{"$f":"SUMIFS($P$62:$P$116,$C$62:$C$116,Таблица3[[#This Row],[Шир]],$D$62:$D$116,Таблица3[[#This Row],[Дл]],$AC$62:$AC$116,Таблица3[[#This Row],[Толщ]],$F$62:$F$116,Таблица3[[#This Row],[Астра]])","v":0},{"$f":"SUMIFS($P$62:$P$116,$AC$62:$AC$116,Таблица3[[#This Row],[Толщ]],$C$62:$C$116,\"<\"&Таблица3[[#This Row],[Шир]],$D$62:$D$116,Таблица3[[#This Row],[Дл]],$F$62:$F$116,Таблица3[[#This Row],[Астра]])+SUMIFS($P$62:$P$116,$AC$62:$AC$116,Таблица3[[#This Row],[Толщ]],$C$62:$C$116,Таблица3[[#This Row],[Шир]],$D$62:$D$116,\"<\"&Таблица3[[#This Row],[Дл]],$F$62:$F$116,Таблица3[[#This Row],[Астра]])+SUMIFS($P$62:$P$116,$AC$62:$AC$116,Таблица3[[#This Row],[Толщ]],$C$62:$C$116,\"<\"&Таблица3[[#This Row],[Шир]],$D$62:$D$116,\"<\"&Таблица3[[#This Row],[Дл]],$F$62:$F$116,Таблица3[[#This Row],[Астра]])","v":0},{"$f":"Таблица3[[#This Row],[Ст13]]+Таблица3[[#This Row],[Ст14]]","v":0},{"$f":"SUMIFS($S$62:$S$116,$C$62:$C$116,Таблица3[[#This Row],[Шир]],$D$62:$D$116,Таблица3[[#This Row],[Дл]],$AC$62:$AC$116,Таблица3[[#This Row],[Толщ]],$F$62:$F$116,Таблица3[[#This Row],[Астра]])","v":0},{"$f":"SUMIFS($S$62:$S$116,$AC$62:$AC$116,Таблица3[[#This Row],[Толщ]],$C$62:$C$116,\"<\"&Таблица3[[#This Row],[Шир]],$D$62:$D$116,Таблица3[[#This Row],[Дл]],$F$62:$F$116,Таблица3[[#This Row],[Астра]])+SUMIFS($S$62:$S$116,$AC$62:$AC$116,Таблица3[[#This Row],[Толщ]],$C$62:$C$116,Таблица3[[#This Row],[Шир]],$D$62:$D$116,\"<\"&Таблица3[[#This Row],[Дл]],$F$62:$F$116,Таблица3[[#This Row],[Астра]])+SUMIFS($S$62:$S$116,$AC$62:$AC$116,Таблица3[[#This Row],[Толщ]],$C$62:$C$116,\"<\"&Таблица3[[#This Row],[Шир]],$D$62:$D$116,\"<\"&Таблица3[[#This Row],[Дл]],$F$62:$F$116,Таблица3[[#This Row],[Астра]])","v":0},{"$f":"Таблица3[[#This Row],[Ст16]]+Таблица3[[#This Row],[Ст17]]","v":0},{"$f":"Таблица3[[#This Row],[Ст18]]+Таблица3[[#This Row],[Столбец32]]","v":0},{"$f":"SUMIFS($V$62:$V$116,$C$62:$C$116,Таблица3[[#This Row],[Шир]],$D$62:$D$116,Таблица3[[#This Row],[Дл]],$AC$62:$AC$116,Таблица3[[#This Row],[Толщ]],$F$62:$F$116,Таблица3[[#This Row],[Астра]])","v":0},{"$f":"SUMIFS($V$62:$V$116,$AC$62:$AC$116,Таблица3[[#This Row],[Толщ]],$C$62:$C$116,\"<\"&Таблица3[[#This Row],[Шир]],$D$62:$D$116,Таблица3[[#This Row],[Дл]],$F$62:$F$116,Таблица3[[#This Row],[Астра]])+SUMIFS($V$62:$V$116,$AC$62:$AC$116,Таблица3[[#This Row],[Толщ]],$C$62:$C$116,Таблица3[[#This Row],[Шир]],$D$62:$D$116,\"<\"&Таблица3[[#This Row],[Дл]],$F$62:$F$116,Таблица3[[#This Row],[Астра]])+SUMIFS($V$62:$V$116,$AC$62:$AC$116,Таблица3[[#This Row],[Толщ]],$C$62:$C$116,\"<\"&Таблица3[[#This Row],[Шир]],$D$62:$D$116,\"<\"&Таблица3[[#This Row],[Дл]],$F$62:$F$116,Таблица3[[#This Row],[Астра]])","v":0},{"$f":"Таблица3[[#This Row],[Ст19]]+Таблица3[[#This Row],[Ст20]]","v":0},{"$f":"Таблица3[[#This Row],[Ст21]]-Таблица3[[#This Row],[Столбец32]]","v":0},null,"Лист лазер, 7.0 мм, лт","Лист лазер","Лист",7.8739999999999997,{"$f":"SUBSTITUTE(Таблица3[[#This Row],[Толщ]],\",\",\".\")","v":"7"},{"$f":"SUMIFS($AA$8:$AA$57,$H$8:$H$57,Таблица3[[#This Row],[Столбец28]],$G$8:$G$57,Таблица3[[#This Row],[Толщ]])","v":0}]
[{"$f":"IF(Таблица3[[#All],[Ст21]]=0,\"z\",\"\")","v":"z"},null,1250,2500,8,null,{"$f":"SUMIFS($G$62:$G$116,$D$62:$D$116,Таблица3[[#This Row],[Дл]],$C$62:$C$116,Таблица3[[#This Row],[Шир]],$AC$62:$AC$116,Таблица3[[#This Row],[Толщ]],$F$62:$F$116,Таблица3[[#This Row],[Астра]])","v":0},null,{"$f":"CONCATENATE(Таблица3[[#This Row],[Столбец29]],\" \",Таблица3[[#This Row],[Толщ]])","v":"Лист 8"},null,{"$f":"Таблица3[[#This Row],[Толщ]]","v":8},null,{"$f":"SUMIFS($M$62:$M$116,$C$62:$C$116,Таблица3[[#This Row],[Шир]],$D$62:$D$116,Таблица3[[#This Row],[Дл]],$AC$62:$AC$116,Таблица3[[#This Row],[Толщ]],$F$62:$F$116,Таблица3[[#This Row],[Астра]])","v":0},{"$f":"SUMIFS($M$62:$M$116,$AC$62:$AC$116,Таблица3[[#This Row],[Толщ]],$C$62:$C$116,\"<\"&Таблица3[[#This Row],[Шир]],$D$62:$D$116,Таблица3[[#This Row],[Дл]],$F$62:$F$116,Таблица3[[#This Row],[Астра]])+SUMIFS($M$62:$M$116,$AC$62:$AC$116,Таблица3[[#This Row],[Толщ]],$C$62:$C$116,Таблица3[[#This Row],[Шир]],$D$62:$D$116,\"<\"&Таблица3[[#This Row],[Дл]],$F$62:$F$116,Таблица3[[#This Row],[Астра]])+SUMIFS($M$62:$M$116,$AC$62:$AC$116,Таблица3[[#This Row],[Толщ]],$C$62:$C$116,\"<\"&Таблица3[[#This Row],[Шир]],$D$62:$D$116,\"<\"&Таблица3[[#This Row],[Дл]],$F$62:$F$116,Таблица3[[#This Row],[Астра]])","v":0},{"$f":"Таблица3[[#This Row],[Ст10]]+Таблица3[[#This Row],[Ст11]]","v":0},{"$f":"SUMIFS($P$62:$P$116,$C$62:$C$116,Таблица3[[#This Row],[Шир]],$D$62:$D$116,Таблица3[[#This Row],[Дл]],$AC$62:$AC$116,Таблица3[[#This Row],[Толщ]],$F$62:$F$116,Таблица3[[#This Row],[Астра]])","v":0},{"$f":"SUMIFS($P$62:$P$116,$AC$62:$AC$116,Таблица3[[#This Row],[Толщ]],$C$62:$C$116,\"<\"&Таблица3[[#This Row],[Шир]],$D$62:$D$116,Таблица3[[#This Row],[Дл]],$F$62:$F$116,Таблица3[[#This Row],[Астра]])+SUMIFS($P$62:$P$116,$AC$62:$AC$116,Таблица3[[#This Row],[Толщ]],$C$62:$C$116,Таблица3[[#This Row],[Шир]],$D$62:$D$116,\"<\"&Таблица3[[#This Row],[Дл]],$F$62:$F$116,Таблица3[[#This Row],[Астра]])+SUMIFS($P$62:$P$116,$AC$62:$AC$116,Таблица3[[#This Row],[Толщ]],$C$62:$C$116,\"<\"&Таблица3[[#This Row],[Шир]],$D$62:$D$116,\"<\"&Таблица3[[#This Row],[Дл]],$F$62:$F$116,Таблица3[[#This Row],[Астра]])","v":0},{"$f":"Таблица3[[#This Row],[Ст13]]+Таблица3[[#This Row],[Ст14]]","v":0},{"$f":"SUMIFS($S$62:$S$116,$C$62:$C$116,Таблица3[[#This Row],[Шир]],$D$62:$D$116,Таблица3[[#This Row],[Дл]],$AC$62:$AC$116,Таблица3[[#This Row],[Толщ]],$F$62:$F$116,Таблица3[[#This Row],[Астра]])","v":0},{"$f":"SUMIFS($S$62:$S$116,$AC$62:$AC$116,Таблица3[[#This Row],[Толщ]],$C$62:$C$116,\"<\"&Таблица3[[#This Row],[Шир]],$D$62:$D$116,Таблица3[[#This Row],[Дл]],$F$62:$F$116,Таблица3[[#This Row],[Астра]])+SUMIFS($S$62:$S$116,$AC$62:$AC$116,Таблица3[[#This Row],[Толщ]],$C$62:$C$116,Таблица3[[#This Row],[Шир]],$D$62:$D$116,\"<\"&Таблица3[[#This Row],[Дл]],$F$62:$F$116,Таблица3[[#This Row],[Астра]])+SUMIFS($S$62:$S$116,$AC$62:$AC$116,Таблица3[[#This Row],[Толщ]],$C$62:$C$116,\"<\"&Таблица3[[#This Row],[Шир]],$D$62:$D$116,\"<\"&Таблица3[[#This Row],[Дл]],$F$62:$F$116,Таблица3[[#This Row],[Астра]])","v":0},{"$f":"Таблица3[[#This Row],[Ст16]]+Таблица3[[#This Row],[Ст17]]","v":0},{"$f":"Таблица3[[#This Row],[Ст18]]+Таблица3[[#This Row],[Столбец32]]","v":0},{"$f":"SUMIFS($V$62:$V$116,$C$62:$C$116,Таблица3[[#This Row],[Шир]],$D$62:$D$116,Таблица3[[#This Row],[Дл]],$AC$62:$AC$116,Таблица3[[#This Row],[Толщ]],$F$62:$F$116,Таблица3[[#This Row],[Астра]])","v":0},{"$f":"SUMIFS($V$62:$V$116,$AC$62:$AC$116,Таблица3[[#This Row],[Толщ]],$C$62:$C$116,\"<\"&Таблица3[[#This Row],[Шир]],$D$62:$D$116,Таблица3[[#This Row],[Дл]],$F$62:$F$116,Таблица3[[#This Row],[Астра]])+SUMIFS($V$62:$V$116,$AC$62:$AC$116,Таблица3[[#This Row],[Толщ]],$C$62:$C$116,Таблица3[[#This Row],[Шир]],$D$62:$D$116,\"<\"&Таблица3[[#This Row],[Дл]],$F$62:$F$116,Таблица3[[#This Row],[Астра]])+SUMIFS($V$62:$V$116,$AC$62:$AC$116,Таблица3[[#This Row],[Толщ]],$C$62:$C$116,\"<\"&Таблица3[[#This Row],[Шир]],$D$62:$D$116,\"<\"&Таблица3[[#This Row],[Дл]],$F$62:$F$116,Таблица3[[#This Row],[Астра]])","v":0},{"$f":"Таблица3[[#This Row],[Ст19]]+Таблица3[[#This Row],[Ст20]]","v":0},{"$f":"Таблица3[[#This Row],[Ст21]]-Таблица3[[#This Row],[Столбец32]]","v":0},null,"Лист лазер, 8.0 мм, лт","Лист лазер","Лист",7.8739999999999997,{"$f":"SUBSTITUTE(Таблица3[[#This Row],[Толщ]],\",\",\".\")","v":"8"},{"$f":"SUMIFS($AA$8:$AA$57,$H$8:$H$57,Таблица3[[#This Row],[Столбец28]],$G$8:$G$57,Таблица3[[#This Row],[Толщ]])","v":0}]
[{"$f":"IF(Таблица3[[#All],[Ст21]]=0,\"z\",\"\")","v":"z"},null,1250,2500,1,null,{"$f":"SUMIFS($G$62:$G$116,$D$62:$D$116,Таблица3[[#This Row],[Дл]],$C$62:$C$116,Таблица3[[#This Row],[Шир]],$AC$62:$AC$116,Таблица3[[#This Row],[Толщ]],$F$62:$F$116,Таблица3[[#This Row],[Астра]])","v":0},null,{"$f":"CONCATENATE(Таблица3[[#This Row],[Столбец29]],\" \",Таблица3[[#This Row],[Толщ]])","v":"Лист ОЦ 1"},null,{"$f":"Таблица3[[#This Row],[Толщ]]","v":1},null,{"$f":"SUMIFS($M$62:$M$116,$C$62:$C$116,Таблица3[[#This Row],[Шир]],$D$62:$D$116,Таблица3[[#This Row],[Дл]],$AC$62:$AC$116,Таблица3[[#This Row],[Толщ]],$F$62:$F$116,Таблица3[[#This Row],[Астра]])","v":0},{"$f":"SUMIFS($M$62:$M$116,$AC$62:$AC$116,Таблица3[[#This Row],[Толщ]],$C$62:$C$116,\"<\"&Таблица3[[#This Row],[Шир]],$D$62:$D$116,Таблица3[[#This Row],[Дл]],$F$62:$F$116,Таблица3[[#This Row],[Астра]])+SUMIFS($M$62:$M$116,$AC$62:$AC$116,Таблица3[[#This Row],[Толщ]],$C$62:$C$116,Таблица3[[#This Row],[Шир]],$D$62:$D$116,\"<\"&Таблица3[[#This Row],[Дл]],$F$62:$F$116,Таблица3[[#This Row],[Астра]])+SUMIFS($M$62:$M$116,$AC$62:$AC$116,Таблица3[[#This Row],[Толщ]],$C$62:$C$116,\"<\"&Таблица3[[#This Row],[Шир]],$D$62:$D$116,\"<\"&Таблица3[[#This Row],[Дл]],$F$62:$F$116,Таблица3[[#This Row],[Астра]])","v":0},{"$f":"Таблица3[[#This Row],[Ст10]]+Таблица3[[#This Row],[Ст11]]","v":0},{"$f":"SUMIFS($P$62:$P$116,$C$62:$C$116,Таблица3[[#This Row],[Шир]],$D$62:$D$116,Таблица3[[#This Row],[Дл]],$AC$62:$AC$116,Таблица3[[#This Row],[Толщ]],$F$62:$F$116,Таблица3[[#This Row],[Астра]])","v":0},{"$f":"SUMIFS($P$62:$P$116,$AC$62:$AC$116,Таблица3[[#This Row],[Толщ]],$C$62:$C$116,\"<\"&Таблица3[[#This Row],[Шир]],$D$62:$D$116,Таблица3[[#This Row],[Дл]],$F$62:$F$116,Таблица3[[#This Row],[Астра]])+SUMIFS($P$62:$P$116,$AC$62:$AC$116,Таблица3[[#This Row],[Толщ]],$C$62:$C$116,Таблица3[[#This Row],[Шир]],$D$62:$D$116,\"<\"&Таблица3[[#This Row],[Дл]],$F$62:$F$116,Таблица3[[#This Row],[Астра]])+SUMIFS($P$62:$P$116,$AC$62:$AC$116,Таблица3[[#This Row],[Толщ]],$C$62:$C$116,\"<\"&Таблица3[[#This Row],[Шир]],$D$62:$D$116,\"<\"&Таблица3[[#This Row],[Дл]],$F$62:$F$116,Таблица3[[#This Row],[Астра]])","v":0},{"$f":"Таблица3[[#This Row],[Ст13]]+Таблица3[[#This Row],[Ст14]]","v":0},{"$f":"SUMIFS($S$62:$S$116,$C$62:$C$116,Таблица3[[#This Row],[Шир]],$D$62:$D$116,Таблица3[[#This Row],[Дл]],$AC$62:$AC$116,Таблица3[[#This Row],[Толщ]],$F$62:$F$116,Таблица3[[#This Row],[Астра]])","v":0},{"$f":"SUMIFS($S$62:$S$116,$AC$62:$AC$116,Таблица3[[#This Row],[Толщ]],$C$62:$C$116,\"<\"&Таблица3[[#This Row],[Шир]],$D$62:$D$116,Таблица3[[#This Row],[Дл]],$F$62:$F$116,Таблица3[[#This Row],[Астра]])+SUMIFS($S$62:$S$116,$AC$62:$AC$116,Таблица3[[#This Row],[Толщ]],$C$62:$C$116,Таблица3[[#This Row],[Шир]],$D$62:$D$116,\"<\"&Таблица3[[#This Row],[Дл]],$F$62:$F$116,Таблица3[[#This Row],[Астра]])+SUMIFS($S$62:$S$116,$AC$62:$AC$116,Таблица3[[#This Row],[Толщ]],$C$62:$C$116,\"<\"&Таблица3[[#This Row],[Шир]],$D$62:$D$116,\"<\"&Таблица3[[#This Row],[Дл]],$F$62:$F$116,Таблица3[[#This Row],[Астра]])","v":0},{"$f":"Таблица3[[#This Row],[Ст16]]+Таблица3[[#This Row],[Ст17]]","v":0},{"$f":"Таблица3[[#This Row],[Ст18]]+Таблица3[[#This Row],[Столбец32]]","v":0},{"$f":"SUMIFS($V$62:$V$116,$C$62:$C$116,Таблица3[[#This Row],[Шир]],$D$62:$D$116,Таблица3[[#This Row],[Дл]],$AC$62:$AC$116,Таблица3[[#This Row],[Толщ]],$F$62:$F$116,Таблица3[[#This Row],[Астра]])","v":0},{"$f":"SUMIFS($V$62:$V$116,$AC$62:$AC$116,Таблица3[[#This Row],[Толщ]],$C$62:$C$116,\"<\"&Таблица3[[#This Row],[Шир]],$D$62:$D$116,Таблица3[[#This Row],[Дл]],$F$62:$F$116,Таблица3[[#This Row],[Астра]])+SUMIFS($V$62:$V$116,$AC$62:$AC$116,Таблица3[[#This Row],[Толщ]],$C$62:$C$116,Таблица3[[#This Row],[Шир]],$D$62:$D$116,\"<\"&Таблица3[[#This Row],[Дл]],$F$62:$F$116,Таблица3[[#This Row],[Астра]])+SUMIFS($V$62:$V$116,$AC$62:$AC$116,Таблица3[[#This Row],[Толщ]],$C$62:$C$116,\"<\"&Таблица3[[#This Row],[Шир]],$D$62:$D$116,\"<\"&Таблица3[[#This Row],[Дл]],$F$62:$F$116,Таблица3[[#This Row],[Астра]])","v":0},{"$f":"Таблица3[[#This Row],[Ст19]]+Таблица3[[#This Row],[Ст20]]","v":0},{"$f":"Таблица3[[#This Row],[Ст21]]-Таблица3[[#This Row],[Столбец32]]","v":0},null,null,"листоц","Лист ОЦ",7.8888879999999997,{"$f":"SUBSTITUTE(Таблица3[[#This Row],[Толщ]],\",\",\".\")","v":"1"},{"$f":"SUMIFS($AA$8:$AA$57,$H$8:$H$57,Таблица3[[#This Row],[Столбец28]],$G$8:$G$57,Таблица3[[#This Row],[Толщ]])","v":0}]
[{"$f":"IF(Таблица3[[#All],[Ст21]]=0,\"z\",\"\")","v":"z"},null,1250,2500,1,null,{"$f":"SUMIFS($G$62:$G$116,$D$62:$D$116,Таблица3[[#This Row],[Дл]],$C$62:$C$116,Таблица3[[#This Row],[Шир]],$AC$62:$AC$116,Таблица3[[#This Row],[Толщ]],$F$62:$F$116,Таблица3[[#This Row],[Астра]])","v":0},null,{"$f":"CONCATENATE(Таблица3[[#This Row],[Столбец29]],\" \",Таблица3[[#This Row],[Толщ]])","v":"Сетка ПВЛ 1"},null,{"$f":"Таблица3[[#This Row],[Толщ]]","v":1},null,{"$f":"SUMIFS($M$62:$M$116,$C$62:$C$116,Таблица3[[#This Row],[Шир]],$D$62:$D$116,Таблица3[[#This Row],[Дл]],$AC$62:$AC$116,Таблица3[[#This Row],[Толщ]],$F$62:$F$116,Таблица3[[#This Row],[Астра]])","v":0},{"$f":"SUMIFS($M$62:$M$116,$AC$62:$AC$116,Таблица3[[#This Row],[Толщ]],$C$62:$C$116,\"<\"&Таблица3[[#This Row],[Шир]],$D$62:$D$116,Таблица3[[#This Row],[Дл]],$F$62:$F$116,Таблица3[[#This Row],[Астра]])+SUMIFS($M$62:$M$116,$AC$62:$AC$116,Таблица3[[#This Row],[Толщ]],$C$62:$C$116,Таблица3[[#This Row],[Шир]],$D$62:$D$116,\"<\"&Таблица3[[#This Row],[Дл]],$F$62:$F$116,Таблица3[[#This Row],[Астра]])+SUMIFS($M$62:$M$116,$AC$62:$AC$116,Таблица3[[#This Row],[Толщ]],$C$62:$C$116,\"<\"&Таблица3[[#This Row],[Шир]],$D$62:$D$116,\"<\"&Таблица3[[#This Row],[Дл]],$F$62:$F$116,Таблица3[[#This Row],[Астра]])","v":0},{"$f":"Таблица3[[#This Row],[Ст10]]+Таблица3[[#This Row],[Ст11]]","v":0},{"$f":"SUMIFS($P$62:$P$116,$C$62:$C$116,Таблица3[[#This Row],[Шир]],$D$62:$D$116,Таблица3[[#This Row],[Дл]],$AC$62:$AC$116,Таблица3[[#This Row],[Толщ]],$F$62:$F$116,Таблица3[[#This Row],[Астра]])","v":0},{"$f":"SUMIFS($P$62:$P$116,$AC$62:$AC$116,Таблица3[[#This Row],[Толщ]],$C$62:$C$116,\"<\"&Таблица3[[#This Row],[Шир]],$D$62:$D$116,Таблица3[[#This Row],[Дл]],$F$62:$F$116,Таблица3[[#This Row],[Астра]])+SUMIFS($P$62:$P$116,$AC$62:$AC$116,Таблица3[[#This Row],[Толщ]],$C$62:$C$116,Таблица3[[#This Row],[Шир]],$D$62:$D$116,\"<\"&Таблица3[[#This Row],[Дл]],$F$62:$F$116,Таблица3[[#This Row],[Астра]])+SUMIFS($P$62:$P$116,$AC$62:$AC$116,Таблица3[[#This Row],[Толщ]],$C$62:$C$116,\"<\"&Таблица3[[#This Row],[Шир]],$D$62:$D$116,\"<\"&Таблица3[[#This Row],[Дл]],$F$62:$F$116,Таблица3[[#This Row],[Астра]])","v":0},{"$f":"Таблица3[[#This Row],[Ст13]]+Таблица3[[#This Row],[Ст14]]","v":0},{"$f":"SUMIFS($S$62:$S$116,$C$62:$C$116,Таблица3[[#This Row],[Шир]],$D$62:$D$116,Таблица3[[#This Row],[Дл]],$AC$62:$AC$116,Таблица3[[#This Row],[Толщ]],$F$62:$F$116,Таблица3[[#This Row],[Астра]])","v":0},{"$f":"SUMIFS($S$62:$S$116,$AC$62:$AC$116,Таблица3[[#This Row],[Толщ]],$C$62:$C$116,\"<\"&Таблица3[[#This Row],[Шир]],$D$62:$D$116,Таблица3[[#This Row],[Дл]],$F$62:$F$116,Таблица3[[#This Row],[Астра]])+SUMIFS($S$62:$S$116,$AC$62:$AC$116,Таблица3[[#This Row],[Толщ]],$C$62:$C$116,Таблица3[[#This Row],[Шир]],$D$62:$D$116,\"<\"&Таблица3[[#This Row],[Дл]],$F$62:$F$116,Таблица3[[#This Row],[Астра]])+SUMIFS($S$62:$S$116,$AC$62:$AC$116,Таблица3[[#This Row],[Толщ]],$C$62:$C$116,\"<\"&Таблица3[[#This Row],[Шир]],$D$62:$D$116,\"<\"&Таблица3[[#This Row],[Дл]],$F$62:$F$116,Таблица3[[#This Row],[Астра]])","v":0},{"$f":"Таблица3[[#This Row],[Ст16]]+Таблица3[[#This Row],[Ст17]]","v":0},{"$f":"Таблица3[[#This Row],[Ст18]]+Таблица3[[#This Row],[Столбец32]]","v":0},{"$f":"SUMIFS($V$62:$V$116,$C$62:$C$116,Таблица3[[#This Row],[Шир]],$D$62:$D$116,Таблица3[[#This Row],[Дл]],$AC$62:$AC$116,Таблица3[[#This Row],[Толщ]],$F$62:$F$116,Таблица3[[#This Row],[Астра]])","v":0},{"$f":"SUMIFS($V$62:$V$116,$AC$62:$AC$116,Таблица3[[#This Row],[Толщ]],$C$62:$C$116,\"<\"&Таблица3[[#This Row],[Шир]],$D$62:$D$116,Таблица3[[#This Row],[Дл]],$F$62:$F$116,Таблица3[[#This Row],[Астра]])+SUMIFS($V$62:$V$116,$AC$62:$AC$116,Таблица3[[#This Row],[Толщ]],$C$62:$C$116,Таблица3[[#This Row],[Шир]],$D$62:$D$116,\"<\"&Таблица3[[#This Row],[Дл]],$F$62:$F$116,Таблица3[[#This Row],[Астра]])+SUMIFS($V$62:$V$116,$AC$62:$AC$116,Таблица3[[#This Row],[Толщ]],$C$62:$C$116,\"<\"&Таблица3[[#This Row],[Шир]],$D$62:$D$116,\"<\"&Таблица3[[#This Row],[Дл]],$F$62:$F$116,Таблица3[[#This Row],[Астра]])","v":0},{"$f":"Таблица3[[#This Row],[Ст19]]+Таблица3[[#This Row],[Ст20]]","v":0},{"$f":"Таблица3[[#This Row],[Ст21]]-Таблица3[[#This Row],[Столбец32]]","v":0},null,null,"пвл1","Сетка ПВЛ",2.8888880000000001,{"$f":"SUBSTITUTE(Таблица3[[#This Row],[Толщ]],\",\",\".\")","v":"1"},{"$f":"SUMIFS($AA$8:$AA$57,$H$8:$H$57,Таблица3[[#This Row],[Столбец28]],$G$8:$G$57,Таблица3[[#This Row],[Толщ]])","v":0}]
[]
[]
[]
[]
[]
[]
[]
[null,"Подпись",null,null,null,"Инженер-технолог"]
[null,"Подпись",null,null,null,"Нач техотдела"]
[null,"Подпись",null,null,null,"Генеральный директор"]

{"sheet":"ПРОВОЛОКА","index":2,"n_rows":90,"n_cols":26,"rows_kept":90,"cut":false,"hidden":false,"merged":[[1,17,1,18],[5,0,7,0],[3,13,3,23],[4,1,4,2],[5,19,6,20],[5,17,6,18],[5,16,7,16],[5,1,5,2],[5,5,7,5],[5,4,7,4],[5,3,7,3],[6,2,7,2],[6,1,7,1],[5,15,7,15],[5,14,7,14],[5,13,7,13],[5,24,7,24],[5,25,7,25],[5,7,7,7],[5,6,7,6],[5,21,7,21],[5,22,7,22],[5,23,7,23],[5,12,7,12],[5,11,7,11],[5,10,7,10],[5,9,7,9],[5,8,7,8]]}
[null,null,null,"z","z",null,null,"z",null,null,null,"z","z"]
["Согласовано: Нач.техотдела                                         ",null,null,null,null,null,null,null,null,null,null,null,null,null,"запуск ",null,null,{"$f":"TODAY()","v":"2023-07-27"}]
[null,null,null,null,null,{"$f":"CONCATENATE(\"Изделие из: \",IF(ТРУБА!M7>0,\"ТРУБА, \",\"\"),IF(ЛИСТ!L7>0,\"ЛИСТ, \",\"\"),IF(ПРОВОЛОКА!R83>0,\"ПРОВОЛОКА, \",\"\"),IF(ПВХ!I60>0,\"ПВХ \",\"\"))","v":"Изделие из: ТРУБА, ЛИСТ, ПРОВОЛОКА, ПВХ "}]
["Технологическая ведомость материалов № _________по проволоке на",null,null,null,null,null,null,null,null,null,null,null,null,{"$f":"ТРУБА!C4","v":"(19137.022.20.9016) Кронштейн 240 "}]
[null,1500]
[null,"Наименование",null,"+10","План","Ø проволоки,мм","длина заготовки,мм","вес  метра проволоки","Кол-во на\nизделие\nшт","Кол-во на план\nшт","время на заготовку","время изготовления на 1 изделие, мин","вес заготовки\nкг","вес на изделие\nкг","Время изготовления на план,мин","Остаток проволоки с преды-дущего изделия (бухты), кг","Приход бухты прово-локи, кг","Общий вес на план, кг ",null,"Техноло-гический остаток обкуска в лом, кг",null,"Остаток бухты прово-локи, кг","ОТК","Принял","Дата передачи","Время передачи"]
[null,"Øх","Длина"]
[null,null,null,null,null,null,null,null,null,null,null,null,null,null,null,null,null,"теория","факт","теория","факт"]
[]
["2д","Ø8,0х",1000,10,{"$f":"$B$5","v":1500},8,{"$f":"C10+D10","v":1010},0.38800000000000001,1,{"$f":"E10*I10","v":1500},{"$f":"G10/162","v":6.2345679012345681},{"$f":"I10*K10/60","v":0.10390946502057613},{"$f":"G10*H10/1000","v":0.39188000000000001},{"$f":"I10*M10","v":0.39188000000000001},{"$f":"L10*E10","v":155.8641975308642},null,null,{"$f":"M10*J10","v":587.82000000000005},null,{"$f":"H10*0.01*J10","v":5.82}]
["гиб","Ø8,0х",100,15,{"$f":"$B$5","v":1500},8,{"$f":"C11+D11","v":115},0.38800000000000001,5,7500,{"$f":"G11/162","v":0.70987654320987659},5.9156378600823047E-2,4.4620000000000007E-2,0.22310000000000002,88.73456790123457,null,null,{"$f":"M11*J11","v":334.65000000000003},null,{"$f":"H11*0.01*J11","v":29.1}]
[{"$f":"IF(N12=0,\"z\",\" \")","v":"z"},"Ø8,0х",null,null,1500,8,0,0.38800000000000001,0,0,0,0,0,0,0,null,null,0,null,0]
["z","Ø8,0х",null,null,1500,8,0,0.38800000000000001,0,0,0,0,0,0,0,null,null,0,null,0]
["z","Ø8,0х",null,null,1500,8,0,0.38800000000000001,0,0,0,0,0,0,0,null,null,0,null,0]
[" ",null,null,null,null,null,null,null,null,null,null,null,null,{"$f":"SUM(N10:N14)","v":0.61498000000000008},{"$f":"SUM(O10:O14)","v":244.59876543209879},null,null,{"$f":"SUM(R10:R14)","v":922.47}]
[{"$f":"IF(N16=0,\"z\",\" \")","v":"z"},"Ø6,0х",null,null,{"$f":"$B$5","v":1500},6,0,0.222,0,{"$f":"E16*I16","v":0},{"$f":"G16/162","v":0},{"$f":"I16*K16/60","v":0},{"$f":"G16*H16/1000","v":0},{"$f":"I16*M16","v":0},{"$f":"L16*E16","v":0},null,null,{"$f":"M16*J16","v":0},null,{"$f":"H16*0.01*J16","v":0}]
[{"$f":"IF(N17=0,\"z\",\" \")","v":"z"},"Ø6,0х",null,null,1500,6,0,0.222,0,0,{"$f":"G17/162","v":0},0,0,0,0,null,null,{"$f":"M17*J17","v":0},null,{"$f":"H17*0.01*J17","v":0}]
["z","Ø6,0х",null,null,1500,6,0,0.222,0,0,0,0,0,0,0,null,null,0,null,0]
["z","Ø6,0х",null,null,1500,6,0,0.222,0,0,0,0,0,0,0,null,null,0,null,0]
["z","Ø6,0х",null,null,1500,6,0,0.222,0,0,0,0,0,0,0,null,null,0,null,0]
["z",null,null,null,null,null,null,null,null,null,null,null,null,{"$f":"SUM(N16:N20)","v":0},{"$f":"SUM(O16:O20)","v":0},null,null,0]
["z","Ø5,0х",null,null,{"$f":"$B$5","v":1500},4.8,0,0.14199999999999999,0,{"$f":"E22*I22","v":0},{"$f":"G22/162","v":0},{"$f":"I22*K22/60","v":0},{"$f":"G22*H22/1000","v":0},{"$f":"I22*M22","v":0},{"$f":"L22*E22","v":0},null,null,{"$f":"M22*J22","v":0},null,{"$f":"H22*0.01*J22","v":0}]
["z","Ø5,0х",null,null,1500,4.8,0,0.14199999999999999,0,0,0,0,0,0,0,null,null,0,null,0]
["z","Ø5,0х",null,null,1500,4.8,0,0.14199999999999999,0,0,0,0,0,0,0,null,null,0,null,0]
["z","Ø5,0х",null,null,1500,4.8,0,0.14199999999999999,0,0,0,0,0,0,0,null,null,0,null,0]
["z","Ø5,0х",null,null,1500,4.8,0,0.14199999999999999,0,0,0,0,0,0,0,null,null,0,null,0]
["z","Ø5,0х",null,null,1500,4.8,0,0.14199999999999999,0,0,0,0,0,0,0,null,null,0,null,0]
["z","Ø5,0х",null,null,1500,4.8,0,0.14199999999999999,0,0,0,0,0,0,0,null,null,0,null,0]
["z","Ø5,0х",null,null,1500,4.8,0,0.14199999999999999,0,0,0,0,0,0,0,null,null,0,null,0]
["z",null,null,null,null,null,null,null,null,null,null,null,null,{"$f":"SUM(N22:N29)","v":0},{"$f":"SUM(O22:O29)","v":0},null,null,{"$f":"SUM(R22:R29)","v":0}]
["z","Ø4,0х",null,null,{"$f":"$B$5","v":1500},3.8,0,9.0999999999999998E-2,0,0,0,0,0,0,0,null,null,{"$f":"M31*J31","v":0},null,{"$f":"H31*0.01*J31","v":0}]
["z","Ø4,0х",null,null,1500,3.8,0,9.0999999999999998E-2,0,0,0,0,0,0,0,null,null,0,null,0]
["z","Ø4,0х",null,null,1500,3.8,0,9.0999999999999998E-2,0,0,0,0,0,0,0,null,null,0,null,0]
["z","Ø4,0х",null,null,1500,3.8,0,9.0999999999999998E-2,0,0,0,0,0,0,0,null,null,0,null,0]
["z","Ø4,0х",null,null,1500,3.8,0,9.0999999999999998E-2,0,0,0,0,0,0,0,null,null,0,null,0]
["z","Ø4,0х",null,null,1500,3.8,0,9.0999999999999998E-2,0,0,0,0,0,0,0,null,null,0,null,0]
["z","Ø4,0х",null,null,1500,3.8,0,9.0999999999999998E-2,0,0,0,0,0,0,0,null,null,0,null,0]
["z","Ø4,0х",null,null,1500,3.8,0,9.0999999999999998E-2,0,0,0,0,0,0,0,null,null,0,null,0]
["z","Ø4,0х",null,null,1500,3.8,0,9.0999999999999998E-2,0,0,0,0,0,0,0,null,null,0,null,0]
["z","Ø4,0х",null,null,1500,3.8,0,9.0999999999999998E-2,0,0,0,0,0,0,0,null,null,0,null,0]
["z",null,null,null,null,null,null,null,null,null,null,null,null,{"$f":"SUM(N31:N40)","v":0},{"$f":"SUM(O31:O40)","v":0},null,null,0]
["z","Ø3,5х",null,null,{"$f":"$B$5","v":1500},3.4,0,7.1999999999999995E-2,0,{"$f":"E42*I42","v":0},0,{"$f":"I42*K42/60","v":0},{"$f":"G42*H42/1000","v":0},{"$f":"I42*M42","v":0},{"$f":"L42*E42","v":0},null,null,{"$f":"M42*J42","v":0},null,{"$f":"H42*0.01*J42","v":0}]
["z","Ø3,5х",null,null,1500,3.4,0,7.1999999999999995E-2,0,0,0,0,0,0,0,null,null,0,null,0]
["z","Ø3,5х",null,null,1500,3.4,0,7.1999999999999995E-2,0,0,0,0,0,0,0,null,null,0,null,0]
["z","Ø3,5х",null,null,1500,3.4,0,7.1999999999999995E-2,0,0,0,0,0,0,0,null,null,0,null,0]
["z","Ø3,5х",null,null,1500,3.4,0,7.1999999999999995E-2,0,0,0,0,0,0,0,null,null,0,null,0]
["z","Ø3,5х",null,null,1500,3.4,0,7.1999999999999995E-2,0,0,0,0,0,0,0,null,null,0,null,0]
["z","Ø3,5х",null,null,1500,3.4,0,7.1999999999999995E-2,0,0,0,0,0,0,0,null,null,0,null,0]
["z","Ø3,5х",null,null,1500,3.4,0,7.1999999999999995E-2,0,0,0,0,0,0,0,null,null,0,null,0]
["z","Ø3,5х",null,null,1500,3.4,0,7.1999999999999995E-2,0,0,0,0,0,0,0,null,null,0,null,0]
["z","Ø3,5х",null,null,1500,3.4,0,7.1999999999999995E-2,0,0,0,0,0,0,0,null,null,0,null,0]
["z",null,null,null,null,null,null,null,null,null,null,null,null,{"$f":"SUM(N42:N51)","v":0},{"$f":"SUM(O42:O51)","v":0},null,null,0]
["z","Ø3,0х",null,null,{"$f":"$B$5","v":1500},2.9,0,5.1999999999999998E-2,0,{"$f":"E53*I53","v":0},0,{"$f":"I53*K53/60","v":0},{"$f":"G53*H53/1000","v":0},{"$f":"I53*M53","v":0},{"$f":"L53*E53","v":0},null,null,{"$f":"M53*J53","v":0},null,{"$f":"H53*0.01*J53","v":0}]
["z","Ø3,0х",null,null,1500,2.9,0,5.1999999999999998E-2,0,0,0,0,0,0,0,null,null,0,null,0]
["z","Ø3,0х",null,null,1500,2.9,0,5.1999999999999998E-2,0,0,0,0,0,0,0,null,null,0,null,0]
["z","Ø3,0х",null,null,1500,2.9,0,5.1999999999999998E-2,0,0,0,0,0,0,0,null,null,0,null,0]
["z","Ø3,0х",null,null,1500,2.9,0,5.1999999999999998E-2,0,0,0,0,0,0,0,null,null,0,null,0]
["z","Ø3,0х",null,null,1500,2.9,0,5.1999999999999998E-2,0,0,0,0,0,0,0,null,null,0,null,0]
["z","Ø3,0х",null,null,1500,2.9,0,5.1999999999999998E-2,0,0,0,0,0,0,0,null,null,0,null,0]
["z","Ø3,0х",null,null,1500,2.9,0,5.1999999999999998E-2,0,0,0,0,0,0,0,null,null,0,null,0]
["z","Ø3,0х",null,null,1500,2.9,0,5.1999999999999998E-2,0,0,0,0,0,0,0,null,null,0,null,0]
["z","Ø3,0х",null,null,1500,2.9,0,5.1999999999999998E-2,0,0,0,0,0,0,0,null,null,0,null,0]
["z",null,null,null,null,null,null,null,null,null,null,null,null,{"$f":"SUM(N53:N62)","v":0},{"$f":"SUM(O53:O62)","v":0},null,null,{"$f":"SUM(R53:R62)","v":0}]
["z","Ø2,5х",null,null,{"$f":"$B$5","v":1500},2.5,0,3.7499999999999999E-2,0,0,0,0,0,0,0,null,null,{"$f":"M64*J64","v":0},null,{"$f":"H64*0.01*J64","v":0}]
["z","Ø2,5х",null,null,1500,2.5,0,3.7499999999999999E-2,0,0,0,0,0,0,0,null,null,0,null,0]
["z","Ø2,5х",null,null,1500,2.5,0,3.7499999999999999E-2,0,0,0,0,0,0,0,null,null,0,null,0]
["z","Ø2,5х",null,null,1500,2.5,0,3.7499999999999999E-2,0,0,0,0,0,0,0,null,null,0,null,0]
["z","Ø2,5х",null,null,1500,2.5,0,3.7499999999999999E-2,0,0,0,0,0,0,0,null,null,0,null,0]
["z","Ø2,5х",null,null,1500,2.5,0,3.7499999999999999E-2,0,0,0,0,0,0,0,null,null,0,null,0]
["z","Ø2,5х",null,null,1500,2.5,0,3.7499999999999999E-2,0,0,0,0,0,0,0,null,null,0,null,0]
["z","Ø2,5х",null,null,1500,2.5,0,3.7499999999999999E-2,0,0,0,0,0,0,0,null,null,0,null,0]
["z","Ø2,5х",null,null,1500,2.5,0,3.7499999999999999E-2,0,0,0,0,0,0,0,null,null,0,null,0]
["z","Ø2,5х",null,null,1500,2.5,0,3.7499999999999999E-2,0,0,0,0,0,0,0,null,null,0,null,0]
["z","Ø2,5х",null,null,1500,2.5,0,3.7499999999999999E-2,0,0,0,0,0,0,0,null,null,0,null,0]
[{"$f":"IF(N75=0,\"z\",\" \")","v":"z"},null,null,null,null,null,null,null,null,null,null,null,null,{"$f":"SUM(N64:N74)","v":0},{"$f":"SUM(O64:O74)","v":0},null,null,0]
[{"$f":"IF(N76=0,\"z\",\" \")","v":" "},"Ø2,0х",220,null,1500,2,{"$f":"C76+D76","v":220},2.5000000000000001E-2,1,{"$f":"E76*I76","v":1500},{"$f":"G76/162","v":1.3580246913580247},{"$f":"I76*K76/60","v":2.2633744855967079E-2},{"$f":"G76*H76/1000","v":5.4999999999999997E-3},{"$f":"I76*M76","v":5.4999999999999997E-3},{"$f":"L76*E76","v":33.950617283950621},null,null,{"$f":"M76*J76","v":8.25},null,{"$f":"H76*0.01*J76","v":0.375}]
["2д","Ø2,0х",150,10,1500,2,160,3.7499999999999999E-2,8,12000,0.98765432098765427,0.13168724279835389,6.0000000000000001E-3,4.8000000000000001E-2,197.53086419753083,null,null,72,null,4.5]
["z","Ø2,0х",null,null,1500,2,0,3.7499999999999999E-2,0,0,0,0,0,0,0,null,null,0,null,0]
["z","Ø2,0х",null,null,1500,2,0,3.7499999999999999E-2,0,0,0,0,0,0,0,null,null,0,null,0]
["z","Ø2,0х",null,null,1500,2,0,3.7499999999999999E-2,0,0,0,0,0,0,0,null,null,0,null,0]
[" ",null,null,null,null,null,null,null,null,null,null,null,null,{"$f":"SUM(N76:N80)","v":5.3499999999999999E-2},{"$f":"SUM(O76:O80)","v":231.48148148148147},null,null,{"$f":"SUM(R76:R80)","v":80.25}]
[null,null,null,null,null,null,null,null,null,null,null,null,null,null,null,null,null,"Всего","лома",{"$f":"SUM(T16:T80)","v":4.875}]
[null,null,null,null,null,null,null,null,null,null,null,null,null,null,null,"Суммарный общий",null,{"$f":"R21+R30+R41+R52+R63+R75+R15+R81","v":1002.72}]
["Технолог",null,null,null,null,null,null,null,null,null,null,null,null,"Сдал:   мастер заготовительного участка"]
[]
[]
["Мастер цеха",null,null,null,null,null,null,null,null,null,null,null,null,"Принял:   мастер проволочного участка"]
[]
[]
["Бухгалтер"]

{"sheet":"ПВХ","index":3,"n_rows":70,"n_cols":12,"rows_kept":70,"cut":false,"hidden":false,"merged":[[3,4,3,9],[7,4,7,6],[61,2,61,3]]}
["z",null,null,null,null,null,null,null,null,null,null,"z"]
[null,null,null,null,null,"            Приложение № 3 к ЛЗК _____"]
[null,null,null,null,null,null,null,null,null,{"$f":"TODAY()","v":"2023-07-27"}]
[null,null,null,null,{"$f":"ТРУБА!C4","v":"(19137.022.20.9016) Кронштейн 240 "}]
[null,null,{"$f":"CONCATENATE(\"Изделие из: \",IF(ТРУБА!M7>0,\"ТРУБА, \",\"\"),IF(ЛИСТ!L7>0,\"ЛИСТ, \",\"\"),IF(ПРОВОЛОКА!R83>0,\"ПРОВОЛОКА, \",\"\"),IF(ПВХ!I60>0,\"ПВХ \",\"\"))","v":"Изделие из: ТРУБА, ЛИСТ, ПРОВОЛОКА, ПВХ "}]
[]
[null,null,null,null,null,"План",1000]
[null,null,null,null,"Количество деталей на план",null,null,{"$f":"SUM(H10:H34)","v":12000},"Общая"]
[null,"№ п/п","длина ","ширина","кол-во на изделие","материал","толщина","кол-во на план","Кол-во листов ПВХ шт",null,null,"автономерация"]
[{"$f":"IF(E10=0,\"z\",\"\")","v":""},{"$f":"IF(H10=0,\"\",L10)","v":1},105,188,1,"ПВХ ",0.4,{"$f":"E10*$G$7","v":1000},{"$f":"SUMIFS($G$37:$G$59,$D$37:$D$59,$D$65,$C$37:$C$59,$C$65)","v":8},null,1,{"$f":"IF(H10=0,0,1)","v":1}]
[{"$f":"IF(E11=0,\"z\",\"\")","v":""},2,50,100,6,"ПВХ ",0.4,{"$f":"E11*$G$7","v":6000},null,null,2,{"$f":"IF(H11=0,L10,L10+1)","v":2}]
["",3,654,856,5,"ПВХ ",0.4,5000,null,null,3,3]
["z","",null,null,null,"ПВХ ",0.4,0,null,null,4,3]
["z","",null,null,null,"ПВХ ",0.4,0,null,null,5,3]
["z","",null,null,null,"ПВХ ",0.4,0,null,null,6,3]
["z","",null,null,null,"ПВХ ",0.4,0,null,null,7,3]
["z","",null,null,null,"ПВХ ",0.4,0,null,null,8,3]
["z","",null,null,null,"ПВХ ",0.4,0,null,null,9,3]
["z","",null,null,null,"ПВХ ",0.4,0,null,null,10,3]
["z","",null,null,null,"ПВХ ",0.4,0,null,null,11,3]
["z","",null,null,null,"ПВХ ",0.4,0,null,null,12,3]
["z","",null,null,null,"ПВХ ",0.4,0,null,null,13,3]
["z","",null,null,null,"ПВХ ",0.4,0,null,null,14,3]
["z","",null,null,null,"ПВХ ",0.4,0,null,null,15,3]
["z","",null,null,null,"ПВХ ",0.4,0,null,null,16,3]
[{"$f":"IF(E26=0,\"z\",\"\")","v":"z"},{"$f":"IF(H26=0,\"\",L26)","v":""},null,null,null,"ПВХ ",0.4,{"$f":"E26*$G$7","v":0},null,null,17,{"$f":"IF(H26=0,L25,L25+1)","v":3}]
["z","",null,null,null,"ПВХ ",0.4,0,null,null,18,3]
["z","",null,null,null,"ПВХ ",0.4,0,null,null,19,3]
["z","",null,null,null,"ПВХ ",0.4,0,null,null,20,3]
["z","",null,null,null,"ПВХ ",0.4,0,null,null,21,3]
["z","",null,null,null,"ПВХ ",0.4,0,null,null,22,3]
["z","",null,null,null,"ПВХ ",0.4,0,null,null,23,3]
["z","",null,null,null,"ПВХ ",0.4,0,null,null,24,3]
["z","",null,null,null,"ПВХ ",0.4,0,null,null,25,3]
[null,null,null,null,null,null,null,null,null,null,{"$f":"G7","v":1000}]
[null,"Карта раскроя \n№","Длина, мм","Ширина, мм","Толщина, мм","Марка материала","Кол-во","Площадь остатков всего\n(м2)","Площадь деталей всего\n(м2)","Количество деталей","Площадь листов/остатков со склада (м2)","округление\nтолщины"]
[{"$f":"IF(G37=0,\"z\",\"\")","v":""},1,917,700,0.4,"ПВХ прозрачный, 0.4 мм, пвх",1,0,0.62999998591840267,126,{"$f":"C37*D37*G37/1000000","v":0.64190000000000003},{"$f":"ROUND(E37,2)","v":0.4}]
[{"$f":"IF(G38=0,\"z\",\"\")","v":""},2,410,110,0.4,"ПВХ прозрачный, 0.4 мм, пвх",705,0,28.199999369680882,8,{"$f":"C38*D38*G38/1000000","v":31.795500000000001},{"$f":"ROUND(E38,2)","v":0.4}]
[{"$f":"IF(G39=0,\"z\",\"\")","v":""},2,410,110,0.4,"ПВХ прозрачный, 0.4 мм, пвх",705,0,28.199999369680882,8,{"$f":"C39*D39*G39/1000000","v":31.795500000000001},{"$f":"ROUND(E39,2)","v":0.4}]
["",2,410,110,0.4,"ПВХ прозрачный, 0.4 мм, пвх",705,0,28.199999369680882,8,31.795500000000001,0.4]
["",2,410,110,0.4,"ПВХ прозрачный, 0.4 мм, пвх",705,0,28.199999369680882,8,31.795500000000001,0.4]
["",2,410,110,0.4,"ПВХ прозрачный, 0.4 мм, пвх",705,0,28.199999369680882,8,31.795500000000001,0.4]
["",2,410,110,0.4,"ПВХ прозрачный, 0.4 мм, пвх",705,0,28.199999369680882,8,31.795500000000001,0.4]
["",2,410,110,0.4,"ПВХ прозрачный, 0.4 мм, пвх",705,0,28.199999369680882,8,31.795500000000001,0.4]
["",2,410,110,0.4,"ПВХ прозрачный, 0.4 мм, пвх",705,0,28.199999369680882,8,31.795500000000001,0.4]
["",2,410,110,0.4,"ПВХ прозрачный, 0.4 мм, пвх",705,0,28.199999369680882,8,31.795500000000001,0.4]
["",2,410,110,0.4,"ПВХ прозрачный, 0.4 мм, пвх",705,0,28.199999369680882,8,31.795500000000001,0.4]
["",2,410,110,0.4,"ПВХ прозрачный, 0.4 мм, пвх",705,0,28.199999369680882,8,31.795500000000001,0.4]
["",3,1000,620,0.4,"ПВХ прозрачный, 0.4 мм, пвх",1,0,0.59999998658895493,120,0.62,0.4]
["",4,210,215,0.4,"ПВХ прозрачный, 0.4 мм, пвх",1,0,3.9739999920129776E-2,5,4.5150000000000003E-2,0.4]
["",5,210,215,0.4,"ПВХ прозрачный, 0.4 мм, пвх",246,0,9.712080180644989,2,11.1069,0.4]
["",6,605,1160,0.4,"ПВХ прозрачный, 0.4 мм, пвх",1,2.9999999329447746E-2,0.66843998990952969,116,0.70179999999999998,0.4]
["",7,210,240,0.4,"ПВХ прозрачный, 0.4 мм, пвх",1,1.092000026255846E-2,3.9480000734329224E-2,2,5.04E-2,0.4]
["",8,1000,1400,0.4,"ПВХ прозрачный, 0.4 мм, пвх",7,1.0946599841117859,8.7053401619195938,63,9.8000000000000007,0.4]
["",9,1000,1400,0.4,"ПВХ прозрачный, 0.4 мм, пвх",1,0.25507999584078789,1.1449200212955475,58,1.4,0.4]
["z",null,null,null,null,null,null,null,null,null,0,0]
["z",null,null,null,null,null,null,null,null,null,0,0]
["z",null,null,null,null,null,null,null,null,null,0,0]
["z",null,null,null,null,null,null,null,null,null,0,0]
[null,null,null,null,null,"Общая",null,{"$f":"SUM(H37:H59)","v":1.39065997954458},{"$f":"SUM(I37:I59)","v":331.73999339342117},{"$f":"SUM(J37:J59)","v":580},{"$f":"SUM(K37:K59)","v":374.11664999999999}]
[]
[null,null,"Стандартный р-р",null,null,null,"Общая","Общая","Общая","Общая","Общая"]
[null,"Кол-во \nлистов ПВХ \nшт","Длина, \nмм","Ширина, мм","Толщина, мм","Марка материала","Площадь листов со склада (м2)","Площ-дь остатков со склада (м2)","Площадь остатков на склад м2","Площадь деталей","ЛОМ ПВХ (м2)"]
["z","кол","Дл","Шир","Тол","Мат","Столбец6","Столбец7","Столбец8","Столбец9","Столбец10","АСТРА"]
[{"$f":"IF(Таблица2[[#This Row],[Столбец9]]=0,\"z\",\"\")","v":""},{"$f":"SUMIFS($G$37:$G$59,$D$37:$D$59,Таблица2[[#This Row],[Шир]],$C$37:$C$59,Таблица2[[#This Row],[Дл]])","v":8},1000,1400,0.4,"ПВХ прозрачный, 0,4",{"$f":"SUMIFS($K$37:$K$59,$C$37:$C$59,Таблица2[[#This Row],[Дл]],$D$37:$D$59,Таблица2[[#This Row],[Шир]],$L$37:$L$59,Таблица2[[#This Row],[Тол]],$F$37:$F$59,Таблица2[[#This Row],[АСТРА]])","v":11.200000000000001},{"$f":"SUMIFS($K$37:$K$59,$C$37:$C$59,\"<\"&Таблица2[[#This Row],[Дл]],$D$37:$D$59,Таблица2[[#This Row],[Шир]],$L$37:$L$59,Таблица2[[#This Row],[Тол]],$F$37:$F$59,Таблица2[[#This Row],[АСТРА]])+SUMIFS($K$37:$K$59,$C$37:$C$59,Таблица2[[#This Row],[Дл]],$D$37:$D$59,\"<\"&Таблица2[[#This Row],[Шир]],$L$37:$L$59,Таблица2[[#This Row],[Тол]],$F$37:$F$59,Таблица2[[#This Row],[АСТРА]])+SUMIFS($K$37:$K$59,$C$37:$C$59,\"<\"&Таблица2[[#This Row],[Дл]],$D$37:$D$59,\"<\"&Таблица2[[#This Row],[Шир]],$L$37:$L$59,Таблица2[[#This Row],[Тол]],$F$37:$F$59,Таблица2[[#This Row],[АСТРА]])","v":362.91665},{"$f":"SUMIFS($H$37:$H$59,$F$37:$F$59,Таблица2[[#This Row],[АСТРА]])","v":1.39065997954458},{"$f":"SUMIFS($I$37:$I$59,$F$37:$F$59,Таблица2[[#This Row],[АСТРА]])","v":331.73999339342117},{"$f":"Таблица2[[#This Row],[Столбец6]]+Таблица2[[#This Row],[Столбец7]]-Таблица2[[#This Row],[Столбец8]]-Таблица2[[#This Row],[Столбец9]]","v":40.98599662703424},"ПВХ прозрачный, 0.4 мм, пвх"]
[{"$f":"IF(Таблица2[[#This Row],[Столбец9]]=0,\"z\",\"\")","v":"z"},{"$f":"SUMIFS($G$37:$G$59,$D$37:$D$59,Таблица2[[#This Row],[Шир]],$C$37:$C$59,Таблица2[[#This Row],[Дл]])","v":0},null,null,0.4,"ПВХ тест, 0,4",{"$f":"SUMIFS($K$37:$K$59,$C$37:$C$59,Таблица2[[#This Row],[Дл]],$D$37:$D$59,Таблица2[[#This Row],[Шир]],$L$37:$L$59,Таблица2[[#This Row],[Тол]],$F$37:$F$59,Таблица2[[#This Row],[АСТРА]])","v":0},{"$f":"SUMIFS($K$37:$K$59,$C$37:$C$59,\"<\"&Таблица2[[#This Row],[Дл]],$D$37:$D$59,Таблица2[[#This Row],[Шир]],$L$37:$L$59,Таблица2[[#This Row],[Тол]],$F$37:$F$59,Таблица2[[#This Row],[АСТРА]])+SUMIFS($K$37:$K$59,$C$37:$C$59,Таблица2[[#This Row],[Дл]],$D$37:$D$59,\"<\"&Таблица2[[#This Row],[Шир]],$L$37:$L$59,Таблица2[[#This Row],[Тол]],$F$37:$F$59,Таблица2[[#This Row],[АСТРА]])+SUMIFS($K$37:$K$59,$C$37:$C$59,\"<\"&Таблица2[[#This Row],[Дл]],$D$37:$D$59,\"<\"&Таблица2[[#This Row],[Шир]],$L$37:$L$59,Таблица2[[#This Row],[Тол]],$F$37:$F$59,Таблица2[[#This Row],[АСТРА]])","v":0},{"$f":"SUMIFS($H$37:$H$59,$F$37:$F$59,Таблица2[[#This Row],[АСТРА]])","v":0},{"$f":"SUMIFS($I$37:$I$59,$F$37:$F$59,Таблица2[[#This Row],[АСТРА]])","v":0},{"$f":"Таблица2[[#This Row],[Столбец6]]+Таблица2[[#This Row],[Столбец7]]-Таблица2[[#This Row],[Столбец8]]-Таблица2[[#This Row],[Столбец9]]","v":0}]
[]
[null,"Подпись",null,null,null,"Инженер-технолог"]
[null,"Подпись",null,null,null,"Нач техотдела"]
[null,"Подпись",null,null,null,"Генеральный директор"]

{"sheet":"Д-труба","index":4,"n_rows":52,"n_cols":8,"rows_kept":52,"cut":false,"hidden":false,"merged":[]}
["z",null,null,"план","на1кт","кол.на.пл","вес1кт","вес.план"]
[{"$f":"IF(ТРУБА!J8=0,\"z\",\"\")","v":""},{"$f":"VLOOKUP(ТРУБА!K8,Таблица1[[#All],[ГОСТ]:[Столбец33]],4,0)","v":"Труба"},{"$f":"CONCATENATE(VLOOKUP(ТРУБА!K8,Таблица1[[#All],[ГОСТ]:[Столбец34]],5,0),\"х\",ТРУБА!C8)","v":"10х10х1х425"},{"$f":"ТРУБА!$J$6","v":110},{"$f":"ТРУБА!E8","v":2},{"$f":"ТРУБА!J8","v":220},{"$f":"ТРУБА!M8/ТРУБА!$J$6","v":0.22950000000000001},{"$f":"ТРУБА!M8","v":25.245000000000001}]
[{"$f":"IF(ТРУБА!J9=0,\"z\",\"\")","v":""},{"$f":"VLOOKUP(ТРУБА!K9,Таблица1[[#All],[ГОСТ]:[Столбец33]],4,0)","v":"Круг"},{"$f":"CONCATENATE(VLOOKUP(ТРУБА!K9,Таблица1[[#All],[ГОСТ]:[Столбец34]],5,0),\"х\",ТРУБА!C9)","v":"12х280"},{"$f":"ТРУБА!$J$6","v":110},{"$f":"ТРУБА!E9","v":2},{"$f":"ТРУБА!J9","v":220},{"$f":"ТРУБА!M9/ТРУБА!$J$6","v":0.49728},{"$f":"ТРУБА!M9","v":54.700800000000001}]
[{"$f":"IF(ТРУБА!J10=0,\"z\",\"\")","v":""},{"$f":"VLOOKUP(ТРУБА!K10,Таблица1[[#All],[ГОСТ]:[Столбец33]],4,0)","v":"Труба"},{"$f":"CONCATENATE(VLOOKUP(ТРУБА!K10,Таблица1[[#All],[ГОСТ]:[Столбец34]],5,0),\"х\",ТРУБА!C10)","v":"25х25х1.2х273"},{"$f":"ТРУБА!$J$6","v":110},{"$f":"ТРУБА!E10","v":1},{"$f":"ТРУБА!J10","v":110},{"$f":"ТРУБА!M10/ТРУБА!$J$6","v":0.238875},{"$f":"ТРУБА!M10","v":26.276250000000001}]
[{"$f":"IF(ТРУБА!J11=0,\"z\",\"\")","v":"z"},{"$f":"VLOOKUP(ТРУБА!K11,Таблица1[[#All],[ГОСТ]:[Столбец33]],4,0)","v":"Труба"},{"$f":"CONCATENATE(VLOOKUP(ТРУБА!K11,Таблица1[[#All],[ГОСТ]:[Столбец34]],5,0),\"х\",ТРУБА!C11)","v":"25х25х1х"},{"$f":"ТРУБА!$J$6","v":110},{"$f":"ТРУБА!E11","v":0},{"$f":"ТРУБА!J11","v":0},{"$f":"ТРУБА!M11/ТРУБА!$J$6","v":0},{"$f":"ТРУБА!M11","v":0}]
[{"$f":"IF(ТРУБА!J12=0,\"z\",\"\")","v":"z"},{"$f":"VLOOKUP(ТРУБА!K12,Таблица1[[#All],[ГОСТ]:[Столбец33]],4,0)","v":{"$error":"#N/A"}},{"$f":"CONCATENATE(VLOOKUP(ТРУБА!K12,Таблица1[[#All],[ГОСТ]:[Столбец34]],5,0),\"х\",ТРУБА!C12)","v":{"$error":"#N/A"}},{"$f":"ТРУБА!$J$6","v":110},{"$f":"ТРУБА!E12","v":0},{"$f":"ТРУБА!J12","v":0},{"$f":"ТРУБА!M12/ТРУБА!$J$6","v":{"$error":"#VALUE!"}},{"$f":"ТРУБА!M12","v":""}]
[{"$f":"IF(ТРУБА!J13=0,\"z\",\"\")","v":"z"},{"$f":"VLOOKUP(ТРУБА!K13,Таблица1[[#All],[ГОСТ]:[Столбец33]],4,0)","v":{"$error":"#N/A"}},{"$f":"CONCATENATE(VLOOKUP(ТРУБА!K13,Таблица1[[#All],[ГОСТ]:[Столбец34]],5,0),\"х\",ТРУБА!C13)","v":{"$error":"#N/A"}},{"$f":"ТРУБА!$J$6","v":110},{"$f":"ТРУБА!E13","v":0},{"$f":"ТРУБА!J13","v":0},{"$f":"ТРУБА!M13/ТРУБА!$J$6","v":{"$error":"#VALUE!"}},{"$f":"ТРУБА!M13","v":""}]
[{"$f":"IF(ТРУБА!J14=0,\"z\",\"\")","v":"z"},{"$f":"VLOOKUP(ТРУБА!K14,Таблица1[[#All],[ГОСТ]:[Столбец33]],4,0)","v":{"$error":"#N/A"}},{"$f":"CONCATENATE(VLOOKUP(ТРУБА!K14,Таблица1[[#All],[ГОСТ]:[Столбец34]],5,0),\"х\",ТРУБА!C14)","v":{"$error":"#N/A"}},{"$f":"ТРУБА!$J$6","v":110},{"$f":"ТРУБА!E14","v":0},{"$f":"ТРУБА!J14","v":0},{"$f":"ТРУБА!M14/ТРУБА!$J$6","v":{"$error":"#VALUE!"}},{"$f":"ТРУБА!M14","v":""}]
[{"$f":"IF(ТРУБА!J15=0,\"z\",\"\")","v":"z"},{"$f":"VLOOKUP(ТРУБА!K15,Таблица1[[#All],[ГОСТ]:[Столбец33]],4,0)","v":{"$error":"#N/A"}},{"$f":"CONCATENATE(VLOOKUP(ТРУБА!K15,Таблица1[[#All],[ГОСТ]:[Столбец34]],5,0),\"х\",ТРУБА!C15)","v":{"$error":"#N/A"}},{"$f":"ТРУБА!$J$6","v":110},{"$f":"ТРУБА!E15","v":0},{"$f":"ТРУБА!J15","v":0},{"$f":"ТРУБА!M15/ТРУБА!$J$6","v":{"$error":"#VALUE!"}},{"$f":"ТРУБА!M15","v":""}]
[{"$f":"IF(ТРУБА!J16=0,\"z\",\"\")","v":"z"},{"$f":"VLOOKUP(ТРУБА!K16,Таблица1[[#All],[ГОСТ]:[Столбец33]],4,0)","v":{"$error":"#N/A"}},{"$f":"CONCATENATE(VLOOKUP(ТРУБА!K16,Таблица1[[#All],[ГОСТ]:[Столбец34]],5,0),\"х\",ТРУБА!C16)","v":{"$error":"#N/A"}},{"$f":"ТРУБА!$J$6","v":110},{"$f":"ТРУБА!E16","v":0},{"$f":"ТРУБА!J16","v":0},{"$f":"ТРУБА!M16/ТРУБА!$J$6","v":{"$error":"#VALUE!"}},{"$f":"ТРУБА!M16","v":""}]
[{"$f":"IF(ТРУБА!J17=0,\"z\",\"\")","v":"z"},{"$f":"VLOOKUP(ТРУБА!K17,Таблица1[[#All],[ГОСТ]:[Столбец33]],4,0)","v":{"$error":"#N/A"}},{"$f":"CONCATENATE(VLOOKUP(ТРУБА!K17,Таблица1[[#All],[ГОСТ]:[Столбец34]],5,0),\"х\",ТРУБА!C17)","v":{"$error":"#N/A"}},{"$f":"ТРУБА!$J$6","v":110},{"$f":"ТРУБА!E17","v":0},{"$f":"ТРУБА!J17","v":0},{"$f":"ТРУБА!M17/ТРУБА!$J$6","v":{"$error":"#VALUE!"}},{"$f":"ТРУБА!M17","v":""}]
[{"$f":"IF(ТРУБА!J18=0,\"z\",\"\")","v":"z"},{"$f":"VLOOKUP(ТРУБА!K18,Таблица1[[#All],[ГОСТ]:[Столбец33]],4,0)","v":{"$error":"#N/A"}},{"$f":"CONCATENATE(VLOOKUP(ТРУБА!K18,Таблица1[[#All],[ГОСТ]:[Столбец34]],5,0),\"х\",ТРУБА!C18)","v":{"$error":"#N/A"}},{"$f":"ТРУБА!$J$6","v":110},{"$f":"ТРУБА!E18","v":0},{"$f":"ТРУБА!J18","v":0},{"$f":"ТРУБА!M18/ТРУБА!$J$6","v":{"$error":"#VALUE!"}},{"$f":"ТРУБА!M18","v":""}]
[{"$f":"IF(ТРУБА!J19=0,\"z\",\"\")","v":"z"},{"$f":"VLOOKUP(ТРУБА!K19,Таблица1[[#All],[ГОСТ]:[Столбец33]],4,0)","v":{"$error":"#N/A"}},{"$f":"CONCATENATE(VLOOKUP(ТРУБА!K19,Таблица1[[#All],[ГОСТ]:[Столбец34]],5,0),\"х\",ТРУБА!C19)","v":{"$error":"#N/A"}},{"$f":"ТРУБА!$J$6","v":110},{"$f":"ТРУБА!E19","v":0},{"$f":"ТРУБА!J19","v":0},{"$f":"ТРУБА!M19/ТРУБА!$J$6","v":{"$error":"#VALUE!"}},{"$f":"ТРУБА!M19","v":""}]
[{"$f":"IF(ТРУБА!J20=0,\"z\",\"\")","v":"z"},{"$f":"VLOOKUP(ТРУБА!K20,Таблица1[[#All],[ГОСТ]:[Столбец33]],4,0)","v":{"$error":"#N/A"}},{"$f":"CONCATENATE(VLOOKUP(ТРУБА!K20,Таблица1[[#All],[ГОСТ]:[Столбец34]],5,0),\"х\",ТРУБА!C20)","v":{"$error":"#N/A"}},{"$f":"ТРУБА!$J$6","v":110},{"$f":"ТРУБА!E20","v":0},{"$f":"ТРУБА!J20","v":0},{"$f":"ТРУБА!M20/ТРУБА!$J$6","v":{"$error":"#VALUE!"}},{"$f":"ТРУБА!M20","v":""}]
[{"$f":"IF(ТРУБА!J21=0,\"z\",\"\")","v":"z"},{"$f":"VLOOKUP(ТРУБА!K21,Таблица1[[#All],[ГОСТ]:[Столбец33]],4,0)","v":{"$error":"#N/A"}},{"$f":"CONCATENATE(VLOOKUP(ТРУБА!K21,Таблица1[[#All],[ГОСТ]:[Столбец34]],5,0),\"х\",ТРУБА!C21)","v":{"$error":"#N/A"}},{"$f":"ТРУБА!$J$6","v":110},{"$f":"ТРУБА!E21","v":0},{"$f":"ТРУБА!J21","v":0},{"$f":"ТРУБА!M21/ТРУБА!$J$6","v":{"$error":"#VALUE!"}},{"$f":"ТРУБА!M21","v":""}]
[{"$f":"IF(ТРУБА!J22=0,\"z\",\"\")","v":"z"},{"$f":"VLOOKUP(ТРУБА!K22,Таблица1[[#All],[ГОСТ]:[Столбец33]],4,0)","v":{"$error":"#N/A"}},{"$f":"CONCATENATE(VLOOKUP(ТРУБА!K22,Таблица1[[#All],[ГОСТ]:[Столбец34]],5,0),\"х\",ТРУБА!C22)","v":{"$error":"#N/A"}},{"$f":"ТРУБА!$J$6","v":110},{"$f":"ТРУБА!E22","v":0},{"$f":"ТРУБА!J22","v":0},{"$f":"ТРУБА!M22/ТРУБА!$J$6","v":{"$error":"#VALUE!"}},{"$f":"ТРУБА!M22","v":""}]
[{"$f":"IF(ТРУБА!J23=0,\"z\",\"\")","v":"z"},{"$f":"VLOOKUP(ТРУБА!K23,Таблица1[[#All],[ГОСТ]:[Столбец33]],4,0)","v":{"$error":"#N/A"}},{"$f":"CONCATENATE(VLOOKUP(ТРУБА!K23,Таблица1[[#All],[ГОСТ]:[Столбец34]],5,0),\"х\",ТРУБА!C23)","v":{"$error":"#N/A"}},{"$f":"ТРУБА!$J$6","v":110},{"$f":"ТРУБА!E23","v":0},{"$f":"ТРУБА!J23","v":0},{"$f":"ТРУБА!M23/ТРУБА!$J$6","v":{"$error":"#VALUE!"}},{"$f":"ТРУБА!M23","v":""}]
[{"$f":"IF(ТРУБА!J24=0,\"z\",\"\")","v":"z"},{"$f":"VLOOKUP(ТРУБА!K24,Таблица1[[#All],[ГОСТ]:[Столбец33]],4,0)","v":{"$error":"#N/A"}},{"$f":"CONCATENATE(VLOOKUP(ТРУБА!K24,Таблица1[[#All],[ГОСТ]:[Столбец34]],5,0),\"х\",ТРУБА!C24)","v":{"$error":"#N/A"}},{"$f":"ТРУБА!$J$6","v":110},{"$f":"ТРУБА!E24","v":0},{"$f":"ТРУБА!J24","v":0},{"$f":"ТРУБА!M24/ТРУБА!$J$6","v":{"$error":"#VALUE!"}},{"$f":"ТРУБА!M24","v":""}]
[{"$f":"IF(ТРУБА!J25=0,\"z\",\"\")","v":""},{"$f":"VLOOKUP(ТРУБА!K25,Таблица1[[#All],[ГОСТ]:[Столбец33]],4,0)","v":"Труба пл.ов."},{"$f":"CONCATENATE(VLOOKUP(ТРУБА!K25,Таблица1[[#All],[ГОСТ]:[Столбец34]],5,0),\"х\",ТРУБА!C25)","v":"30х15х1.2х56"},{"$f":"ТРУБА!$J$6","v":110},{"$f":"ТРУБА!E25","v":8},{"$f":"ТРУБА!J25","v":880},{"$f":"ТРУБА!M25/ТРУБА!$J$6","v":0.31360000000000005},{"$f":"ТРУБА!M25","v":34.496000000000002}]
[{"$f":"IF(ТРУБА!J26=0,\"z\",\"\")","v":"z"},{"$f":"VLOOKUP(ТРУБА!K26,Таблица1[[#All],[ГОСТ]:[Столбец33]],4,0)","v":{"$error":"#N/A"}},{"$f":"CONCATENATE(VLOOKUP(ТРУБА!K26,Таблица1[[#All],[ГОСТ]:[Столбец34]],5,0),\"х\",ТРУБА!C26)","v":{"$error":"#N/A"}},{"$f":"ТРУБА!$J$6","v":110},{"$f":"ТРУБА!E26","v":0},{"$f":"ТРУБА!J26","v":0},{"$f":"ТРУБА!M26/ТРУБА!$J$6","v":{"$error":"#VALUE!"}},{"$f":"ТРУБА!M26","v":""}]
[{"$f":"IF(ТРУБА!J27=0,\"z\",\"\")","v":"z"},{"$f":"VLOOKUP(ТРУБА!K27,Таблица1[[#All],[ГОСТ]:[Столбец33]],4,0)","v":{"$error":"#N/A"}},{"$f":"CONCATENATE(VLOOKUP(ТРУБА!K27,Таблица1[[#All],[ГОСТ]:[Столбец34]],5,0),\"х\",ТРУБА!C27)","v":{"$error":"#N/A"}},{"$f":"ТРУБА!$J$6","v":110},{"$f":"ТРУБА!E27","v":0},{"$f":"ТРУБА!J27","v":0},{"$f":"ТРУБА!M27/ТРУБА!$J$6","v":{"$error":"#VALUE!"}},{"$f":"ТРУБА!M27","v":""}]
[{"$f":"IF(ТРУБА!J28=0,\"z\",\"\")","v":"z"},{"$f":"VLOOKUP(ТРУБА!K28,Таблица1[[#All],[ГОСТ]:[Столбец33]],4,0)","v":{"$error":"#N/A"}},{"$f":"CONCATENATE(VLOOKUP(ТРУБА!K28,Таблица1[[#All],[ГОСТ]:[Столбец34]],5,0),\"х\",ТРУБА!C28)","v":{"$error":"#N/A"}},{"$f":"ТРУБА!$J$6","v":110},{"$f":"ТРУБА!E28","v":0},{"$f":"ТРУБА!J28","v":0},{"$f":"ТРУБА!M28/ТРУБА!$J$6","v":{"$error":"#VALUE!"}},{"$f":"ТРУБА!M28","v":""}]
[{"$f":"IF(ТРУБА!J29=0,\"z\",\"\")","v":"z"},{"$f":"VLOOKUP(ТРУБА!K29,Таблица1[[#All],[ГОСТ]:[Столбец33]],4,0)","v":{"$error":"#N/A"}},{"$f":"CONCATENATE(VLOOKUP(ТРУБА!K29,Таблица1[[#All],[ГОСТ]:[Столбец34]],5,0),\"х\",ТРУБА!C29)","v":{"$error":"#N/A"}},{"$f":"ТРУБА!$J$6","v":110},{"$f":"ТРУБА!E29","v":0},{"$f":"ТРУБА!J29","v":0},{"$f":"ТРУБА!M29/ТРУБА!$J$6","v":{"$error":"#VALUE!"}},{"$f":"ТРУБА!M29","v":""}]
[{"$f":"IF(ТРУБА!J30=0,\"z\",\"\")","v":"z"},{"$f":"VLOOKUP(ТРУБА!K30,Таблица1[[#All],[ГОСТ]:[Столбец33]],4,0)","v":{"$error":"#N/A"}},{"$f":"CONCATENATE(VLOOKUP(ТРУБА!K30,Таблица1[[#All],[ГОСТ]:[Столбец34]],5,0),\"х\",ТРУБА!C30)","v":{"$error":"#N/A"}},{"$f":"ТРУБА!$J$6","v":110},{"$f":"ТРУБА!E30","v":0},{"$f":"ТРУБА!J30","v":0},{"$f":"ТРУБА!M30/ТРУБА!$J$6","v":{"$error":"#VALUE!"}},{"$f":"ТРУБА!M30","v":""}]
[{"$f":"IF(ТРУБА!J31=0,\"z\",\"\")","v":"z"},{"$f":"VLOOKUP(ТРУБА!K31,Таблица1[[#All],[ГОСТ]:[Столбец33]],4,0)","v":{"$error":"#N/A"}},{"$f":"CONCATENATE(VLOOKUP(ТРУБА!K31,Таблица1[[#All],[ГОСТ]:[Столбец34]],5,0),\"х\",ТРУБА!C31)","v":{"$error":"#N/A"}},{"$f":"ТРУБА!$J$6","v":110},{"$f":"ТРУБА!E31","v":0},{"$f":"ТРУБА!J31","v":0},{"$f":"ТРУБА!M31/ТРУБА!$J$6","v":{"$error":"#VALUE!"}},{"$f":"ТРУБА!M31","v":""}]
[{"$f":"IF(ТРУБА!J32=0,\"z\",\"\")","v":"z"},{"$f":"VLOOKUP(ТРУБА!K32,Таблица1[[#All],[ГОСТ]:[Столбец33]],4,0)","v":{"$error":"#N/A"}},{"$f":"CONCATENATE(VLOOKUP(ТРУБА!K32,Таблица1[[#All],[ГОСТ]:[Столбец34]],5,0),\"х\",ТРУБА!C32)","v":{"$error":"#N/A"}},{"$f":"ТРУБА!$J$6","v":110},{"$f":"ТРУБА!E32","v":0},{"$f":"ТРУБА!J32","v":0},{"$f":"ТРУБА!M32/ТРУБА!$J$6","v":{"$error":"#VALUE!"}},{"$f":"ТРУБА!M32","v":""}]
[{"$f":"IF(ТРУБА!J33=0,\"z\",\"\")","v":"z"},{"$f":"VLOOKUP(ТРУБА!K33,Таблица1[[#All],[ГОСТ]:[Столбец33]],4,0)","v":{"$error":"#N/A"}},{"$f":"CONCATENATE(VLOOKUP(ТРУБА!K33,Таблица1[[#All],[ГОСТ]:[Столбец34]],5,0),\"х\",ТРУБА!C33)","v":{"$error":"#N/A"}},{"$f":"ТРУБА!$J$6","v":110},{"$f":"ТРУБА!E33","v":0},{"$f":"ТРУБА!J33","v":0},{"$f":"ТРУБА!M33/ТРУБА!$J$6","v":{"$error":"#VALUE!"}},{"$f":"ТРУБА!M33","v":""}]
[{"$f":"IF(ТРУБА!J34=0,\"z\",\"\")","v":"z"},{"$f":"VLOOKUP(ТРУБА!K34,Таблица1[[#All],[ГОСТ]:[Столбец33]],4,0)","v":{"$error":"#N/A"}},{"$f":"CONCATENATE(VLOOKUP(ТРУБА!K34,Таблица1[[#All],[ГОСТ]:[Столбец34]],5,0),\"х\",ТРУБА!C34)","v":{"$error":"#N/A"}},{"$f":"ТРУБА!$J$6","v":110},{"$f":"ТРУБА!E34","v":0},{"$f":"ТРУБА!J34","v":0},{"$f":"ТРУБА!M34/ТРУБА!$J$6","v":{"$error":"#VALUE!"}},{"$f":"ТРУБА!M34","v":""}]
[{"$f":"IF(ТРУБА!J35=0,\"z\",\"\")","v":"z"},{"$f":"VLOOKUP(ТРУБА!K35,Таблица1[[#All],[ГОСТ]:[Столбец33]],4,0)","v":{"$error":"#N/A"}},{"$f":"CONCATENATE(VLOOKUP(ТРУБА!K35,Таблица1[[#All],[ГОСТ]:[Столбец34]],5,0),\"х\",ТРУБА!C35)","v":{"$error":"#N/A"}},{"$f":"ТРУБА!$J$6","v":110},{"$f":"ТРУБА!E35","v":0},{"$f":"ТРУБА!J35","v":0},{"$f":"ТРУБА!M35/ТРУБА!$J$6","v":{"$error":"#VALUE!"}},{"$f":"ТРУБА!M35","v":""}]
[{"$f":"IF(ТРУБА!J36=0,\"z\",\"\")","v":"z"},{"$f":"VLOOKUP(ТРУБА!K36,Таблица1[[#All],[ГОСТ]:[Столбец33]],4,0)","v":{"$error":"#N/A"}},{"$f":"CONCATENATE(VLOOKUP(ТРУБА!K36,Таблица1[[#All],[ГОСТ]:[Столбец34]],5,0),\"х\",ТРУБА!C36)","v":{"$error":"#N/A"}},{"$f":"ТРУБА!$J$6","v":110},{"$f":"ТРУБА!E36","v":0},{"$f":"ТРУБА!J36","v":0},{"$f":"ТРУБА!M36/ТРУБА!$J$6","v":{"$error":"#VALUE!"}},{"$f":"ТРУБА!M36","v":""}]
[{"$f":"IF(ТРУБА!J37=0,\"z\",\"\")","v":"z"},{"$f":"VLOOKUP(ТРУБА!K37,Таблица1[[#All],[ГОСТ]:[Столбец33]],4,0)","v":{"$error":"#N/A"}},{"$f":"CONCATENATE(VLOOKUP(ТРУБА!K37,Таблица1[[#All],[ГОСТ]:[Столбец34]],5,0),\"х\",ТРУБА!C37)","v":{"$error":"#N/A"}},{"$f":"ТРУБА!$J$6","v":110},{"$f":"ТРУБА!E37","v":0},{"$f":"ТРУБА!J37","v":0},{"$f":"ТРУБА!M37/ТРУБА!$J$6","v":{"$error":"#VALUE!"}},{"$f":"ТРУБА!M37","v":""}]
[{"$f":"IF(ТРУБА!J38=0,\"z\",\"\")","v":"z"},{"$f":"VLOOKUP(ТРУБА!K38,Таблица1[[#All],[ГОСТ]:[Столбец33]],4,0)","v":"Труба"},{"$f":"CONCATENATE(VLOOKUP(ТРУБА!K38,Таблица1[[#All],[ГОСТ]:[Столбец34]],5,0),\"х\",ТРУБА!C38)","v":"20х20х1х"},{"$f":"ТРУБА!$J$6","v":110},{"$f":"ТРУБА!E38","v":0},{"$f":"ТРУБА!J38","v":0},{"$f":"ТРУБА!M38/ТРУБА!$J$6","v":0},{"$f":"ТРУБА!M38","v":0}]
[{"$f":"IF(ТРУБА!J39=0,\"z\",\"\")","v":"z"},{"$f":"VLOOKUP(ТРУБА!K39,Таблица1[[#All],[ГОСТ]:[Столбец33]],4,0)","v":{"$error":"#N/A"}},{"$f":"CONCATENATE(VLOOKUP(ТРУБА!K39,Таблица1[[#All],[ГОСТ]:[Столбец34]],5,0),\"х\",ТРУБА!C39)","v":{"$error":"#N/A"}},{"$f":"ТРУБА!$J$6","v":110},{"$f":"ТРУБА!E39","v":0},{"$f":"ТРУБА!J39","v":0},{"$f":"ТРУБА!M39/ТРУБА!$J$6","v":{"$error":"#VALUE!"}},{"$f":"ТРУБА!M39","v":""}]
[{"$f":"IF(ТРУБА!J40=0,\"z\",\"\")","v":"z"},{"$f":"VLOOKUP(ТРУБА!K40,Таблица1[[#All],[ГОСТ]:[Столбец33]],4,0)","v":{"$error":"#N/A"}},{"$f":"CONCATENATE(VLOOKUP(ТРУБА!K40,Таблица1[[#All],[ГОСТ]:[Столбец34]],5,0),\"х\",ТРУБА!C40)","v":{"$error":"#N/A"}},{"$f":"ТРУБА!$J$6","v":110},{"$f":"ТРУБА!E40","v":0},{"$f":"ТРУБА!J40","v":0},{"$f":"ТРУБА!M40/ТРУБА!$J$6","v":{"$error":"#VALUE!"}},{"$f":"ТРУБА!M40","v":""}]
[{"$f":"IF(ТРУБА!J41=0,\"z\",\"\")","v":"z"},{"$f":"VLOOKUP(ТРУБА!K41,Таблица1[[#All],[ГОСТ]:[Столбец33]],4,0)","v":{"$error":"#N/A"}},{"$f":"CONCATENATE(VLOOKUP(ТРУБА!K41,Таблица1[[#All],[ГОСТ]:[Столбец34]],5,0),\"х\",ТРУБА!C41)","v":{"$error":"#N/A"}},{"$f":"ТРУБА!$J$6","v":110},{"$f":"ТРУБА!E41","v":0},{"$f":"ТРУБА!J41","v":0},{"$f":"ТРУБА!M41/ТРУБА!$J$6","v":{"$error":"#VALUE!"}},{"$f":"ТРУБА!M41","v":""}]
[{"$f":"IF(ТРУБА!J42=0,\"z\",\"\")","v":"z"},{"$f":"VLOOKUP(ТРУБА!K42,Таблица1[[#All],[ГОСТ]:[Столбец33]],4,0)","v":{"$error":"#N/A"}},{"$f":"CONCATENATE(VLOOKUP(ТРУБА!K42,Таблица1[[#All],[ГОСТ]:[Столбец34]],5,0),\"х\",ТРУБА!C42)","v":{"$error":"#N/A"}},{"$f":"ТРУБА!$J$6","v":110},{"$f":"ТРУБА!E42","v":0},{"$f":"ТРУБА!J42","v":0},{"$f":"ТРУБА!M42/ТРУБА!$J$6","v":{"$error":"#VALUE!"}},{"$f":"ТРУБА!M42","v":""}]
[{"$f":"IF(ТРУБА!J43=0,\"z\",\"\")","v":"z"},{"$f":"VLOOKUP(ТРУБА!K43,Таблица1[[#All],[ГОСТ]:[Столбец33]],4,0)","v":"Труба"},{"$f":"CONCATENATE(VLOOKUP(ТРУБА!K43,Таблица1[[#All],[ГОСТ]:[Столбец34]],5,0),\"х\",ТРУБА!C43)","v":"25х25х1.2х"},{"$f":"ТРУБА!$J$6","v":110},{"$f":"ТРУБА!E43","v":0},{"$f":"ТРУБА!J43","v":0},{"$f":"ТРУБА!M43/ТРУБА!$J$6","v":0},{"$f":"ТРУБА!M43","v":0}]
[{"$f":"IF(ТРУБА!J44=0,\"z\",\"\")","v":"z"},{"$f":"VLOOKUP(ТРУБА!K44,Таблица1[[#All],[ГОСТ]:[Столбец33]],4,0)","v":{"$error":"#N/A"}},{"$f":"CONCATENATE(VLOOKUP(ТРУБА!K44,Таблица1[[#All],[ГОСТ]:[Столбец34]],5,0),\"х\",ТРУБА!C44)","v":{"$error":"#N/A"}},{"$f":"ТРУБА!$J$6","v":110},{"$f":"ТРУБА!E44","v":0},{"$f":"ТРУБА!J44","v":0},{"$f":"ТРУБА!M44/ТРУБА!$J$6","v":{"$error":"#VALUE!"}},{"$f":"ТРУБА!M44","v":""}]
[{"$f":"IF(ТРУБА!J45=0,\"z\",\"\")","v":"z"},{"$f":"VLOOKUP(ТРУБА!K45,Таблица1[[#All],[ГОСТ]:[Столбец33]],4,0)","v":{"$error":"#N/A"}},{"$f":"CONCATENATE(VLOOKUP(ТРУБА!K45,Таблица1[[#All],[ГОСТ]:[Столбец34]],5,0),\"х\",ТРУБА!C45)","v":{"$error":"#N/A"}},{"$f":"ТРУБА!$J$6","v":110},{"$f":"ТРУБА!E45","v":0},{"$f":"ТРУБА!J45","v":0},{"$f":"ТРУБА!M45/ТРУБА!$J$6","v":{"$error":"#VALUE!"}},{"$f":"ТРУБА!M45","v":""}]
[{"$f":"IF(ТРУБА!J46=0,\"z\",\"\")","v":"z"},{"$f":"VLOOKUP(ТРУБА!K46,Таблица1[[#All],[ГОСТ]:[Столбец33]],4,0)","v":{"$error":"#N/A"}},{"$f":"CONCATENATE(VLOOKUP(ТРУБА!K46,Таблица1[[#All],[ГОСТ]:[Столбец34]],5,0),\"х\",ТРУБА!C46)","v":{"$error":"#N/A"}},{"$f":"ТРУБА!$J$6","v":110},{"$f":"ТРУБА!E46","v":0},{"$f":"ТРУБА!J46","v":0},{"$f":"ТРУБА!M46/ТРУБА!$J$6","v":{"$error":"#VALUE!"}},{"$f":"ТРУБА!M46","v":""}]
[{"$f":"IF(ТРУБА!J47=0,\"z\",\"\")","v":"z"},{"$f":"VLOOKUP(ТРУБА!K47,Таблица1[[#All],[ГОСТ]:[Столбец33]],4,0)","v":{"$error":"#N/A"}},{"$f":"CONCATENATE(VLOOKUP(ТРУБА!K47,Таблица1[[#All],[ГОСТ]:[Столбец34]],5,0),\"х\",ТРУБА!C47)","v":{"$error":"#N/A"}},{"$f":"ТРУБА!$J$6","v":110},{"$f":"ТРУБА!E47","v":0},{"$f":"ТРУБА!J47","v":0},{"$f":"ТРУБА!M47/ТРУБА!$J$6","v":{"$error":"#VALUE!"}},{"$f":"ТРУБА!M47","v":""}]
[{"$f":"IF(ТРУБА!J48=0,\"z\",\"\")","v":"z"},{"$f":"VLOOKUP(ТРУБА!K48,Таблица1[[#All],[ГОСТ]:[Столбец33]],4,0)","v":{"$error":"#N/A"}},{"$f":"CONCATENATE(VLOOKUP(ТРУБА!K48,Таблица1[[#All],[ГОСТ]:[Столбец34]],5,0),\"х\",ТРУБА!C48)","v":{"$error":"#N/A"}},{"$f":"ТРУБА!$J$6","v":110},{"$f":"ТРУБА!E48","v":0},{"$f":"ТРУБА!J48","v":0},{"$f":"ТРУБА!M48/ТРУБА!$J$6","v":{"$error":"#VALUE!"}},{"$f":"ТРУБА!M48","v":""}]
[{"$f":"IF(ТРУБА!J49=0,\"z\",\"\")","v":"z"},{"$f":"VLOOKUP(ТРУБА!K49,Таблица1[[#All],[ГОСТ]:[Столбец33]],4,0)","v":{"$error":"#N/A"}},{"$f":"CONCATENATE(VLOOKUP(ТРУБА!K49,Таблица1[[#All],[ГОСТ]:[Столбец34]],5,0),\"х\",ТРУБА!C49)","v":{"$error":"#N/A"}},{"$f":"ТРУБА!$J$6","v":110},{"$f":"ТРУБА!E49","v":0},{"$f":"ТРУБА!J49","v":0},{"$f":"ТРУБА!M49/ТРУБА!$J$6","v":{"$error":"#VALUE!"}},{"$f":"ТРУБА!M49","v":""}]
[{"$f":"IF(ТРУБА!J50=0,\"z\",\"\")","v":"z"},{"$f":"VLOOKUP(ТРУБА!K50,Таблица1[[#All],[ГОСТ]:[Столбец33]],4,0)","v":{"$error":"#N/A"}},{"$f":"CONCATENATE(VLOOKUP(ТРУБА!K50,Таблица1[[#All],[ГОСТ]:[Столбец34]],5,0),\"х\",ТРУБА!C50)","v":{"$error":"#N/A"}},{"$f":"ТРУБА!$J$6","v":110},{"$f":"ТРУБА!E50","v":0},{"$f":"ТРУБА!J50","v":0},{"$f":"ТРУБА!M50/ТРУБА!$J$6","v":{"$error":"#VALUE!"}},{"$f":"ТРУБА!M50","v":""}]
[{"$f":"IF(ТРУБА!J51=0,\"z\",\"\")","v":"z"},{"$f":"VLOOKUP(ТРУБА!K51,Таблица1[[#All],[ГОСТ]:[Столбец33]],4,0)","v":{"$error":"#N/A"}},{"$f":"CONCATENATE(VLOOKUP(ТРУБА!K51,Таблица1[[#All],[ГОСТ]:[Столбец34]],5,0),\"х\",ТРУБА!C51)","v":{"$error":"#N/A"}},{"$f":"ТРУБА!$J$6","v":110},{"$f":"ТРУБА!E51","v":0},{"$f":"ТРУБА!J51","v":0},{"$f":"ТРУБА!M51/ТРУБА!$J$6","v":{"$error":"#VALUE!"}},{"$f":"ТРУБА!M51","v":""}]
[{"$f":"IF(ТРУБА!J52=0,\"z\",\"\")","v":"z"},{"$f":"VLOOKUP(ТРУБА!K52,Таблица1[[#All],[ГОСТ]:[Столбец33]],4,0)","v":{"$error":"#N/A"}},{"$f":"CONCATENATE(VLOOKUP(ТРУБА!K52,Таблица1[[#All],[ГОСТ]:[Столбец34]],5,0),\"х\",ТРУБА!C52)","v":{"$error":"#N/A"}},{"$f":"ТРУБА!$J$6","v":110},{"$f":"ТРУБА!E52","v":0},{"$f":"ТРУБА!J52","v":0},{"$f":"ТРУБА!M52/ТРУБА!$J$6","v":{"$error":"#VALUE!"}},{"$f":"ТРУБА!M52","v":""}]
[{"$f":"IF(ТРУБА!J53=0,\"z\",\"\")","v":"z"},{"$f":"VLOOKUP(ТРУБА!K53,Таблица1[[#All],[ГОСТ]:[Столбец33]],4,0)","v":{"$error":"#N/A"}},{"$f":"CONCATENATE(VLOOKUP(ТРУБА!K53,Таблица1[[#All],[ГОСТ]:[Столбец34]],5,0),\"х\",ТРУБА!C53)","v":{"$error":"#N/A"}},{"$f":"ТРУБА!$J$6","v":110},{"$f":"ТРУБА!E53","v":0},{"$f":"ТРУБА!J53","v":0},{"$f":"ТРУБА!M53/ТРУБА!$J$6","v":{"$error":"#VALUE!"}},{"$f":"ТРУБА!M53","v":""}]
[{"$f":"IF(ТРУБА!J54=0,\"z\",\"\")","v":"z"},{"$f":"VLOOKUP(ТРУБА!K54,Таблица1[[#All],[ГОСТ]:[Столбец33]],4,0)","v":{"$error":"#N/A"}},{"$f":"CONCATENATE(VLOOKUP(ТРУБА!K54,Таблица1[[#All],[ГОСТ]:[Столбец34]],5,0),\"х\",ТРУБА!C54)","v":{"$error":"#N/A"}},{"$f":"ТРУБА!$J$6","v":110},{"$f":"ТРУБА!E54","v":0},{"$f":"ТРУБА!J54","v":0},{"$f":"ТРУБА!M54/ТРУБА!$J$6","v":{"$error":"#VALUE!"}},{"$f":"ТРУБА!M54","v":""}]
[{"$f":"IF(ТРУБА!J55=0,\"z\",\"\")","v":"z"},{"$f":"VLOOKUP(ТРУБА!K55,Таблица1[[#All],[ГОСТ]:[Столбец33]],4,0)","v":{"$error":"#N/A"}},{"$f":"CONCATENATE(VLOOKUP(ТРУБА!K55,Таблица1[[#All],[ГОСТ]:[Столбец34]],5,0),\"х\",ТРУБА!C55)","v":{"$error":"#N/A"}},{"$f":"ТРУБА!$J$6","v":110},{"$f":"ТРУБА!E55","v":0},{"$f":"ТРУБА!J55","v":0},{"$f":"ТРУБА!M55/ТРУБА!$J$6","v":{"$error":"#VALUE!"}},{"$f":"ТРУБА!M55","v":""}]
[{"$f":"IF(ТРУБА!J56=0,\"z\",\"\")","v":"z"},{"$f":"VLOOKUP(ТРУБА!K56,Таблица1[[#All],[ГОСТ]:[Столбец33]],4,0)","v":{"$error":"#N/A"}},{"$f":"CONCATENATE(VLOOKUP(ТРУБА!K56,Таблица1[[#All],[ГОСТ]:[Столбец34]],5,0),\"х\",ТРУБА!C56)","v":{"$error":"#N/A"}},{"$f":"ТРУБА!$J$6","v":110},{"$f":"ТРУБА!E56","v":0},{"$f":"ТРУБА!J56","v":0},{"$f":"ТРУБА!M56/ТРУБА!$J$6","v":{"$error":"#VALUE!"}},{"$f":"ТРУБА!M56","v":""}]
[{"$f":"IF(ТРУБА!J57=0,\"z\",\"\")","v":"z"},{"$f":"VLOOKUP(ТРУБА!K57,Таблица1[[#All],[ГОСТ]:[Столбец33]],4,0)","v":{"$error":"#N/A"}},{"$f":"CONCATENATE(VLOOKUP(ТРУБА!K57,Таблица1[[#All],[ГОСТ]:[Столбец34]],5,0),\"х\",ТРУБА!C57)","v":{"$error":"#N/A"}},{"$f":"ТРУБА!$J$6","v":110},{"$f":"ТРУБА!E57","v":0},{"$f":"ТРУБА!J57","v":0},{"$f":"ТРУБА!M57/ТРУБА!$J$6","v":{"$error":"#VALUE!"}},{"$f":"ТРУБА!M57","v":""}]
[{"$f":"IF(ТРУБА!J58=0,\"z\",\"\")","v":"z"},{"$f":"VLOOKUP(ТРУБА!K58,Таблица1[[#All],[ГОСТ]:[Столбец33]],4,0)","v":{"$error":"#N/A"}},{"$f":"CONCATENATE(VLOOKUP(ТРУБА!K58,Таблица1[[#All],[ГОСТ]:[Столбец34]],5,0),\"х\",ТРУБА!C58)","v":{"$error":"#N/A"}},{"$f":"ТРУБА!$J$6","v":110},{"$f":"ТРУБА!E58","v":0},{"$f":"ТРУБА!J58","v":0},{"$f":"ТРУБА!M58/ТРУБА!$J$6","v":0},{"$f":"ТРУБА!M58","v":0}]

{"sheet":"Д-лист","index":5,"n_rows":51,"n_cols":8,"rows_kept":51,"cut":false,"hidden":false,"merged":[]}
["z",null,null,"план","на1кт","кол.на.пл","вес1кт","вес.план"]
[{"$f":"IF(ЛИСТ!J8=0,\"z\",\"\")","v":""},{"$f":"VLOOKUP(ЛИСТ!H8,Таблица3[[#All],[Столбец28]:[Столбец30]],2,0)","v":"Лист"},{"$f":"CONCATENATE(ЛИСТ!C8,\"х\",ЛИСТ!D8,\"х\",ЛИСТ!G8)","v":"970х520х1.5"},{"$f":"ЛИСТ!$H$6","v":80},{"$f":"ЛИСТ!E8","v":1},{"$f":"ЛИСТ!J8","v":80},{"$f":"H2/D2","v":5.6029494240000002},{"$f":"ЛИСТ!L8","v":448.23595391999999}]
[{"$f":"IF(ЛИСТ!J9=0,\"z\",\"\")","v":""},{"$f":"VLOOKUP(ЛИСТ!H9,Таблица3[[#All],[Столбец28]:[Столбец30]],2,0)","v":"Лист"},{"$f":"CONCATENATE(ЛИСТ!C9,\"х\",ЛИСТ!D9,\"х\",ЛИСТ!G9)","v":"303х303х2"},{"$f":"ЛИСТ!$H$6","v":80},{"$f":"ЛИСТ!E9","v":5},{"$f":"ЛИСТ!J9","v":400},{"$f":"H3/D3","v":5.6777051799999994},{"$f":"ЛИСТ!L9","v":454.21641439999996}]
[{"$f":"IF(ЛИСТ!J10=0,\"z\",\"\")","v":""},{"$f":"VLOOKUP(ЛИСТ!H10,Таблица3[[#All],[Столбец28]:[Столбец30]],2,0)","v":"Лист ОЦ"},{"$f":"CONCATENATE(ЛИСТ!C10,\"х\",ЛИСТ!D10,\"х\",ЛИСТ!G10)","v":"654х565х1"},{"$f":"ЛИСТ!$H$6","v":80},{"$f":"ЛИСТ!E10","v":72},{"$f":"ЛИСТ!J10","v":5760},209.88165635135996,{"$f":"ЛИСТ!L10","v":16790.532508108798}]
[{"$f":"IF(ЛИСТ!J11=0,\"z\",\"\")","v":""},{"$f":"VLOOKUP(ЛИСТ!H11,Таблица3[[#All],[Столбец28]:[Столбец30]],2,0)","v":"Сетка ПВЛ"},{"$f":"CONCATENATE(ЛИСТ!C11,\"х\",ЛИСТ!D11,\"х\",ЛИСТ!G11)","v":"45х557х1"},{"$f":"ЛИСТ!$H$6","v":80},{"$f":"ЛИСТ!E11","v":1},{"$f":"ЛИСТ!J11","v":80},{"$f":"H5/D5","v":7.2409977719999991E-2},{"$f":"ЛИСТ!L11","v":5.7927982175999997}]
[{"$f":"IF(ЛИСТ!J12=0,\"z\",\"\")","v":"z"},{"$f":"VLOOKUP(ЛИСТ!H12,Таблица3[[#All],[Столбец28]:[Столбец30]],2,0)","v":{"$error":"#N/A"}},{"$f":"CONCATENATE(ЛИСТ!C12,\"х\",ЛИСТ!D12,\"х\",ЛИСТ!G12)","v":"хх"},{"$f":"ЛИСТ!$H$6","v":80},{"$f":"ЛИСТ!E12","v":0},{"$f":"ЛИСТ!J12","v":0},{"$error":"#VALUE!"},{"$f":"ЛИСТ!L12","v":""}]
[{"$f":"IF(ЛИСТ!J13=0,\"z\",\"\")","v":"z"},{"$f":"VLOOKUP(ЛИСТ!H13,Таблица3[[#All],[Столбец28]:[Столбец30]],2,0)","v":"Сетка ПВЛ"},{"$f":"CONCATENATE(ЛИСТ!C13,\"х\",ЛИСТ!D13,\"х\",ЛИСТ!G13)","v":"хх1"},{"$f":"ЛИСТ!$H$6","v":80},{"$f":"ЛИСТ!E13","v":0},{"$f":"ЛИСТ!J13","v":0},0,{"$f":"ЛИСТ!L13","v":0}]
[{"$f":"IF(ЛИСТ!J14=0,\"z\",\"\")","v":"z"},{"$f":"VLOOKUP(ЛИСТ!H14,Таблица3[[#All],[Столбец28]:[Столбец30]],2,0)","v":{"$error":"#N/A"}},{"$f":"CONCATENATE(ЛИСТ!C14,\"х\",ЛИСТ!D14,\"х\",ЛИСТ!G14)","v":"хх"},{"$f":"ЛИСТ!$H$6","v":80},{"$f":"ЛИСТ!E14","v":0},{"$f":"ЛИСТ!J14","v":0},{"$error":"#VALUE!"},{"$f":"ЛИСТ!L14","v":""}]
[{"$f":"IF(ЛИСТ!J15=0,\"z\",\"\")","v":"z"},{"$f":"VLOOKUP(ЛИСТ!H15,Таблица3[[#All],[Столбец28]:[Столбец30]],2,0)","v":{"$error":"#N/A"}},{"$f":"CONCATENATE(ЛИСТ!C15,\"х\",ЛИСТ!D15,\"х\",ЛИСТ!G15)","v":"хх"},{"$f":"ЛИСТ!$H$6","v":80},{"$f":"ЛИСТ!E15","v":0},{"$f":"ЛИСТ!J15","v":0},{"$error":"#VALUE!"},{"$f":"ЛИСТ!L15","v":""}]
[{"$f":"IF(ЛИСТ!J16=0,\"z\",\"\")","v":"z"},{"$f":"VLOOKUP(ЛИСТ!H16,Таблица3[[#All],[Столбец28]:[Столбец30]],2,0)","v":{"$error":"#N/A"}},{"$f":"CONCATENATE(ЛИСТ!C16,\"х\",ЛИСТ!D16,\"х\",ЛИСТ!G16)","v":"хх"},{"$f":"ЛИСТ!$H$6","v":80},{"$f":"ЛИСТ!E16","v":0},{"$f":"ЛИСТ!J16","v":0},{"$error":"#VALUE!"},{"$f":"ЛИСТ!L16","v":""}]
[{"$f":"IF(ЛИСТ!J17=0,\"z\",\"\")","v":"z"},{"$f":"VLOOKUP(ЛИСТ!H17,Таблица3[[#All],[Столбец28]:[Столбец30]],2,0)","v":{"$error":"#N/A"}},{"$f":"CONCATENATE(ЛИСТ!C17,\"х\",ЛИСТ!D17,\"х\",ЛИСТ!G17)","v":"хх"},{"$f":"ЛИСТ!$H$6","v":80},{"$f":"ЛИСТ!E17","v":0},{"$f":"ЛИСТ!J17","v":0},{"$error":"#VALUE!"},{"$f":"ЛИСТ!L17","v":""}]
[{"$f":"IF(ЛИСТ!J18=0,\"z\",\"\")","v":"z"},{"$f":"VLOOKUP(ЛИСТ!H18,Таблица3[[#All],[Столбец28]:[Столбец30]],2,0)","v":"Лист"},{"$f":"CONCATENATE(ЛИСТ!C18,\"х\",ЛИСТ!D18,\"х\",ЛИСТ!G18)","v":"хх1.5"},{"$f":"ЛИСТ!$H$6","v":80},{"$f":"ЛИСТ!E18","v":0},{"$f":"ЛИСТ!J18","v":0},0,{"$f":"ЛИСТ!L18","v":0}]
[{"$f":"IF(ЛИСТ!J19=0,\"z\",\"\")","v":"z"},{"$f":"VLOOKUP(ЛИСТ!H19,Таблица3[[#All],[Столбец28]:[Столбец30]],2,0)","v":{"$error":"#N/A"}},{"$f":"CONCATENATE(ЛИСТ!C19,\"х\",ЛИСТ!D19,\"х\",ЛИСТ!G19)","v":"хх"},{"$f":"ЛИСТ!$H$6","v":80},{"$f":"ЛИСТ!E19","v":0},{"$f":"ЛИСТ!J19","v":0},{"$error":"#VALUE!"},{"$f":"ЛИСТ!L19","v":""}]
[{"$f":"IF(ЛИСТ!J20=0,\"z\",\"\")","v":"z"},{"$f":"VLOOKUP(ЛИСТ!H20,Таблица3[[#All],[Столбец28]:[Столбец30]],2,0)","v":{"$error":"#N/A"}},{"$f":"CONCATENATE(ЛИСТ!C20,\"х\",ЛИСТ!D20,\"х\",ЛИСТ!G20)","v":"хх"},{"$f":"ЛИСТ!$H$6","v":80},{"$f":"ЛИСТ!E20","v":0},{"$f":"ЛИСТ!J20","v":0},{"$error":"#VALUE!"},{"$f":"ЛИСТ!L20","v":""}]
[{"$f":"IF(ЛИСТ!J21=0,\"z\",\"\")","v":"z"},{"$f":"VLOOKUP(ЛИСТ!H21,Таблица3[[#All],[Столбец28]:[Столбец30]],2,0)","v":{"$error":"#N/A"}},{"$f":"CONCATENATE(ЛИСТ!C21,\"х\",ЛИСТ!D21,\"х\",ЛИСТ!G21)","v":"хх"},{"$f":"ЛИСТ!$H$6","v":80},{"$f":"ЛИСТ!E21","v":0},{"$f":"ЛИСТ!J21","v":0},{"$error":"#VALUE!"},{"$f":"ЛИСТ!L21","v":""}]
[{"$f":"IF(ЛИСТ!J22=0,\"z\",\"\")","v":"z"},{"$f":"VLOOKUP(ЛИСТ!H22,Таблица3[[#All],[Столбец28]:[Столбец30]],2,0)","v":{"$error":"#N/A"}},{"$f":"CONCATENATE(ЛИСТ!C22,\"х\",ЛИСТ!D22,\"х\",ЛИСТ!G22)","v":"хх"},{"$f":"ЛИСТ!$H$6","v":80},{"$f":"ЛИСТ!E22","v":0},{"$f":"ЛИСТ!J22","v":0},{"$error":"#VALUE!"},{"$f":"ЛИСТ!L22","v":""}]
[{"$f":"IF(ЛИСТ!J23=0,\"z\",\"\")","v":"z"},{"$f":"VLOOKUP(ЛИСТ!H23,Таблица3[[#All],[Столбец28]:[Столбец30]],2,0)","v":{"$error":"#N/A"}},{"$f":"CONCATENATE(ЛИСТ!C23,\"х\",ЛИСТ!D23,\"х\",ЛИСТ!G23)","v":"хх"},{"$f":"ЛИСТ!$H$6","v":80},{"$f":"ЛИСТ!E23","v":0},{"$f":"ЛИСТ!J23","v":0},{"$error":"#VALUE!"},{"$f":"ЛИСТ!L23","v":""}]
[{"$f":"IF(ЛИСТ!J24=0,\"z\",\"\")","v":"z"},{"$f":"VLOOKUP(ЛИСТ!H24,Таблица3[[#All],[Столбец28]:[Столбец30]],2,0)","v":{"$error":"#N/A"}},{"$f":"CONCATENATE(ЛИСТ!C24,\"х\",ЛИСТ!D24,\"х\",ЛИСТ!G24)","v":"хх"},{"$f":"ЛИСТ!$H$6","v":80},{"$f":"ЛИСТ!E24","v":0},{"$f":"ЛИСТ!J24","v":0},{"$error":"#VALUE!"},{"$f":"ЛИСТ!L24","v":""}]
[{"$f":"IF(ЛИСТ!J25=0,\"z\",\"\")","v":"z"},{"$f":"VLOOKUP(ЛИСТ!H25,Таблица3[[#All],[Столбец28]:[Столбец30]],2,0)","v":{"$error":"#N/A"}},{"$f":"CONCATENATE(ЛИСТ!C25,\"х\",ЛИСТ!D25,\"х\",ЛИСТ!G25)","v":"хх"},{"$f":"ЛИСТ!$H$6","v":80},{"$f":"ЛИСТ!E25","v":0},{"$f":"ЛИСТ!J25","v":0},{"$error":"#VALUE!"},{"$f":"ЛИСТ!L25","v":""}]
[{"$f":"IF(ЛИСТ!J26=0,\"z\",\"\")","v":"z"},{"$f":"VLOOKUP(ЛИСТ!H26,Таблица3[[#All],[Столбец28]:[Столбец30]],2,0)","v":{"$error":"#N/A"}},{"$f":"CONCATENATE(ЛИСТ!C26,\"х\",ЛИСТ!D26,\"х\",ЛИСТ!G26)","v":"хх"},{"$f":"ЛИСТ!$H$6","v":80},{"$f":"ЛИСТ!E26","v":0},{"$f":"ЛИСТ!J26","v":0},{"$error":"#VALUE!"},{"$f":"ЛИСТ!L26","v":""}]
[{"$f":"IF(ЛИСТ!J27=0,\"z\",\"\")","v":"z"},{"$f":"VLOOKUP(ЛИСТ!H27,Таблица3[[#All],[Столбец28]:[Столбец30]],2,0)","v":{"$error":"#N/A"}},{"$f":"CONCATENATE(ЛИСТ!C27,\"х\",ЛИСТ!D27,\"х\",ЛИСТ!G27)","v":"хх"},{"$f":"ЛИСТ!$H$6","v":80},{"$f":"ЛИСТ!E27","v":0},{"$f":"ЛИСТ!J27","v":0},{"$error":"#VALUE!"},{"$f":"ЛИСТ!L27","v":""}]
[{"$f":"IF(ЛИСТ!J28=0,\"z\",\"\")","v":"z"},{"$f":"VLOOKUP(ЛИСТ!H28,Таблица3[[#All],[Столбец28]:[Столбец30]],2,0)","v":{"$error":"#N/A"}},{"$f":"CONCATENATE(ЛИСТ!C28,\"х\",ЛИСТ!D28,\"х\",ЛИСТ!G28)","v":"хх"},{"$f":"ЛИСТ!$H$6","v":80},{"$f":"ЛИСТ!E28","v":0},{"$f":"ЛИСТ!J28","v":0},{"$error":"#VALUE!"},{"$f":"ЛИСТ!L28","v":""}]
[{"$f":"IF(ЛИСТ!J29=0,\"z\",\"\")","v":"z"},{"$f":"VLOOKUP(ЛИСТ!H29,Таблица3[[#All],[Столбец28]:[Столбец30]],2,0)","v":{"$error":"#N/A"}},{"$f":"CONCATENATE(ЛИСТ!C29,\"х\",ЛИСТ!D29,\"х\",ЛИСТ!G29)","v":"хх"},{"$f":"ЛИСТ!$H$6","v":80},{"$f":"ЛИСТ!E29","v":0},{"$f":"ЛИСТ!J29","v":0},{"$error":"#VALUE!"},{"$f":"ЛИСТ!L29","v":""}]
[{"$f":"IF(ЛИСТ!J30=0,\"z\",\"\")","v":"z"},{"$f":"VLOOKUP(ЛИСТ!H30,Таблица3[[#All],[Столбец28]:[Столбец30]],2,0)","v":{"$error":"#N/A"}},{"$f":"CONCATENATE(ЛИСТ!C30,\"х\",ЛИСТ!D30,\"х\",ЛИСТ!G30)","v":"хх"},{"$f":"ЛИСТ!$H$6","v":80},{"$f":"ЛИСТ!E30","v":0},{"$f":"ЛИСТ!J30","v":0},{"$error":"#VALUE!"},{"$f":"ЛИСТ!L30","v":""}]
[{"$f":"IF(ЛИСТ!J31=0,\"z\",\"\")","v":"z"},{"$f":"VLOOKUP(ЛИСТ!H31,Таблица3[[#All],[Столбец28]:[Столбец30]],2,0)","v":{"$error":"#N/A"}},{"$f":"CONCATENATE(ЛИСТ!C31,\"х\",ЛИСТ!D31,\"х\",ЛИСТ!G31)","v":"хх"},{"$f":"ЛИСТ!$H$6","v":80},{"$f":"ЛИСТ!E31","v":0},{"$f":"ЛИСТ!J31","v":0},{"$error":"#VALUE!"},{"$f":"ЛИСТ!L31","v":""}]
[{"$f":"IF(ЛИСТ!J32=0,\"z\",\"\")","v":"z"},{"$f":"VLOOKUP(ЛИСТ!H32,Таблица3[[#All],[Столбец28]:[Столбец30]],2,0)","v":{"$error":"#N/A"}},{"$f":"CONCATENATE(ЛИСТ!C32,\"х\",ЛИСТ!D32,\"х\",ЛИСТ!G32)","v":"хх"},{"$f":"ЛИСТ!$H$6","v":80},{"$f":"ЛИСТ!E32","v":0},{"$f":"ЛИСТ!J32","v":0},{"$error":"#VALUE!"},{"$f":"ЛИСТ!L32","v":""}]
[{"$f":"IF(ЛИСТ!J33=0,\"z\",\"\")","v":"z"},{"$f":"VLOOKUP(ЛИСТ!H33,Таблица3[[#All],[Столбец28]:[Столбец30]],2,0)","v":{"$error":"#N/A"}},{"$f":"CONCATENATE(ЛИСТ!C33,\"х\",ЛИСТ!D33,\"х\",ЛИСТ!G33)","v":"хх"},{"$f":"ЛИСТ!$H$6","v":80},{"$f":"ЛИСТ!E33","v":0},{"$f":"ЛИСТ!J33","v":0},{"$error":"#VALUE!"},{"$f":"ЛИСТ!L33","v":""}]
[{"$f":"IF(ЛИСТ!J34=0,\"z\",\"\")","v":"z"},{"$f":"VLOOKUP(ЛИСТ!H34,Таблица3[[#All],[Столбец28]:[Столбец30]],2,0)","v":{"$error":"#N/A"}},{"$f":"CONCATENATE(ЛИСТ!C34,\"х\",ЛИСТ!D34,\"х\",ЛИСТ!G34)","v":"хх"},{"$f":"ЛИСТ!$H$6","v":80},{"$f":"ЛИСТ!E34","v":0},{"$f":"ЛИСТ!J34","v":0},{"$error":"#VALUE!"},{"$f":"ЛИСТ!L34","v":""}]
[{"$f":"IF(ЛИСТ!J35=0,\"z\",\"\")","v":"z"},{"$f":"VLOOKUP(ЛИСТ!H35,Таблица3[[#All],[Столбец28]:[Столбец30]],2,0)","v":{"$error":"#N/A"}},{"$f":"CONCATENATE(ЛИСТ!C35,\"х\",ЛИСТ!D35,\"х\",ЛИСТ!G35)","v":"хх"},{"$f":"ЛИСТ!$H$6","v":80},{"$f":"ЛИСТ!E35","v":0},{"$f":"ЛИСТ!J35","v":0},{"$error":"#VALUE!"},{"$f":"ЛИСТ!L35","v":""}]
[{"$f":"IF(ЛИСТ!J36=0,\"z\",\"\")","v":"z"},{"$f":"VLOOKUP(ЛИСТ!H36,Таблица3[[#All],[Столбец28]:[Столбец30]],2,0)","v":{"$error":"#N/A"}},{"$f":"CONCATENATE(ЛИСТ!C36,\"х\",ЛИСТ!D36,\"х\",ЛИСТ!G36)","v":"хх"},{"$f":"ЛИСТ!$H$6","v":80},{"$f":"ЛИСТ!E36","v":0},{"$f":"ЛИСТ!J36","v":0},{"$error":"#VALUE!"},{"$f":"ЛИСТ!L36","v":""}]
[{"$f":"IF(ЛИСТ!J37=0,\"z\",\"\")","v":"z"},{"$f":"VLOOKUP(ЛИСТ!H37,Таблица3[[#All],[Столбец28]:[Столбец30]],2,0)","v":{"$error":"#N/A"}},{"$f":"CONCATENATE(ЛИСТ!C37,\"х\",ЛИСТ!D37,\"х\",ЛИСТ!G37)","v":"хх"},{"$f":"ЛИСТ!$H$6","v":80},{"$f":"ЛИСТ!E37","v":0},{"$f":"ЛИСТ!J37","v":0},{"$f":"H31/D31","v":{"$error":"#VALUE!"}},{"$f":"ЛИСТ!L37","v":""}]
[{"$f":"IF(ЛИСТ!J38=0,\"z\",\"\")","v":"z"},{"$f":"VLOOKUP(ЛИСТ!H38,Таблица3[[#All],[Столбец28]:[Столбец30]],2,0)","v":{"$error":"#N/A"}},{"$f":"CONCATENATE(ЛИСТ!C38,\"х\",ЛИСТ!D38,\"х\",ЛИСТ!G38)","v":"хх"},{"$f":"ЛИСТ!$H$6","v":80},{"$f":"ЛИСТ!E38","v":0},{"$f":"ЛИСТ!J38","v":0},{"$error":"#VALUE!"},{"$f":"ЛИСТ!L38","v":""}]
[{"$f":"IF(ЛИСТ!J39=0,\"z\",\"\")","v":"z"},{"$f":"VLOOKUP(ЛИСТ!H39,Таблица3[[#All],[Столбец28]:[Столбец30]],2,0)","v":{"$error":"#N/A"}},{"$f":"CONCATENATE(ЛИСТ!C39,\"х\",ЛИСТ!D39,\"х\",ЛИСТ!G39)","v":"хх"},{"$f":"ЛИСТ!$H$6","v":80},{"$f":"ЛИСТ!E39","v":0},{"$f":"ЛИСТ!J39","v":0},{"$error":"#VALUE!"},{"$f":"ЛИСТ!L39","v":""}]
[{"$f":"IF(ЛИСТ!J40=0,\"z\",\"\")","v":"z"},{"$f":"VLOOKUP(ЛИСТ!H40,Таблица3[[#All],[Столбец28]:[Столбец30]],2,0)","v":{"$error":"#N/A"}},{"$f":"CONCATENATE(ЛИСТ!C40,\"х\",ЛИСТ!D40,\"х\",ЛИСТ!G40)","v":"хх"},{"$f":"ЛИСТ!$H$6","v":80},{"$f":"ЛИСТ!E40","v":0},{"$f":"ЛИСТ!J40","v":0},{"$error":"#VALUE!"},{"$f":"ЛИСТ!L40","v":""}]
[{"$f":"IF(ЛИСТ!J41=0,\"z\",\"\")","v":"z"},{"$f":"VLOOKUP(ЛИСТ!H41,Таблица3[[#All],[Столбец28]:[Столбец30]],2,0)","v":{"$error":"#N/A"}},{"$f":"CONCATENATE(ЛИСТ!C41,\"х\",ЛИСТ!D41,\"х\",ЛИСТ!G41)","v":"хх"},{"$f":"ЛИСТ!$H$6","v":80},{"$f":"ЛИСТ!E41","v":0},{"$f":"ЛИСТ!J41","v":0},{"$error":"#VALUE!"},{"$f":"ЛИСТ!L41","v":""}]
[{"$f":"IF(ЛИСТ!J42=0,\"z\",\"\")","v":"z"},{"$f":"VLOOKUP(ЛИСТ!H42,Таблица3[[#All],[Столбец28]:[Столбец30]],2,0)","v":{"$error":"#N/A"}},{"$f":"CONCATENATE(ЛИСТ!C42,\"х\",ЛИСТ!D42,\"х\",ЛИСТ!G42)","v":"хх"},{"$f":"ЛИСТ!$H$6","v":80},{"$f":"ЛИСТ!E42","v":0},{"$f":"ЛИСТ!J42","v":0},{"$error":"#VALUE!"},{"$f":"ЛИСТ!L42","v":""}]
[{"$f":"IF(ЛИСТ!J43=0,\"z\",\"\")","v":"z"},{"$f":"VLOOKUP(ЛИСТ!H43,Таблица3[[#All],[Столбец28]:[Столбец30]],2,0)","v":{"$error":"#N/A"}},{"$f":"CONCATENATE(ЛИСТ!C43,\"х\",ЛИСТ!D43,\"х\",ЛИСТ!G43)","v":"хх"},{"$f":"ЛИСТ!$H$6","v":80},{"$f":"ЛИСТ!E43","v":0},{"$f":"ЛИСТ!J43","v":0},{"$error":"#VALUE!"},{"$f":"ЛИСТ!L43","v":""}]
[{"$f":"IF(ЛИСТ!J44=0,\"z\",\"\")","v":"z"},{"$f":"VLOOKUP(ЛИСТ!H44,Таблица3[[#All],[Столбец28]:[Столбец30]],2,0)","v":{"$error":"#N/A"}},{"$f":"CONCATENATE(ЛИСТ!C44,\"х\",ЛИСТ!D44,\"х\",ЛИСТ!G44)","v":"хх"},{"$f":"ЛИСТ!$H$6","v":80},{"$f":"ЛИСТ!E44","v":0},{"$f":"ЛИСТ!J44","v":0},{"$error":"#VALUE!"},{"$f":"ЛИСТ!L44","v":""}]
[{"$f":"IF(ЛИСТ!J45=0,\"z\",\"\")","v":"z"},{"$f":"VLOOKUP(ЛИСТ!H45,Таблица3[[#All],[Столбец28]:[Столбец30]],2,0)","v":{"$error":"#N/A"}},{"$f":"CONCATENATE(ЛИСТ!C45,\"х\",ЛИСТ!D45,\"х\",ЛИСТ!G45)","v":"хх"},{"$f":"ЛИСТ!$H$6","v":80},{"$f":"ЛИСТ!E45","v":0},{"$f":"ЛИСТ!J45","v":0},{"$error":"#VALUE!"},{"$f":"ЛИСТ!L45","v":""}]
[{"$f":"IF(ЛИСТ!J46=0,\"z\",\"\")","v":"z"},{"$f":"VLOOKUP(ЛИСТ!H46,Таблица3[[#All],[Столбец28]:[Столбец30]],2,0)","v":{"$error":"#N/A"}},{"$f":"CONCATENATE(ЛИСТ!C46,\"х\",ЛИСТ!D46,\"х\",ЛИСТ!G46)","v":"хх"},{"$f":"ЛИСТ!$H$6","v":80},{"$f":"ЛИСТ!E46","v":0},{"$f":"ЛИСТ!J46","v":0},{"$error":"#VALUE!"},{"$f":"ЛИСТ!L46","v":""}]
[{"$f":"IF(ЛИСТ!J47=0,\"z\",\"\")","v":"z"},{"$f":"VLOOKUP(ЛИСТ!H47,Таблица3[[#All],[Столбец28]:[Столбец30]],2,0)","v":{"$error":"#N/A"}},{"$f":"CONCATENATE(ЛИСТ!C47,\"х\",ЛИСТ!D47,\"х\",ЛИСТ!G47)","v":"хх"},{"$f":"ЛИСТ!$H$6","v":80},{"$f":"ЛИСТ!E47","v":0},{"$f":"ЛИСТ!J47","v":0},{"$error":"#VALUE!"},{"$f":"ЛИСТ!L47","v":""}]
[{"$f":"IF(ЛИСТ!J48=0,\"z\",\"\")","v":"z"},{"$f":"VLOOKUP(ЛИСТ!H48,Таблица3[[#All],[Столбец28]:[Столбец30]],2,0)","v":{"$error":"#N/A"}},{"$f":"CONCATENATE(ЛИСТ!C48,\"х\",ЛИСТ!D48,\"х\",ЛИСТ!G48)","v":"хх"},{"$f":"ЛИСТ!$H$6","v":80},{"$f":"ЛИСТ!E48","v":0},{"$f":"ЛИСТ!J48","v":0},{"$error":"#VALUE!"},{"$f":"ЛИСТ!L48","v":""}]
[{"$f":"IF(ЛИСТ!J49=0,\"z\",\"\")","v":"z"},{"$f":"VLOOKUP(ЛИСТ!H49,Таблица3[[#All],[Столбец28]:[Столбец30]],2,0)","v":{"$error":"#N/A"}},{"$f":"CONCATENATE(ЛИСТ!C49,\"х\",ЛИСТ!D49,\"х\",ЛИСТ!G49)","v":"хх"},{"$f":"ЛИСТ!$H$6","v":80},{"$f":"ЛИСТ!E49","v":0},{"$f":"ЛИСТ!J49","v":0},{"$error":"#VALUE!"},{"$f":"ЛИСТ!L49","v":""}]
[{"$f":"IF(ЛИСТ!J50=0,\"z\",\"\")","v":"z"},{"$f":"VLOOKUP(ЛИСТ!H50,Таблица3[[#All],[Столбец28]:[Столбец30]],2,0)","v":{"$error":"#N/A"}},{"$f":"CONCATENATE(ЛИСТ!C50,\"х\",ЛИСТ!D50,\"х\",ЛИСТ!G50)","v":"хх"},{"$f":"ЛИСТ!$H$6","v":80},{"$f":"ЛИСТ!E50","v":0},{"$f":"ЛИСТ!J50","v":0},{"$error":"#VALUE!"},{"$f":"ЛИСТ!L50","v":""}]
[{"$f":"IF(ЛИСТ!J51=0,\"z\",\"\")","v":"z"},{"$f":"VLOOKUP(ЛИСТ!H51,Таблица3[[#All],[Столбец28]:[Столбец30]],2,0)","v":{"$error":"#N/A"}},{"$f":"CONCATENATE(ЛИСТ!C51,\"х\",ЛИСТ!D51,\"х\",ЛИСТ!G51)","v":"хх"},{"$f":"ЛИСТ!$H$6","v":80},{"$f":"ЛИСТ!E51","v":0},{"$f":"ЛИСТ!J51","v":0},{"$error":"#VALUE!"},{"$f":"ЛИСТ!L51","v":""}]
[{"$f":"IF(ЛИСТ!J52=0,\"z\",\"\")","v":"z"},{"$f":"VLOOKUP(ЛИСТ!H52,Таблица3[[#All],[Столбец28]:[Столбец30]],2,0)","v":{"$error":"#N/A"}},{"$f":"CONCATENATE(ЛИСТ!C52,\"х\",ЛИСТ!D52,\"х\",ЛИСТ!G52)","v":"хх"},{"$f":"ЛИСТ!$H$6","v":80},{"$f":"ЛИСТ!E52","v":0},{"$f":"ЛИСТ!J52","v":0},{"$error":"#VALUE!"},{"$f":"ЛИСТ!L52","v":""}]
[{"$f":"IF(ЛИСТ!J53=0,\"z\",\"\")","v":"z"},{"$f":"VLOOKUP(ЛИСТ!H53,Таблица3[[#All],[Столбец28]:[Столбец30]],2,0)","v":{"$error":"#N/A"}},{"$f":"CONCATENATE(ЛИСТ!C53,\"х\",ЛИСТ!D53,\"х\",ЛИСТ!G53)","v":"хх"},{"$f":"ЛИСТ!$H$6","v":80},{"$f":"ЛИСТ!E53","v":0},{"$f":"ЛИСТ!J53","v":0},{"$error":"#VALUE!"},{"$f":"ЛИСТ!L53","v":""}]
[{"$f":"IF(ЛИСТ!J54=0,\"z\",\"\")","v":"z"},{"$f":"VLOOKUP(ЛИСТ!H54,Таблица3[[#All],[Столбец28]:[Столбец30]],2,0)","v":{"$error":"#N/A"}},{"$f":"CONCATENATE(ЛИСТ!C54,\"х\",ЛИСТ!D54,\"х\",ЛИСТ!G54)","v":"хх"},{"$f":"ЛИСТ!$H$6","v":80},{"$f":"ЛИСТ!E54","v":0},{"$f":"ЛИСТ!J54","v":0},{"$error":"#VALUE!"},{"$f":"ЛИСТ!L54","v":""}]
[{"$f":"IF(ЛИСТ!J55=0,\"z\",\"\")","v":"z"},{"$f":"VLOOKUP(ЛИСТ!H55,Таблица3[[#All],[Столбец28]:[Столбец30]],2,0)","v":{"$error":"#N/A"}},{"$f":"CONCATENATE(ЛИСТ!C55,\"х\",ЛИСТ!D55,\"х\",ЛИСТ!G55)","v":"хх"},{"$f":"ЛИСТ!$H$6","v":80},{"$f":"ЛИСТ!E55","v":0},{"$f":"ЛИСТ!J55","v":0},{"$error":"#VALUE!"},{"$f":"ЛИСТ!L55","v":""}]
[{"$f":"IF(ЛИСТ!J56=0,\"z\",\"\")","v":"z"},{"$f":"VLOOKUP(ЛИСТ!H56,Таблица3[[#All],[Столбец28]:[Столбец30]],2,0)","v":{"$error":"#N/A"}},{"$f":"CONCATENATE(ЛИСТ!C56,\"х\",ЛИСТ!D56,\"х\",ЛИСТ!G56)","v":"хх"},{"$f":"ЛИСТ!$H$6","v":80},{"$f":"ЛИСТ!E56","v":0},{"$f":"ЛИСТ!J56","v":0},{"$error":"#VALUE!"},{"$f":"ЛИСТ!L56","v":""}]
[{"$f":"IF(ЛИСТ!J57=0,\"z\",\"\")","v":"z"},{"$f":"VLOOKUP(ЛИСТ!H57,Таблица3[[#All],[Столбец28]:[Столбец30]],2,0)","v":{"$error":"#N/A"}},{"$f":"CONCATENATE(ЛИСТ!C57,\"х\",ЛИСТ!D57,\"х\",ЛИСТ!G57)","v":"хх"},{"$f":"ЛИСТ!$H$6","v":80},{"$f":"ЛИСТ!E57","v":0},{"$f":"ЛИСТ!J57","v":0},{"$error":"#VALUE!"},{"$f":"ЛИСТ!L57","v":""}]

{"sheet":"Д-проволока","index":6,"n_rows":72,"n_cols":8,"rows_kept":72,"cut":false,"hidden":false,"merged":[]}
[null,null,null,"план","на1кт","кол.на.пл","вес1кт","вес.план"]
[{"$f":"ПРОВОЛОКА!A10","v":"2д"},{"$f":"IF(E2=0,\"z\",\"Проволока\")","v":"Проволока"},{"$f":"CONCATENATE(ПРОВОЛОКА!B10,ПРОВОЛОКА!C10)","v":"Ø8,0х1000"},{"$f":"ПРОВОЛОКА!E10","v":1500},{"$f":"ПРОВОЛОКА!I10","v":1},{"$f":"ПРОВОЛОКА!J10","v":1500},{"$f":"ПРОВОЛОКА!N10","v":0.39188000000000001},{"$f":"ПРОВОЛОКА!R10","v":587.82000000000005}]
[{"$f":"ПРОВОЛОКА!A11","v":"гиб"},{"$f":"IF(E3=0,\"z\",\"Проволока\")","v":"Проволока"},{"$f":"CONCATENATE(ПРОВОЛОКА!B11,ПРОВОЛОКА!C11)","v":"Ø8,0х100"},{"$f":"ПРОВОЛОКА!E11","v":1500},{"$f":"ПРОВОЛОКА!I11","v":5},{"$f":"ПРОВОЛОКА!J11","v":7500},{"$f":"ПРОВОЛОКА!N11","v":0.22310000000000002},{"$f":"ПРОВОЛОКА!R11","v":334.65000000000003}]
[{"$f":"ПРОВОЛОКА!A12","v":"z"},"z",{"$f":"CONCATENATE(ПРОВОЛОКА!B12,ПРОВОЛОКА!C12)","v":"Ø8,0х"},{"$f":"ПРОВОЛОКА!E12","v":1500},{"$f":"ПРОВОЛОКА!I12","v":0},{"$f":"ПРОВОЛОКА!J12","v":0},{"$f":"ПРОВОЛОКА!N12","v":0},{"$f":"ПРОВОЛОКА!R12","v":0}]
[{"$f":"ПРОВОЛОКА!A13","v":"z"},"z",{"$f":"CONCATENATE(ПРОВОЛОКА!B13,ПРОВОЛОКА!C13)","v":"Ø8,0х"},{"$f":"ПРОВОЛОКА!E13","v":1500},{"$f":"ПРОВОЛОКА!I13","v":0},{"$f":"ПРОВОЛОКА!J13","v":0},{"$f":"ПРОВОЛОКА!N13","v":0},{"$f":"ПРОВОЛОКА!R13","v":0}]
[{"$f":"ПРОВОЛОКА!A14","v":"z"},"z",{"$f":"CONCATENATE(ПРОВОЛОКА!B14,ПРОВОЛОКА!C14)","v":"Ø8,0х"},{"$f":"ПРОВОЛОКА!E14","v":1500},{"$f":"ПРОВОЛОКА!I14","v":0},{"$f":"ПРОВОЛОКА!J14","v":0},{"$f":"ПРОВОЛОКА!N14","v":0},{"$f":"ПРОВОЛОКА!R14","v":0}]
["z","z",{"$f":"CONCATENATE(ПРОВОЛОКА!B15,ПРОВОЛОКА!C15)","v":""},{"$f":"ПРОВОЛОКА!E15","v":0},{"$f":"ПРОВОЛОКА!I15","v":0},{"$f":"ПРОВОЛОКА!J15","v":0},{"$f":"ПРОВОЛОКА!N15","v":0.61498000000000008},{"$f":"ПРОВОЛОКА!R15","v":922.47}]
[{"$f":"ПРОВОЛОКА!A16","v":"z"},"z",{"$f":"CONCATENATE(ПРОВОЛОКА!B16,ПРОВОЛОКА!C16)","v":"Ø6,0х"},{"$f":"ПРОВОЛОКА!E16","v":1500},{"$f":"ПРОВОЛОКА!I16","v":0},{"$f":"ПРОВОЛОКА!J16","v":0},{"$f":"ПРОВОЛОКА!N16","v":0},{"$f":"ПРОВОЛОКА!R16","v":0}]
[{"$f":"ПРОВОЛОКА!A17","v":"z"},"z",{"$f":"CONCATENATE(ПРОВОЛОКА!B17,ПРОВОЛОКА!C17)","v":"Ø6,0х"},{"$f":"ПРОВОЛОКА!E17","v":1500},{"$f":"ПРОВОЛОКА!I17","v":0},{"$f":"ПРОВОЛОКА!J17","v":0},{"$f":"ПРОВОЛОКА!N17","v":0},{"$f":"ПРОВОЛОКА!R17","v":0}]
[{"$f":"ПРОВОЛОКА!A18","v":"z"},"z",{"$f":"CONCATENATE(ПРОВОЛОКА!B18,ПРОВОЛОКА!C18)","v":"Ø6,0х"},{"$f":"ПРОВОЛОКА!E18","v":1500},{"$f":"ПРОВОЛОКА!I18","v":0},{"$f":"ПРОВОЛОКА!J18","v":0},{"$f":"ПРОВОЛОКА!N18","v":0},{"$f":"ПРОВОЛОКА!R18","v":0}]
[{"$f":"ПРОВОЛОКА!A19","v":"z"},"z",{"$f":"CONCATENATE(ПРОВОЛОКА!B19,ПРОВОЛОКА!C19)","v":"Ø6,0х"},{"$f":"ПРОВОЛОКА!E19","v":1500},{"$f":"ПРОВОЛОКА!I19","v":0},{"$f":"ПРОВОЛОКА!J19","v":0},{"$f":"ПРОВОЛОКА!N19","v":0},{"$f":"ПРОВОЛОКА!R19","v":0}]
[{"$f":"ПРОВОЛОКА!A20","v":"z"},"z",{"$f":"CONCATENATE(ПРОВОЛОКА!B20,ПРОВОЛОКА!C20)","v":"Ø6,0х"},{"$f":"ПРОВОЛОКА!E20","v":1500},{"$f":"ПРОВОЛОКА!I20","v":0},{"$f":"ПРОВОЛОКА!J20","v":0},{"$f":"ПРОВОЛОКА!N20","v":0},{"$f":"ПРОВОЛОКА!R20","v":0}]
["z","z",{"$f":"CONCATENATE(ПРОВОЛОКА!B21,ПРОВОЛОКА!C21)","v":""},{"$f":"ПРОВОЛОКА!E21","v":0},{"$f":"ПРОВОЛОКА!I21","v":0},{"$f":"ПРОВОЛОКА!J21","v":0},{"$f":"ПРОВОЛОКА!N21","v":0},{"$f":"ПРОВОЛОКА!R21","v":0}]
[{"$f":"ПРОВОЛОКА!A22","v":"z"},"z",{"$f":"CONCATENATE(ПРОВОЛОКА!B22,ПРОВОЛОКА!C22)","v":"Ø5,0х"},{"$f":"ПРОВОЛОКА!E22","v":1500},{"$f":"ПРОВОЛОКА!I22","v":0},{"$f":"ПРОВОЛОКА!J22","v":0},{"$f":"ПРОВОЛОКА!N22","v":0},{"$f":"ПРОВОЛОКА!R22","v":0}]
[{"$f":"ПРОВОЛОКА!A23","v":"z"},"z",{"$f":"CONCATENATE(ПРОВОЛОКА!B23,ПРОВОЛОКА!C23)","v":"Ø5,0х"},{"$f":"ПРОВОЛОКА!E23","v":1500},{"$f":"ПРОВОЛОКА!I23","v":0},{"$f":"ПРОВОЛОКА!J23","v":0},{"$f":"ПРОВОЛОКА!N23","v":0},{"$f":"ПРОВОЛОКА!R23","v":0}]
[{"$f":"ПРОВОЛОКА!A24","v":"z"},"z",{"$f":"CONCATENATE(ПРОВОЛОКА!B24,ПРОВОЛОКА!C24)","v":"Ø5,0х"},{"$f":"ПРОВОЛОКА!E24","v":1500},{"$f":"ПРОВОЛОКА!I24","v":0},{"$f":"ПРОВОЛОКА!J24","v":0},{"$f":"ПРОВОЛОКА!N24","v":0},{"$f":"ПРОВОЛОКА!R24","v":0}]
[{"$f":"ПРОВОЛОКА!A25","v":"z"},"z",{"$f":"CONCATENATE(ПРОВОЛОКА!B25,ПРОВОЛОКА!C25)","v":"Ø5,0х"},{"$f":"ПРОВОЛОКА!E25","v":1500},{"$f":"ПРОВОЛОКА!I25","v":0},{"$f":"ПРОВОЛОКА!J25","v":0},{"$f":"ПРОВОЛОКА!N25","v":0},{"$f":"ПРОВОЛОКА!R25","v":0}]
[{"$f":"ПРОВОЛОКА!A26","v":"z"},"z",{"$f":"CONCATENATE(ПРОВОЛОКА!B26,ПРОВОЛОКА!C26)","v":"Ø5,0х"},{"$f":"ПРОВОЛОКА!E26","v":1500},{"$f":"ПРОВОЛОКА!I26","v":0},{"$f":"ПРОВОЛОКА!J26","v":0},{"$f":"ПРОВОЛОКА!N26","v":0},{"$f":"ПРОВОЛОКА!R26","v":0}]
[{"$f":"ПРОВОЛОКА!A27","v":"z"},"z",{"$f":"CONCATENATE(ПРОВОЛОКА!B27,ПРОВОЛОКА!C27)","v":"Ø5,0х"},{"$f":"ПРОВОЛОКА!E27","v":1500},{"$f":"ПРОВОЛОКА!I27","v":0},{"$f":"ПРОВОЛОКА!J27","v":0},{"$f":"ПРОВОЛОКА!N27","v":0},{"$f":"ПРОВОЛОКА!R27","v":0}]
[{"$f":"ПРОВОЛОКА!A28","v":"z"},"z",{"$f":"CONCATENATE(ПРОВОЛОКА!B28,ПРОВОЛОКА!C28)","v":"Ø5,0х"},{"$f":"ПРОВОЛОКА!E28","v":1500},{"$f":"ПРОВОЛОКА!I28","v":0},{"$f":"ПРОВОЛОКА!J28","v":0},{"$f":"ПРОВОЛОКА!N28","v":0},{"$f":"ПРОВОЛОКА!R28","v":0}]
[{"$f":"ПРОВОЛОКА!A29","v":"z"},"z",{"$f":"CONCATENATE(ПРОВОЛОКА!B29,ПРОВОЛОКА!C29)","v":"Ø5,0х"},{"$f":"ПРОВОЛОКА!E29","v":1500},{"$f":"ПРОВОЛОКА!I29","v":0},{"$f":"ПРОВОЛОКА!J29","v":0},{"$f":"ПРОВОЛОКА!N29","v":0},{"$f":"ПРОВОЛОКА!R29","v":0}]
["z","z",{"$f":"CONCATENATE(ПРОВОЛОКА!B30,ПРОВОЛОКА!C30)","v":""},{"$f":"ПРОВОЛОКА!E30","v":0},{"$f":"ПРОВОЛОКА!I30","v":0},{"$f":"ПРОВОЛОКА!J30","v":0},{"$f":"ПРОВОЛОКА!N30","v":0},{"$f":"ПРОВОЛОКА!R30","v":0}]
[{"$f":"ПРОВОЛОКА!A31","v":"z"},"z",{"$f":"CONCATENATE(ПРОВОЛОКА!B31,ПРОВОЛОКА!C31)","v":"Ø4,0х"},{"$f":"ПРОВОЛОКА!E31","v":1500},{"$f":"ПРОВОЛОКА!I31","v":0},{"$f":"ПРОВОЛОКА!J31","v":0},{"$f":"ПРОВОЛОКА!N31","v":0},{"$f":"ПРОВОЛОКА!R31","v":0}]
[{"$f":"ПРОВОЛОКА!A32","v":"z"},"z",{"$f":"CONCATENATE(ПРОВОЛОКА!B32,ПРОВОЛОКА!C32)","v":"Ø4,0х"},{"$f":"ПРОВОЛОКА!E32","v":1500},{"$f":"ПРОВОЛОКА!I32","v":0},{"$f":"ПРОВОЛОКА!J32","v":0},{"$f":"ПРОВОЛОКА!N32","v":0},{"$f":"ПРОВОЛОКА!R32","v":0}]
[{"$f":"ПРОВОЛОКА!A33","v":"z"},"z",{"$f":"CONCATENATE(ПРОВОЛОКА!B33,ПРОВОЛОКА!C33)","v":"Ø4,0х"},{"$f":"ПРОВОЛОКА!E33","v":1500},{"$f":"ПРОВОЛОКА!I33","v":0},{"$f":"ПРОВОЛОКА!J33","v":0},{"$f":"ПРОВОЛОКА!N33","v":0},{"$f":"ПРОВОЛОКА!R33","v":0}]
[{"$f":"ПРОВОЛОКА!A34","v":"z"},"z",{"$f":"CONCATENATE(ПРОВОЛОКА!B34,ПРОВОЛОКА!C34)","v":"Ø4,0х"},{"$f":"ПРОВОЛОКА!E34","v":1500},{"$f":"ПРОВОЛОКА!I34","v":0},{"$f":"ПРОВОЛОКА!J34","v":0},{"$f":"ПРОВОЛОКА!N34","v":0},{"$f":"ПРОВОЛОКА!R34","v":0}]
[{"$f":"ПРОВОЛОКА!A35","v":"z"},"z",{"$f":"CONCATENATE(ПРОВОЛОКА!B35,ПРОВОЛОКА!C35)","v":"Ø4,0х"},{"$f":"ПРОВОЛОКА!E35","v":1500},{"$f":"ПРОВОЛОКА!I35","v":0},{"$f":"ПРОВОЛОКА!J35","v":0},{"$f":"ПРОВОЛОКА!N35","v":0},{"$f":"ПРОВОЛОКА!R35","v":0}]
[{"$f":"ПРОВОЛОКА!A36","v":"z"},"z",{"$f":"CONCATENATE(ПРОВОЛОКА!B36,ПРОВОЛОКА!C36)","v":"Ø4,0х"},{"$f":"ПРОВОЛОКА!E36","v":1500},{"$f":"ПРОВОЛОКА!I36","v":0},{"$f":"ПРОВОЛОКА!J36","v":0},{"$f":"ПРОВОЛОКА!N36","v":0},{"$f":"ПРОВОЛОКА!R36","v":0}]
[{"$f":"ПРОВОЛОКА!A37","v":"z"},"z",{"$f":"CONCATENATE(ПРОВОЛОКА!B37,ПРОВОЛОКА!C37)","v":"Ø4,0х"},{"$f":"ПРОВОЛОКА!E37","v":1500},{"$f":"ПРОВОЛОКА!I37","v":0},{"$f":"ПРОВОЛОКА!J37","v":0},{"$f":"ПРОВОЛОКА!N37","v":0},{"$f":"ПРОВОЛОКА!R37","v":0}]
[{"$f":"ПРОВОЛОКА!A38","v":"z"},"z",{"$f":"CONCATENATE(ПРОВОЛОКА!B38,ПРОВОЛОКА!C38)","v":"Ø4,0х"},{"$f":"ПРОВОЛОКА!E38","v":1500},{"$f":"ПРОВОЛОКА!I38","v":0},{"$f":"ПРОВОЛОКА!J38","v":0},{"$f":"ПРОВОЛОКА!N38","v":0},{"$f":"ПРОВОЛОКА!R38","v":0}]
[{"$f":"ПРОВОЛОКА!A39","v":"z"},"z",{"$f":"CONCATENATE(ПРОВОЛОКА!B39,ПРОВОЛОКА!C39)","v":"Ø4,0х"},{"$f":"ПРОВОЛОКА!E39","v":1500},{"$f":"ПРОВОЛОКА!I39","v":0},{"$f":"ПРОВОЛОКА!J39","v":0},{"$f":"ПРОВОЛОКА!N39","v":0},{"$f":"ПРОВОЛОКА!R39","v":0}]
[{"$f":"ПРОВОЛОКА!A40","v":"z"},"z",{"$f":"CONCATENATE(ПРОВОЛОКА!B40,ПРОВОЛОКА!C40)","v":"Ø4,0х"},{"$f":"ПРОВОЛОКА!E40","v":1500},{"$f":"ПРОВОЛОКА!I40","v":0},{"$f":"ПРОВОЛОКА!J40","v":0},{"$f":"ПРОВОЛОКА!N40","v":0},{"$f":"ПРОВОЛОКА!R40","v":0}]
["z","z",{"$f":"CONCATENATE(ПРОВОЛОКА!B41,ПРОВОЛОКА!C41)","v":""},{"$f":"ПРОВОЛОКА!E41","v":0},{"$f":"ПРОВОЛОКА!I41","v":0},{"$f":"ПРОВОЛОКА!J41","v":0},{"$f":"ПРОВОЛОКА!N41","v":0},{"$f":"ПРОВОЛОКА!R41","v":0}]
[{"$f":"ПРОВОЛОКА!A42","v":"z"},"z",{"$f":"CONCATENATE(ПРОВОЛОКА!B42,ПРОВОЛОКА!C42)","v":"Ø3,5х"},{"$f":"ПРОВОЛОКА!E42","v":1500},{"$f":"ПРОВОЛОКА!I42","v":0},{"$f":"ПРОВОЛОКА!J42","v":0},{"$f":"ПРОВОЛОКА!N42","v":0},{"$f":"ПРОВОЛОКА!R42","v":0}]
[{"$f":"ПРОВОЛОКА!A43","v":"z"},"z",{"$f":"CONCATENATE(ПРОВОЛОКА!B43,ПРОВОЛОКА!C43)","v":"Ø3,5х"},{"$f":"ПРОВОЛОКА!E43","v":1500},{"$f":"ПРОВОЛОКА!I43","v":0},{"$f":"ПРОВОЛОКА!J43","v":0},{"$f":"ПРОВОЛОКА!N43","v":0},{"$f":"ПРОВОЛОКА!R43","v":0}]
[{"$f":"ПРОВОЛОКА!A44","v":"z"},"z",{"$f":"CONCATENATE(ПРОВОЛОКА!B44,ПРОВОЛОКА!C44)","v":"Ø3,5х"},{"$f":"ПРОВОЛОКА!E44","v":1500},{"$f":"ПРОВОЛОКА!I44","v":0},{"$f":"ПРОВОЛОКА!J44","v":0},{"$f":"ПРОВОЛОКА!N44","v":0},{"$f":"ПРОВОЛОКА!R44","v":0}]
[{"$f":"ПРОВОЛОКА!A45","v":"z"},"z",{"$f":"CONCATENATE(ПРОВОЛОКА!B45,ПРОВОЛОКА!C45)","v":"Ø3,5х"},{"$f":"ПРОВОЛОКА!E45","v":1500},{"$f":"ПРОВОЛОКА!I45","v":0},{"$f":"ПРОВОЛОКА!J45","v":0},{"$f":"ПРОВОЛОКА!N45","v":0},{"$f":"ПРОВОЛОКА!R45","v":0}]
[{"$f":"ПРОВОЛОКА!A46","v":"z"},"z",{"$f":"CONCATENATE(ПРОВОЛОКА!B46,ПРОВОЛОКА!C46)","v":"Ø3,5х"},{"$f":"ПРОВОЛОКА!E46","v":1500},{"$f":"ПРОВОЛОКА!I46","v":0},{"$f":"ПРОВОЛОКА!J46","v":0},{"$f":"ПРОВОЛОКА!N46","v":0},{"$f":"ПРОВОЛОКА!R46","v":0}]
[{"$f":"ПРОВОЛОКА!A47","v":"z"},"z",{"$f":"CONCATENATE(ПРОВОЛОКА!B47,ПРОВОЛОКА!C47)","v":"Ø3,5х"},{"$f":"ПРОВОЛОКА!E47","v":1500},{"$f":"ПРОВОЛОКА!I47","v":0},{"$f":"ПРОВОЛОКА!J47","v":0},{"$f":"ПРОВОЛОКА!N47","v":0},{"$f":"ПРОВОЛОКА!R47","v":0}]
[{"$f":"ПРОВОЛОКА!A48","v":"z"},"z",{"$f":"CONCATENATE(ПРОВОЛОКА!B48,ПРОВОЛОКА!C48)","v":"Ø3,5х"},{"$f":"ПРОВОЛОКА!E48","v":1500},{"$f":"ПРОВОЛОКА!I48","v":0},{"$f":"ПРОВОЛОКА!J48","v":0},{"$f":"ПРОВОЛОКА!N48","v":0},{"$f":"ПРОВОЛОКА!R48","v":0}]
[{"$f":"ПРОВОЛОКА!A49","v":"z"},"z",{"$f":"CONCATENATE(ПРОВОЛОКА!B49,ПРОВОЛОКА!C49)","v":"Ø3,5х"},{"$f":"ПРОВОЛОКА!E49","v":1500},{"$f":"ПРОВОЛОКА!I49","v":0},{"$f":"ПРОВОЛОКА!J49","v":0},{"$f":"ПРОВОЛОКА!N49","v":0},{"$f":"ПРОВОЛОКА!R49","v":0}]
[{"$f":"ПРОВОЛОКА!A50","v":"z"},"z",{"$f":"CONCATENATE(ПРОВОЛОКА!B50,ПРОВОЛОКА!C50)","v":"Ø3,5х"},{"$f":"ПРОВОЛОКА!E50","v":1500},{"$f":"ПРОВОЛОКА!I50","v":0},{"$f":"ПРОВОЛОКА!J50","v":0},{"$f":"ПРОВОЛОКА!N50","v":0},{"$f":"ПРОВОЛОКА!R50","v":0}]
[{"$f":"ПРОВОЛОКА!A51","v":"z"},"z",{"$f":"CONCATENATE(ПРОВОЛОКА!B51,ПРОВОЛОКА!C51)","v":"Ø3,5х"},{"$f":"ПРОВОЛОКА!E51","v":1500},{"$f":"ПРОВОЛОКА!I51","v":0},{"$f":"ПРОВОЛОКА!J51","v":0},{"$f":"ПРОВОЛОКА!N51","v":0},{"$f":"ПРОВОЛОКА!R51","v":0}]
["z","z",{"$f":"CONCATENATE(ПРОВОЛОКА!B52,ПРОВОЛОКА!C52)","v":""},{"$f":"ПРОВОЛОКА!E52","v":0},{"$f":"ПРОВОЛОКА!I52","v":0},{"$f":"ПРОВОЛОКА!J52","v":0},{"$f":"ПРОВОЛОКА!N52","v":0},{"$f":"ПРОВОЛОКА!R52","v":0}]
[{"$f":"ПРОВОЛОКА!A53","v":"z"},"z",{"$f":"CONCATENATE(ПРОВОЛОКА!B53,ПРОВОЛОКА!C53)","v":"Ø3,0х"},{"$f":"ПРОВОЛОКА!E53","v":1500},{"$f":"ПРОВОЛОКА!I53","v":0},{"$f":"ПРОВОЛОКА!J53","v":0},{"$f":"ПРОВОЛОКА!N53","v":0},{"$f":"ПРОВОЛОКА!R53","v":0}]
[{"$f":"ПРОВОЛОКА!A54","v":"z"},"z",{"$f":"CONCATENATE(ПРОВОЛОКА!B54,ПРОВОЛОКА!C54)","v":"Ø3,0х"},{"$f":"ПРОВОЛОКА!E54","v":1500},{"$f":"ПРОВОЛОКА!I54","v":0},{"$f":"ПРОВОЛОКА!J54","v":0},{"$f":"ПРОВОЛОКА!N54","v":0},{"$f":"ПРОВОЛОКА!R54","v":0}]
[{"$f":"ПРОВОЛОКА!A55","v":"z"},"z",{"$f":"CONCATENATE(ПРОВОЛОКА!B55,ПРОВОЛОКА!C55)","v":"Ø3,0х"},{"$f":"ПРОВОЛОКА!E55","v":1500},{"$f":"ПРОВОЛОКА!I55","v":0},{"$f":"ПРОВОЛОКА!J55","v":0},{"$f":"ПРОВОЛОКА!N55","v":0},{"$f":"ПРОВОЛОКА!R55","v":0}]
[{"$f":"ПРОВОЛОКА!A56","v":"z"},"z",{"$f":"CONCATENATE(ПРОВОЛОКА!B56,ПРОВОЛОКА!C56)","v":"Ø3,0х"},{"$f":"ПРОВОЛОКА!E56","v":1500},{"$f":"ПРОВОЛОКА!I56","v":0},{"$f":"ПРОВОЛОКА!J56","v":0},{"$f":"ПРОВОЛОКА!N56","v":0},{"$f":"ПРОВОЛОКА!R56","v":0}]
[{"$f":"ПРОВОЛОКА!A57","v":"z"},"z",{"$f":"CONCATENATE(ПРОВОЛОКА!B57,ПРОВОЛОКА!C57)","v":"Ø3,0х"},{"$f":"ПРОВОЛОКА!E57","v":1500},{"$f":"ПРОВОЛОКА!I57","v":0},{"$f":"ПРОВОЛОКА!J57","v":0},{"$f":"ПРОВОЛОКА!N57","v":0},{"$f":"ПРОВОЛОКА!R57","v":0}]
[{"$f":"ПРОВОЛОКА!A58","v":"z"},"z",{"$f":"CONCATENATE(ПРОВОЛОКА!B58,ПРОВОЛОКА!C58)","v":"Ø3,0х"},{"$f":"ПРОВОЛОКА!E58","v":1500},{"$f":"ПРОВОЛОКА!I58","v":0},{"$f":"ПРОВОЛОКА!J58","v":0},{"$f":"ПРОВОЛОКА!N58","v":0},{"$f":"ПРОВОЛОКА!R58","v":0}]
[{"$f":"ПРОВОЛОКА!A59","v":"z"},"z",{"$f":"CONCATENATE(ПРОВОЛОКА!B59,ПРОВОЛОКА!C59)","v":"Ø3,0х"},{"$f":"ПРОВОЛОКА!E59","v":1500},{"$f":"ПРОВОЛОКА!I59","v":0},{"$f":"ПРОВОЛОКА!J59","v":0},{"$f":"ПРОВОЛОКА!N59","v":0},{"$f":"ПРОВОЛОКА!R59","v":0}]
[{"$f":"ПРОВОЛОКА!A60","v":"z"},"z",{"$f":"CONCATENATE(ПРОВОЛОКА!B60,ПРОВОЛОКА!C60)","v":"Ø3,0х"},{"$f":"ПРОВОЛОКА!E60","v":1500},{"$f":"ПРОВОЛОКА!I60","v":0},{"$f":"ПРОВОЛОКА!J60","v":0},{"$f":"ПРОВОЛОКА!N60","v":0},{"$f":"ПРОВОЛОКА!R60","v":0}]
[{"$f":"ПРОВОЛОКА!A61","v":"z"},"z",{"$f":"CONCATENATE(ПРОВОЛОКА!B61,ПРОВОЛОКА!C61)","v":"Ø3,0х"},{"$f":"ПРОВОЛОКА!E61","v":1500},{"$f":"ПРОВОЛОКА!I61","v":0},{"$f":"ПРОВОЛОКА!J61","v":0},{"$f":"ПРОВОЛОКА!N61","v":0},{"$f":"ПРОВОЛОКА!R61","v":0}]
[{"$f":"ПРОВОЛОКА!A62","v":"z"},"z",{"$f":"CONCATENATE(ПРОВОЛОКА!B62,ПРОВОЛОКА!C62)","v":"Ø3,0х"},{"$f":"ПРОВОЛОКА!E62","v":1500},{"$f":"ПРОВОЛОКА!I62","v":0},{"$f":"ПРОВОЛОКА!J62","v":0},{"$f":"ПРОВОЛОКА!N62","v":0},{"$f":"ПРОВОЛОКА!R62","v":0}]
["z","z",{"$f":"CONCATENATE(ПРОВОЛОКА!B63,ПРОВОЛОКА!C63)","v":""},{"$f":"ПРОВОЛОКА!E63","v":0},{"$f":"ПРОВОЛОКА!I63","v":0},{"$f":"ПРОВОЛОКА!J63","v":0},{"$f":"ПРОВОЛОКА!N63","v":0},{"$f":"ПРОВОЛОКА!R63","v":0}]
[{"$f":"ПРОВОЛОКА!A64","v":"z"},"z",{"$f":"CONCATENATE(ПРОВОЛОКА!B64,ПРОВОЛОКА!C64)","v":"Ø2,5х"},{"$f":"ПРОВОЛОКА!E64","v":1500},{"$f":"ПРОВОЛОКА!I64","v":0},{"$f":"ПРОВОЛОКА!J64","v":0},{"$f":"ПРОВОЛОКА!N64","v":0},{"$f":"ПРОВОЛОКА!R64","v":0}]
[{"$f":"ПРОВОЛОКА!A65","v":"z"},"z",{"$f":"CONCATENATE(ПРОВОЛОКА!B65,ПРОВОЛОКА!C65)","v":"Ø2,5х"},{"$f":"ПРОВОЛОКА!E65","v":1500},{"$f":"ПРОВОЛОКА!I65","v":0},{"$f":"ПРОВОЛОКА!J65","v":0},{"$f":"ПРОВОЛОКА!N65","v":0},{"$f":"ПРОВОЛОКА!R65","v":0}]
[{"$f":"ПРОВОЛОКА!A66","v":"z"},"z",{"$f":"CONCATENATE(ПРОВОЛОКА!B66,ПРОВОЛОКА!C66)","v":"Ø2,5х"},{"$f":"ПРОВОЛОКА!E66","v":1500},{"$f":"ПРОВОЛОКА!I66","v":0},{"$f":"ПРОВОЛОКА!J66","v":0},{"$f":"ПРОВОЛОКА!N66","v":0},{"$f":"ПРОВОЛОКА!R66","v":0}]
[{"$f":"ПРОВОЛОКА!A67","v":"z"},"z",{"$f":"CONCATENATE(ПРОВОЛОКА!B67,ПРОВОЛОКА!C67)","v":"Ø2,5х"},{"$f":"ПРОВОЛОКА!E67","v":1500},{"$f":"ПРОВОЛОКА!I67","v":0},{"$f":"ПРОВОЛОКА!J67","v":0},{"$f":"ПРОВОЛОКА!N67","v":0},{"$f":"ПРОВОЛОКА!R67","v":0}]
[{"$f":"ПРОВОЛОКА!A68","v":"z"},"z",{"$f":"CONCATENATE(ПРОВОЛОКА!B68,ПРОВОЛОКА!C68)","v":"Ø2,5х"},{"$f":"ПРОВОЛОКА!E68","v":1500},{"$f":"ПРОВОЛОКА!I68","v":0},{"$f":"ПРОВОЛОКА!J68","v":0},{"$f":"ПРОВОЛОКА!N68","v":0},{"$f":"ПРОВОЛОКА!R68","v":0}]
[{"$f":"ПРОВОЛОКА!A69","v":"z"},"z",{"$f":"CONCATENATE(ПРОВОЛОКА!B69,ПРОВОЛОКА!C69)","v":"Ø2,5х"},{"$f":"ПРОВОЛОКА!E69","v":1500},{"$f":"ПРОВОЛОКА!I69","v":0},{"$f":"ПРОВОЛОКА!J69","v":0},{"$f":"ПРОВОЛОКА!N69","v":0},{"$f":"ПРОВОЛОКА!R69","v":0}]
[{"$f":"ПРОВОЛОКА!A70","v":"z"},"z",{"$f":"CONCATENATE(ПРОВОЛОКА!B70,ПРОВОЛОКА!C70)","v":"Ø2,5х"},{"$f":"ПРОВОЛОКА!E70","v":1500},{"$f":"ПРОВОЛОКА!I70","v":0},{"$f":"ПРОВОЛОКА!J70","v":0},{"$f":"ПРОВОЛОКА!N70","v":0},{"$f":"ПРОВОЛОКА!R70","v":0}]
[{"$f":"ПРОВОЛОКА!A71","v":"z"},"z",{"$f":"CONCATENATE(ПРОВОЛОКА!B71,ПРОВОЛОКА!C71)","v":"Ø2,5х"},{"$f":"ПРОВОЛОКА!E71","v":1500},{"$f":"ПРОВОЛОКА!I71","v":0},{"$f":"ПРОВОЛОКА!J71","v":0},{"$f":"ПРОВОЛОКА!N71","v":0},{"$f":"ПРОВОЛОКА!R71","v":0}]
[{"$f":"ПРОВОЛОКА!A72","v":"z"},"z",{"$f":"CONCATENATE(ПРОВОЛОКА!B72,ПРОВОЛОКА!C72)","v":"Ø2,5х"},{"$f":"ПРОВОЛОКА!E72","v":1500},{"$f":"ПРОВОЛОКА!I72","v":0},{"$f":"ПРОВОЛОКА!J72","v":0},{"$f":"ПРОВОЛОКА!N72","v":0},{"$f":"ПРОВОЛОКА!R72","v":0}]
[{"$f":"ПРОВОЛОКА!A73","v":"z"},"z",{"$f":"CONCATENATE(ПРОВОЛОКА!B73,ПРОВОЛОКА!C73)","v":"Ø2,5х"},{"$f":"ПРОВОЛОКА!E73","v":1500},{"$f":"ПРОВОЛОКА!I73","v":0},{"$f":"ПРОВОЛОКА!J73","v":0},{"$f":"ПРОВОЛОКА!N73","v":0},{"$f":"ПРОВОЛОКА!R73","v":0}]
[{"$f":"ПРОВОЛОКА!A74","v":"z"},"z",{"$f":"CONCATENATE(ПРОВОЛОКА!B74,ПРОВОЛОКА!C74)","v":"Ø2,5х"},{"$f":"ПРОВОЛОКА!E74","v":1500},{"$f":"ПРОВОЛОКА!I74","v":0},{"$f":"ПРОВОЛОКА!J74","v":0},{"$f":"ПРОВОЛОКА!N74","v":0},{"$f":"ПРОВОЛОКА!R74","v":0}]
["z",{"$f":"IF(E67=0,\"z\",\"Проволока\")","v":"z"},{"$f":"CONCATENATE(ПРОВОЛОКА!B75,ПРОВОЛОКА!C75)","v":""},{"$f":"ПРОВОЛОКА!E75","v":0},{"$f":"ПРОВОЛОКА!I75","v":0},{"$f":"ПРОВОЛОКА!J75","v":0},{"$f":"ПРОВОЛОКА!N75","v":0},{"$f":"ПРОВОЛОКА!R75","v":0}]
[{"$f":"ПРОВОЛОКА!A76","v":" "},{"$f":"IF(E68=0,\"z\",\"Проволока\")","v":"Проволока"},{"$f":"CONCATENATE(ПРОВОЛОКА!B76,ПРОВОЛОКА!C76)","v":"Ø2,0х220"},{"$f":"ПРОВОЛОКА!E76","v":1500},{"$f":"ПРОВОЛОКА!I76","v":1},{"$f":"ПРОВОЛОКА!J76","v":1500},{"$f":"ПРОВОЛОКА!N76","v":5.4999999999999997E-3},{"$f":"ПРОВОЛОКА!R76","v":8.25}]
[{"$f":"ПРОВОЛОКА!A77","v":"2д"},"Проволока",{"$f":"CONCATENATE(ПРОВОЛОКА!B77,ПРОВОЛОКА!C77)","v":"Ø2,0х150"},{"$f":"ПРОВОЛОКА!E77","v":1500},{"$f":"ПРОВОЛОКА!I77","v":8},{"$f":"ПРОВОЛОКА!J77","v":12000},{"$f":"ПРОВОЛОКА!N77","v":4.8000000000000001E-2},{"$f":"ПРОВОЛОКА!R77","v":72}]
[{"$f":"ПРОВОЛОКА!A78","v":"z"},"z",{"$f":"CONCATENATE(ПРОВОЛОКА!B78,ПРОВОЛОКА!C78)","v":"Ø2,0х"},{"$f":"ПРОВОЛОКА!E78","v":1500},{"$f":"ПРОВОЛОКА!I78","v":0},{"$f":"ПРОВОЛОКА!J78","v":0},{"$f":"ПРОВОЛОКА!N78","v":0},{"$f":"ПРОВОЛОКА!R78","v":0}]
[{"$f":"ПРОВОЛОКА!A79","v":"z"},"z",{"$f":"CONCATENATE(ПРОВОЛОКА!B79,ПРОВОЛОКА!C79)","v":"Ø2,0х"},{"$f":"ПРОВОЛОКА!E79","v":1500},{"$f":"ПРОВОЛОКА!I79","v":0},{"$f":"ПРОВОЛОКА!J79","v":0},{"$f":"ПРОВОЛОКА!N79","v":0},{"$f":"ПРОВОЛОКА!R79","v":0}]
[{"$f":"ПРОВОЛОКА!A80","v":"z"},"z",{"$f":"CONCATENATE(ПРОВОЛОКА!B80,ПРОВОЛОКА!C80)","v":"Ø2,0х"},{"$f":"ПРОВОЛОКА!E80","v":1500},{"$f":"ПРОВОЛОКА!I80","v":0},{"$f":"ПРОВОЛОКА!J80","v":0},{"$f":"ПРОВОЛОКА!N80","v":0},{"$f":"ПРОВОЛОКА!R80","v":0}]

{"sheet":"Д-пвх","index":7,"n_rows":26,"n_cols":6,"rows_kept":26,"cut":false,"hidden":false,"merged":[]}
["z",null,null,"план","на1кт","кол.на.пл"]
[{"$f":"IF(ПВХ!H10=0,\"z\",\"\")","v":""},{"$f":"CONCATENATE(ПВХ!F10,\" \",ПВХ!G10)","v":"ПВХ  0,4"},{"$f":"CONCATENATE(ПВХ!C10,\"х\",ПВХ!D10,\"х\",ПВХ!G10)","v":"105х188х0,4"},{"$f":"ПВХ!$G$7","v":1000},{"$f":"ПВХ!E10","v":1},{"$f":"D2*E2","v":1000}]
[{"$f":"IF(ПВХ!H11=0,\"z\",\"\")","v":""},{"$f":"CONCATENATE(ПВХ!F11,\" \",ПВХ!G11)","v":"ПВХ  0,4"},{"$f":"CONCATENATE(ПВХ!C11,\"х\",ПВХ!D11,\"х\",ПВХ!G11)","v":"50х100х0,4"},{"$f":"ПВХ!$G$7","v":1000},{"$f":"ПВХ!E11","v":6},{"$f":"D3*E3","v":6000}]
[{"$f":"IF(ПВХ!H12=0,\"z\",\"\")","v":""},{"$f":"CONCATENATE(ПВХ!F12,\" \",ПВХ!G12)","v":"ПВХ  0,4"},{"$f":"CONCATENATE(ПВХ!C12,\"х\",ПВХ!D12,\"х\",ПВХ!G12)","v":"654х856х0,4"},{"$f":"ПВХ!$G$7","v":1000},{"$f":"ПВХ!E12","v":5},5000]
[{"$f":"IF(ПВХ!H13=0,\"z\",\"\")","v":"z"},{"$f":"CONCATENATE(ПВХ!F13,\" \",ПВХ!G13)","v":"ПВХ  0,4"},{"$f":"CONCATENATE(ПВХ!C13,\"х\",ПВХ!D13,\"х\",ПВХ!G13)","v":"хх0,4"},{"$f":"ПВХ!$G$7","v":1000},{"$f":"ПВХ!E13","v":0},0]
[{"$f":"IF(ПВХ!H14=0,\"z\",\"\")","v":"z"},{"$f":"CONCATENATE(ПВХ!F14,\" \",ПВХ!G14)","v":"ПВХ  0,4"},{"$f":"CONCATENATE(ПВХ!C14,\"х\",ПВХ!D14,\"х\",ПВХ!G14)","v":"хх0,4"},{"$f":"ПВХ!$G$7","v":1000},{"$f":"ПВХ!E14","v":0},0]
[{"$f":"IF(ПВХ!H15=0,\"z\",\"\")","v":"z"},{"$f":"CONCATENATE(ПВХ!F15,\" \",ПВХ!G15)","v":"ПВХ  0,4"},{"$f":"CONCATENATE(ПВХ!C15,\"х\",ПВХ!D15,\"х\",ПВХ!G15)","v":"хх0,4"},{"$f":"ПВХ!$G$7","v":1000},{"$f":"ПВХ!E15","v":0},0]
[{"$f":"IF(ПВХ!H16=0,\"z\",\"\")","v":"z"},{"$f":"CONCATENATE(ПВХ!F16,\" \",ПВХ!G16)","v":"ПВХ  0,4"},{"$f":"CONCATENATE(ПВХ!C16,\"х\",ПВХ!D16,\"х\",ПВХ!G16)","v":"хх0,4"},{"$f":"ПВХ!$G$7","v":1000},{"$f":"ПВХ!E16","v":0},0]
[{"$f":"IF(ПВХ!H17=0,\"z\",\"\")","v":"z"},{"$f":"CONCATENATE(ПВХ!F17,\" \",ПВХ!G17)","v":"ПВХ  0,4"},{"$f":"CONCATENATE(ПВХ!C17,\"х\",ПВХ!D17,\"х\",ПВХ!G17)","v":"хх0,4"},{"$f":"ПВХ!$G$7","v":1000},{"$f":"ПВХ!E17","v":0},0]
[{"$f":"IF(ПВХ!H18=0,\"z\",\"\")","v":"z"},{"$f":"CONCATENATE(ПВХ!F18,\" \",ПВХ!G18)","v":"ПВХ  0,4"},{"$f":"CONCATENATE(ПВХ!C18,\"х\",ПВХ!D18,\"х\",ПВХ!G18)","v":"хх0,4"},{"$f":"ПВХ!$G$7","v":1000},{"$f":"ПВХ!E18","v":0},0]
[{"$f":"IF(ПВХ!H19=0,\"z\",\"\")","v":"z"},{"$f":"CONCATENATE(ПВХ!F19,\" \",ПВХ!G19)","v":"ПВХ  0,4"},{"$f":"CONCATENATE(ПВХ!C19,\"х\",ПВХ!D19,\"х\",ПВХ!G19)","v":"хх0,4"},{"$f":"ПВХ!$G$7","v":1000},{"$f":"ПВХ!E19","v":0},0]
[{"$f":"IF(ПВХ!H20=0,\"z\",\"\")","v":"z"},{"$f":"CONCATENATE(ПВХ!F20,\" \",ПВХ!G20)","v":"ПВХ  0,4"},{"$f":"CONCATENATE(ПВХ!C20,\"х\",ПВХ!D20,\"х\",ПВХ!G20)","v":"хх0,4"},{"$f":"ПВХ!$G$7","v":1000},{"$f":"ПВХ!E20","v":0},0]
[{"$f":"IF(ПВХ!H21=0,\"z\",\"\")","v":"z"},{"$f":"CONCATENATE(ПВХ!F21,\" \",ПВХ!G21)","v":"ПВХ  0,4"},{"$f":"CONCATENATE(ПВХ!C21,\"х\",ПВХ!D21,\"х\",ПВХ!G21)","v":"хх0,4"},{"$f":"ПВХ!$G$7","v":1000},{"$f":"ПВХ!E21","v":0},0]
[{"$f":"IF(ПВХ!H22=0,\"z\",\"\")","v":"z"},{"$f":"CONCATENATE(ПВХ!F22,\" \",ПВХ!G22)","v":"ПВХ  0,4"},{"$f":"CONCATENATE(ПВХ!C22,\"х\",ПВХ!D22,\"х\",ПВХ!G22)","v":"хх0,4"},{"$f":"ПВХ!$G$7","v":1000},{"$f":"ПВХ!E22","v":0},0]
[{"$f":"IF(ПВХ!H23=0,\"z\",\"\")","v":"z"},{"$f":"CONCATENATE(ПВХ!F23,\" \",ПВХ!G23)","v":"ПВХ  0,4"},{"$f":"CONCATENATE(ПВХ!C23,\"х\",ПВХ!D23,\"х\",ПВХ!G23)","v":"хх0,4"},{"$f":"ПВХ!$G$7","v":1000},{"$f":"ПВХ!E23","v":0},0]
[{"$f":"IF(ПВХ!H24=0,\"z\",\"\")","v":"z"},{"$f":"CONCATENATE(ПВХ!F24,\" \",ПВХ!G24)","v":"ПВХ  0,4"},{"$f":"CONCATENATE(ПВХ!C24,\"х\",ПВХ!D24,\"х\",ПВХ!G24)","v":"хх0,4"},{"$f":"ПВХ!$G$7","v":1000},{"$f":"ПВХ!E24","v":0},0]
[{"$f":"IF(ПВХ!H25=0,\"z\",\"\")","v":"z"},{"$f":"CONCATENATE(ПВХ!F25,\" \",ПВХ!G25)","v":"ПВХ  0,4"},{"$f":"CONCATENATE(ПВХ!C25,\"х\",ПВХ!D25,\"х\",ПВХ!G25)","v":"хх0,4"},{"$f":"ПВХ!$G$7","v":1000},{"$f":"ПВХ!E25","v":0},0]
[{"$f":"IF(ПВХ!H26=0,\"z\",\"\")","v":"z"},{"$f":"CONCATENATE(ПВХ!F26,\" \",ПВХ!G26)","v":"ПВХ  0,4"},{"$f":"CONCATENATE(ПВХ!C26,\"х\",ПВХ!D26,\"х\",ПВХ!G26)","v":"хх0,4"},{"$f":"ПВХ!$G$7","v":1000},{"$f":"ПВХ!E26","v":0},0]
[{"$f":"IF(ПВХ!H27=0,\"z\",\"\")","v":"z"},{"$f":"CONCATENATE(ПВХ!F27,\" \",ПВХ!G27)","v":"ПВХ  0,4"},{"$f":"CONCATENATE(ПВХ!C27,\"х\",ПВХ!D27,\"х\",ПВХ!G27)","v":"хх0,4"},{"$f":"ПВХ!$G$7","v":1000},{"$f":"ПВХ!E27","v":0},0]
[{"$f":"IF(ПВХ!H28=0,\"z\",\"\")","v":"z"},{"$f":"CONCATENATE(ПВХ!F28,\" \",ПВХ!G28)","v":"ПВХ  0,4"},{"$f":"CONCATENATE(ПВХ!C28,\"х\",ПВХ!D28,\"х\",ПВХ!G28)","v":"хх0,4"},{"$f":"ПВХ!$G$7","v":1000},{"$f":"ПВХ!E28","v":0},0]
[{"$f":"IF(ПВХ!H29=0,\"z\",\"\")","v":"z"},{"$f":"CONCATENATE(ПВХ!F29,\" \",ПВХ!G29)","v":"ПВХ  0,4"},{"$f":"CONCATENATE(ПВХ!C29,\"х\",ПВХ!D29,\"х\",ПВХ!G29)","v":"хх0,4"},{"$f":"ПВХ!$G$7","v":1000},{"$f":"ПВХ!E29","v":0},0]
[{"$f":"IF(ПВХ!H30=0,\"z\",\"\")","v":"z"},{"$f":"CONCATENATE(ПВХ!F30,\" \",ПВХ!G30)","v":"ПВХ  0,4"},{"$f":"CONCATENATE(ПВХ!C30,\"х\",ПВХ!D30,\"х\",ПВХ!G30)","v":"хх0,4"},{"$f":"ПВХ!$G$7","v":1000},{"$f":"ПВХ!E30","v":0},0]
[{"$f":"IF(ПВХ!H31=0,\"z\",\"\")","v":"z"},{"$f":"CONCATENATE(ПВХ!F31,\" \",ПВХ!G31)","v":"ПВХ  0,4"},{"$f":"CONCATENATE(ПВХ!C31,\"х\",ПВХ!D31,\"х\",ПВХ!G31)","v":"хх0,4"},{"$f":"ПВХ!$G$7","v":1000},{"$f":"ПВХ!E31","v":0},0]
[{"$f":"IF(ПВХ!H32=0,\"z\",\"\")","v":"z"},{"$f":"CONCATENATE(ПВХ!F32,\" \",ПВХ!G32)","v":"ПВХ  0,4"},{"$f":"CONCATENATE(ПВХ!C32,\"х\",ПВХ!D32,\"х\",ПВХ!G32)","v":"хх0,4"},{"$f":"ПВХ!$G$7","v":1000},{"$f":"ПВХ!E32","v":0},0]
[{"$f":"IF(ПВХ!H33=0,\"z\",\"\")","v":"z"},{"$f":"CONCATENATE(ПВХ!F33,\" \",ПВХ!G33)","v":"ПВХ  0,4"},{"$f":"CONCATENATE(ПВХ!C33,\"х\",ПВХ!D33,\"х\",ПВХ!G33)","v":"хх0,4"},{"$f":"ПВХ!$G$7","v":1000},{"$f":"ПВХ!E33","v":0},0]
[{"$f":"IF(ПВХ!H34=0,\"z\",\"\")","v":"z"},{"$f":"CONCATENATE(ПВХ!F34,\" \",ПВХ!G34)","v":"ПВХ  0,4"},{"$f":"CONCATENATE(ПВХ!C34,\"х\",ПВХ!D34,\"х\",ПВХ!G34)","v":"хх0,4"},{"$f":"ПВХ!$G$7","v":1000},{"$f":"ПВХ!E34","v":0},0]

{"sheet":"\"З\"","index":8,"n_rows":67,"n_cols":15,"rows_kept":67,"cut":false,"hidden":false,"merged":[[12,0,14,0],[42,11,42,14],[63,11,63,14],[12,3,12,10],[6,8,6,10],[13,5,14,5],[13,4,14,4],[13,3,14,3],[12,2,14,2],[12,1,14,1],[13,6,13,7],[13,8,13,9],[6,2,6,7],[9,1,9,2],[10,1,10,2]]}
["z"]
[null,"Утверждено:"]
[null,null,null,null,null,null,"Лимит установил"]
[]
[null,"Дата:"]
[]
[null,null,"Лимитно-заборная карта ЛЗК №",null,null,null,null,null,"30272 (050.05.23) № 08",null,null,"З"]
[null,null,null,"на отпуск материалов на изделие  ",{"$f":"ТРУБА!C4","v":"(19137.022.20.9016) Кронштейн 240 "}]
[]
[null,"Количество общее: ",null,{"$f":"CONCATENATE(ТРУБА!J6,\" шт.\")","v":"110 шт."}]
[null,"по комплектах",null,"100+10"]
[]
[null,"Остаток с \nпредыдущей\nЛЗК","Наименование","Количество",null,null,null,null,null,null,null,"Примечание","Дата выдачи","Ф.И.О. получателя","Подпись"]
[null,null,null,"Необходимо \nпо норме","Получить \nсо склада","Получено факт","Деловой остаток",null,"Вернуть лом"]
[null,null,null,null,null,null,"Теор.","∑","Теор.","∑"]
[{"$f":"IF(D16=\"\",\"z\",\"\")","v":""},null,"Проволока Ø 2",{"$f":"IF(ПРОВОЛОКА!R81=0,\"\",ПРОВОЛОКА!R81)","v":80.25},null,null,null,null,null,null,"кг"]
[{"$f":"IF(D17=\"\",\"z\",\"\")","v":"z"},null,"Проволока Ø 2,5",{"$f":"IF(ПРОВОЛОКА!R75=0,\"\",ПРОВОЛОКА!R75)","v":""},null,null,null,null,null,null,"кг"]
["z",null,"Проволока Ø 2,9",{"$f":"IF(ПРОВОЛОКА!R30=0,\"\",ПРОВОЛОКА!R30)","v":""},null,null,null,null,null,null,"кг"]
["z",null,"Проволока Ø 3,4",{"$f":"IF(ПРОВОЛОКА!R52=0,\"\",ПРОВОЛОКА!R34)","v":""},null,null,null,null,null,null,"кг"]
["z",null,"Проволока Ø 3,8",{"$f":"IF(ПРОВОЛОКА!R41=0,\"\",ПРОВОЛОКА!R41)","v":""},null,null,null,null,null,null,"кг"]
["z",null,"Проволока Ø 4,8",{"$f":"IF(ПРОВОЛОКА!R30=0,\"\",ПРОВОЛОКА!R30)","v":""},null,null,null,null,null,null,"кг"]
["z",null,"Проволока Ø 6",{"$f":"IF(ПРОВОЛОКА!R21=0,\"\",ПРОВОЛОКА!R21)","v":""},null,null,null,null,null,null,"кг"]
[null,null,"Проволока Ø 8",{"$f":"IF(ПРОВОЛОКА!R15=0,\"\",ПРОВОЛОКА!R15)","v":922.47}]
[]
["z",null,{"$f":"ЛИСТ!I124","v":"Лист 0,6"},{"$f":"IF(ЛИСТ!Z124=0,\"\",ROUND(ЛИСТ!Z124,3))","v":""},{"$f":"CONCATENATE(IF(ЛИСТ!M124=0,\"\",ROUND(ЛИСТ!M124,3)),IF(AND(ЛИСТ!M124>0,ЛИСТ!N124>0),\"+\",\"\"),IF(ЛИСТ!N124=0,\"\",CONCATENATE(\"(\",ROUND(ЛИСТ!N124,3),\")\")))","v":""},null,{"$f":"IF(ЛИСТ!R124=0,\"\",ROUND(ЛИСТ!R124,3))","v":""},null,{"$f":"IF(ЛИСТ!V124=0,\"\",ROUND(ЛИСТ!V124,3))","v":""},null,"кг",{"$f":"IF(ЛИСТ!G124=0,\"\",CONCATENATE(ЛИСТ!G124,\" шт.   \",ЛИСТ!C124,\"х\",ЛИСТ!D124))","v":""}]
["z",null,{"$f":"ЛИСТ!I125","v":"Лист 0,7"},{"$f":"IF(ЛИСТ!Z125=0,\"\",ROUND(ЛИСТ!Z125,3))","v":""},{"$f":"CONCATENATE(IF(ЛИСТ!M125=0,\"\",ROUND(ЛИСТ!M125,3)),IF(AND(ЛИСТ!M125>0,ЛИСТ!N125>0),\"+\",\"\"),IF(ЛИСТ!N125=0,\"\",CONCATENATE(\"(\",ROUND(ЛИСТ!N125,3),\")\")))","v":""},null,{"$f":"IF(ЛИСТ!R125=0,\"\",ROUND(ЛИСТ!R125,3))","v":""},null,{"$f":"IF(ЛИСТ!V125=0,\"\",ROUND(ЛИСТ!V125,3))","v":""},null,"кг",{"$f":"IF(ЛИСТ!G125=0,\"\",CONCATENATE(ЛИСТ!G125,\" шт.   \",ЛИСТ!C125,\"х\",ЛИСТ!D125))","v":""}]
["",null,{"$f":"ЛИСТ!I126","v":"Лист 0,8"},{"$f":"IF(ЛИСТ!Z126=0,\"\",ROUND(ЛИСТ!Z126,3))","v":300.45100000000002},{"$f":"CONCATENATE(IF(ЛИСТ!M126=0,\"\",ROUND(ЛИСТ!M126,3)),IF(AND(ЛИСТ!M126>0,ЛИСТ!N126>0),\"+\",\"\"),IF(ЛИСТ!N126=0,\"\",CONCATENATE(\"(\",ROUND(ЛИСТ!N126,3),\")\")))","v":"393,7+(53,639)"},null,{"$f":"IF(ЛИСТ!R126=0,\"\",ROUND(ЛИСТ!R126,3))","v":140.672},null,{"$f":"IF(ЛИСТ!V126=0,\"\",ROUND(ЛИСТ!V126,3))","v":6.2149999999999999},null,"кг",{"$f":"IF(ЛИСТ!G126=0,\"\",CONCATENATE(ЛИСТ!G126,\" шт.   \",ЛИСТ!C126,\"х\",ЛИСТ!D126))","v":"20 шт.   1250х2500"}]
["z",null,{"$f":"ЛИСТ!I127","v":"Лист 1"},{"$f":"IF(ЛИСТ!Z127=0,\"\",ROUND(ЛИСТ!Z127,3))","v":""},{"$f":"CONCATENATE(IF(ЛИСТ!M127=0,\"\",ROUND(ЛИСТ!M127,3)),IF(AND(ЛИСТ!M127>0,ЛИСТ!N127>0),\"+\",\"\"),IF(ЛИСТ!N127=0,\"\",CONCATENATE(\"(\",ROUND(ЛИСТ!N127,3),\")\")))","v":""},null,{"$f":"IF(ЛИСТ!R127=0,\"\",ROUND(ЛИСТ!R127,3))","v":""},null,{"$f":"IF(ЛИСТ!V127=0,\"\",ROUND(ЛИСТ!V127,3))","v":""},null,"кг",{"$f":"IF(ЛИСТ!G127=0,\"\",CONCATENATE(ЛИСТ!G127,\" шт.   \",ЛИСТ!C127,\"х\",ЛИСТ!D127))","v":""}]
["z",null,{"$f":"ЛИСТ!I128","v":"Лист 1,2"},{"$f":"IF(ЛИСТ!Z128=0,\"\",ROUND(ЛИСТ!Z128,3))","v":""},{"$f":"CONCATENATE(IF(ЛИСТ!M128=0,\"\",ROUND(ЛИСТ!M128,3)),IF(AND(ЛИСТ!M128>0,ЛИСТ!N128>0),\"+\",\"\"),IF(ЛИСТ!N128=0,\"\",CONCATENATE(\"(\",ROUND(ЛИСТ!N128,3),\")\")))","v":""},null,{"$f":"IF(ЛИСТ!R128=0,\"\",ROUND(ЛИСТ!R128,3))","v":""},null,{"$f":"IF(ЛИСТ!V128=0,\"\",ROUND(ЛИСТ!V128,3))","v":""},null,"кг",{"$f":"IF(ЛИСТ!G128=0,\"\",CONCATENATE(ЛИСТ!G128,\" шт.   \",ЛИСТ!C128,\"х\",ЛИСТ!D128))","v":""}]
["z",null,{"$f":"ЛИСТ!I129","v":"Лист 1,5"},{"$f":"IF(ЛИСТ!Z129=0,\"\",ROUND(ЛИСТ!Z129,3))","v":""},{"$f":"CONCATENATE(IF(ЛИСТ!M129=0,\"\",ROUND(ЛИСТ!M129,3)),IF(AND(ЛИСТ!M129>0,ЛИСТ!N129>0),\"+\",\"\"),IF(ЛИСТ!N129=0,\"\",CONCATENATE(\"(\",ROUND(ЛИСТ!N129,3),\")\")))","v":""},null,{"$f":"IF(ЛИСТ!R129=0,\"\",ROUND(ЛИСТ!R129,3))","v":""},null,{"$f":"IF(ЛИСТ!V129=0,\"\",ROUND(ЛИСТ!V129,3))","v":""},null,"кг",{"$f":"IF(ЛИСТ!G129=0,\"\",CONCATENATE(ЛИСТ!G129,\" шт.   \",ЛИСТ!C129,\"х\",ЛИСТ!D129))","v":""}]
["z",null,{"$f":"ЛИСТ!I130","v":"Лист 10"},{"$f":"IF(ЛИСТ!Z130=0,\"\",ROUND(ЛИСТ!Z130,3))","v":""},{"$f":"CONCATENATE(IF(ЛИСТ!M130=0,\"\",ROUND(ЛИСТ!M130,3)),IF(AND(ЛИСТ!M130>0,ЛИСТ!N130>0),\"+\",\"\"),IF(ЛИСТ!N130=0,\"\",CONCATENATE(\"(\",ROUND(ЛИСТ!N130,3),\")\")))","v":""},null,{"$f":"IF(ЛИСТ!R130=0,\"\",ROUND(ЛИСТ!R130,3))","v":""},null,{"$f":"IF(ЛИСТ!V130=0,\"\",ROUND(ЛИСТ!V130,3))","v":""},null,"кг",{"$f":"IF(ЛИСТ!G130=0,\"\",CONCATENATE(ЛИСТ!G130,\" шт.   \",ЛИСТ!C130,\"х\",ЛИСТ!D130))","v":""}]
["",null,{"$f":"ЛИСТ!I131","v":"Лист 2"},{"$f":"IF(ЛИСТ!Z131=0,\"\",ROUND(ЛИСТ!Z131,3))","v":-124.107},{"$f":"CONCATENATE(IF(ЛИСТ!M131=0,\"\",ROUND(ЛИСТ!M131,3)),IF(AND(ЛИСТ!M131>0,ЛИСТ!N131>0),\"+\",\"\"),IF(ЛИСТ!N131=0,\"\",CONCATENATE(\"(\",ROUND(ЛИСТ!N131,3),\")\")))","v":""},null,{"$f":"IF(ЛИСТ!R131=0,\"\",ROUND(ЛИСТ!R131,3))","v":""},null,{"$f":"IF(ЛИСТ!V131=0,\"\",ROUND(ЛИСТ!V131,3))","v":124.107},null,"кг",{"$f":"IF(ЛИСТ!G131=0,\"\",CONCATENATE(ЛИСТ!G131,\" шт.   \",ЛИСТ!C131,\"х\",ЛИСТ!D131))","v":""}]
["z",null,{"$f":"ЛИСТ!I132","v":"Лист 2,5"},{"$f":"IF(ЛИСТ!Z132=0,\"\",ROUND(ЛИСТ!Z132,3))","v":""},{"$f":"CONCATENATE(IF(ЛИСТ!M132=0,\"\",ROUND(ЛИСТ!M132,3)),IF(AND(ЛИСТ!M132>0,ЛИСТ!N132>0),\"+\",\"\"),IF(ЛИСТ!N132=0,\"\",CONCATENATE(\"(\",ROUND(ЛИСТ!N132,3),\")\")))","v":""},null,{"$f":"IF(ЛИСТ!R132=0,\"\",ROUND(ЛИСТ!R132,3))","v":""},null,{"$f":"IF(ЛИСТ!V132=0,\"\",ROUND(ЛИСТ!V132,3))","v":""},null,"кг",{"$f":"IF(ЛИСТ!G132=0,\"\",CONCATENATE(ЛИСТ!G132,\" шт.   \",ЛИСТ!C132,\"х\",ЛИСТ!D132))","v":""}]
["z",null,{"$f":"ЛИСТ!I133","v":"Лист 3"},{"$f":"IF(ЛИСТ!Z133=0,\"\",ROUND(ЛИСТ!Z133,3))","v":""},{"$f":"CONCATENATE(IF(ЛИСТ!M133=0,\"\",ROUND(ЛИСТ!M133,3)),IF(AND(ЛИСТ!M133>0,ЛИСТ!N133>0),\"+\",\"\"),IF(ЛИСТ!N133=0,\"\",CONCATENATE(\"(\",ROUND(ЛИСТ!N133,3),\")\")))","v":""},null,{"$f":"IF(ЛИСТ!R133=0,\"\",ROUND(ЛИСТ!R133,3))","v":""},null,{"$f":"IF(ЛИСТ!V133=0,\"\",ROUND(ЛИСТ!V133,3))","v":""},null,"кг",{"$f":"IF(ЛИСТ!G133=0,\"\",CONCATENATE(ЛИСТ!G133,\" шт.   \",ЛИСТ!C133,\"х\",ЛИСТ!D133))","v":""}]
["z",null,{"$f":"ЛИСТ!I134","v":"Лист 4"},{"$f":"IF(ЛИСТ!Z134=0,\"\",ROUND(ЛИСТ!Z134,3))","v":""},{"$f":"CONCATENATE(IF(ЛИСТ!M134=0,\"\",ROUND(ЛИСТ!M134,3)),IF(AND(ЛИСТ!M134>0,ЛИСТ!N134>0),\"+\",\"\"),IF(ЛИСТ!N134=0,\"\",CONCATENATE(\"(\",ROUND(ЛИСТ!N134,3),\")\")))","v":""},null,{"$f":"IF(ЛИСТ!R134=0,\"\",ROUND(ЛИСТ!R134,3))","v":""},null,{"$f":"IF(ЛИСТ!V134=0,\"\",ROUND(ЛИСТ!V134,3))","v":""},null,"кг",{"$f":"IF(ЛИСТ!G134=0,\"\",CONCATENATE(ЛИСТ!G134,\" шт.   \",ЛИСТ!C134,\"х\",ЛИСТ!D134))","v":""}]
["z",null,{"$f":"ЛИСТ!I135","v":"Лист 5"},{"$f":"IF(ЛИСТ!Z135=0,\"\",ROUND(ЛИСТ!Z135,3))","v":""},{"$f":"CONCATENATE(IF(ЛИСТ!M135=0,\"\",ROUND(ЛИСТ!M135,3)),IF(AND(ЛИСТ!M135>0,ЛИСТ!N135>0),\"+\",\"\"),IF(ЛИСТ!N135=0,\"\",CONCATENATE(\"(\",ROUND(ЛИСТ!N135,3),\")\")))","v":""},null,{"$f":"IF(ЛИСТ!R135=0,\"\",ROUND(ЛИСТ!R135,3))","v":""},null,{"$f":"IF(ЛИСТ!V135=0,\"\",ROUND(ЛИСТ!V135,3))","v":""},null,"кг",{"$f":"IF(ЛИСТ!G135=0,\"\",CONCATENATE(ЛИСТ!G135,\" шт.   \",ЛИСТ!C135,\"х\",ЛИСТ!D135))","v":""}]
["z",null,{"$f":"ЛИСТ!I136","v":"Лист 6"},{"$f":"IF(ЛИСТ!Z136=0,\"\",ROUND(ЛИСТ!Z136,3))","v":""},{"$f":"CONCATENATE(IF(ЛИСТ!M136=0,\"\",ROUND(ЛИСТ!M136,3)),IF(AND(ЛИСТ!M136>0,ЛИСТ!N136>0),\"+\",\"\"),IF(ЛИСТ!N136=0,\"\",CONCATENATE(\"(\",ROUND(ЛИСТ!N136,3),\")\")))","v":""},null,{"$f":"IF(ЛИСТ!R136=0,\"\",ROUND(ЛИСТ!R136,3))","v":""},null,{"$f":"IF(ЛИСТ!V136=0,\"\",ROUND(ЛИСТ!V136,3))","v":""},null,"кг",{"$f":"IF(ЛИСТ!G136=0,\"\",CONCATENATE(ЛИСТ!G136,\" шт.   \",ЛИСТ!C136,\"х\",ЛИСТ!D136))","v":""}]
["z",null,{"$f":"ЛИСТ!I137","v":"Лист 7"},{"$f":"IF(ЛИСТ!Z137=0,\"\",ROUND(ЛИСТ!Z137,3))","v":""},{"$f":"CONCATENATE(IF(ЛИСТ!M137=0,\"\",ROUND(ЛИСТ!M137,3)),IF(AND(ЛИСТ!M137>0,ЛИСТ!N137>0),\"+\",\"\"),IF(ЛИСТ!N137=0,\"\",CONCATENATE(\"(\",ROUND(ЛИСТ!N137,3),\")\")))","v":""},null,{"$f":"IF(ЛИСТ!R137=0,\"\",ROUND(ЛИСТ!R137,3))","v":""},null,{"$f":"IF(ЛИСТ!V137=0,\"\",ROUND(ЛИСТ!V137,3))","v":""},null,"кг",{"$f":"IF(ЛИСТ!G137=0,\"\",CONCATENATE(ЛИСТ!G137,\" шт.   \",ЛИСТ!C137,\"х\",ЛИСТ!D137))","v":""}]
["z",null,{"$f":"ЛИСТ!I138","v":"Лист 8"},{"$f":"IF(ЛИСТ!Z138=0,\"\",ROUND(ЛИСТ!Z138,3))","v":""},{"$f":"CONCATENATE(IF(ЛИСТ!M138=0,\"\",ROUND(ЛИСТ!M138,3)),IF(AND(ЛИСТ!M138>0,ЛИСТ!N138>0),\"+\",\"\"),IF(ЛИСТ!N138=0,\"\",CONCATENATE(\"(\",ROUND(ЛИСТ!N138,3),\")\")))","v":""},null,{"$f":"IF(ЛИСТ!R138=0,\"\",ROUND(ЛИСТ!R138,3))","v":""},null,{"$f":"IF(ЛИСТ!V138=0,\"\",ROUND(ЛИСТ!V138,3))","v":""},null,"кг",{"$f":"IF(ЛИСТ!G138=0,\"\",CONCATENATE(ЛИСТ!G138,\" шт.   \",ЛИСТ!C138,\"х\",ЛИСТ!D138))","v":""}]
["z",null,{"$f":"ЛИСТ!I139","v":"Лист ОЦ 1"},{"$f":"IF(ЛИСТ!Z139=0,\"\",ROUND(ЛИСТ!Z139,3))","v":""},{"$f":"CONCATENATE(IF(ЛИСТ!M139=0,\"\",ROUND(ЛИСТ!M139,3)),IF(AND(ЛИСТ!M139>0,ЛИСТ!N139>0),\"+\",\"\"),IF(ЛИСТ!N139=0,\"\",CONCATENATE(\"(\",ROUND(ЛИСТ!N139,3),\")\")))","v":""},null,{"$f":"IF(ЛИСТ!R139=0,\"\",ROUND(ЛИСТ!R139,3))","v":""},null,{"$f":"IF(ЛИСТ!V139=0,\"\",ROUND(ЛИСТ!V139,3))","v":""},null,"кг",{"$f":"IF(ЛИСТ!G139=0,\"\",CONCATENATE(ЛИСТ!G139,\" шт.   \",ЛИСТ!C139,\"х\",ЛИСТ!D139))","v":""}]
["z",null,{"$f":"ЛИСТ!I140","v":"Сетка ПВЛ 1"},{"$f":"IF(ЛИСТ!Z140=0,\"\",ROUND(ЛИСТ!Z140,3))","v":""},{"$f":"CONCATENATE(IF(ЛИСТ!M140=0,\"\",ROUND(ЛИСТ!M140,3)),IF(AND(ЛИСТ!M140>0,ЛИСТ!N140>0),\"+\",\"\"),IF(ЛИСТ!N140=0,\"\",CONCATENATE(\"(\",ROUND(ЛИСТ!N140,3),\")\")))","v":""},null,{"$f":"IF(ЛИСТ!R140=0,\"\",ROUND(ЛИСТ!R140,3))","v":""},null,{"$f":"IF(ЛИСТ!V140=0,\"\",ROUND(ЛИСТ!V140,3))","v":""},null,"кг",{"$f":"IF(ЛИСТ!G140=0,\"\",CONCATENATE(ЛИСТ!G140,\" шт.   \",ЛИСТ!C140,\"х\",ЛИСТ!D140))","v":""}]
["z",null,{"$f":"ЛИСТ!I141","v":0},{"$f":"ЛИСТ!Z141","v":0},null,null,null,null,null,null,null,{"$f":"CONCATENATE(ЛИСТ!G141,\" лист.   \",ЛИСТ!C141,\"х\",ЛИСТ!D141)","v":" лист.   х"}]
[null,null,null,null,null,null,null,null,null,null,null,"Заготовительный лист"]
[{"$f":"IF(D44=\"\",\"z\",\"\")","v":"z"},null,null,null,null,null,null,null,null,null,"кг"]
["z",null,{"$f":"ТРУБА!H122","v":"Круг 12"},{"$f":"IF(ТРУБА!U122 =0,\"\",ROUND(ТРУБА!U122,3))","v":""},{"$f":"CONCATENATE(IF(ТРУБА!I122=0,\"\",ROUND(ТРУБА!I122,3)),IF(AND(ТРУБА!I122>0,ТРУБА!J122>0),\"+\",\"\"),IF(ТРУБА!J122=0,\"\",CONCATENATE(\"(\",ROUND(ТРУБА!J122,3),\")\")))","v":""},null,{"$f":"IF(ТРУБА!Q122=0,\"\",ROUND(ТРУБА!Q122,3))","v":""},null,{"$f":"IF(ТРУБА!R122=0,\"\",ROUND(ТРУБА!R122,3))","v":-0.97699999999999998},null,"кг",{"$f":"IF(ТРУБА!F122=0,\"\",CONCATENATE(ТРУБА!F122,\" шт.   \",ТРУБА!D122))","v":""}]
["z",null,{"$f":"ТРУБА!H123","v":"Труба 10х10х1"},{"$f":"IF(ТРУБА!U123 =0,\"\",ROUND(ТРУБА!U123,3))","v":""},{"$f":"CONCATENATE(IF(ТРУБА!I123=0,\"\",ROUND(ТРУБА!I123,3)),IF(AND(ТРУБА!I123>0,ТРУБА!J123>0),\"+\",\"\"),IF(ТРУБА!J123=0,\"\",CONCATENATE(\"(\",ROUND(ТРУБА!J123,3),\")\")))","v":""},null,{"$f":"IF(ТРУБА!Q123=0,\"\",ROUND(ТРУБА!Q123,3))","v":""},null,{"$f":"IF(ТРУБА!R123=0,\"\",ROUND(ТРУБА!R123,3))","v":-0.29699999999999999},null,"кг",{"$f":"IF(ТРУБА!F123=0,\"\",CONCATENATE(ТРУБА!F123,\" шт.   \",ТРУБА!D123))","v":""}]
["z",null,{"$f":"ТРУБА!H124","v":"Труба 20х20х1"},{"$f":"IF(ТРУБА!U124 =0,\"\",ROUND(ТРУБА!U124,3))","v":""},{"$f":"CONCATENATE(IF(ТРУБА!I124=0,\"\",ROUND(ТРУБА!I124,3)),IF(AND(ТРУБА!I124>0,ТРУБА!J124>0),\"+\",\"\"),IF(ТРУБА!J124=0,\"\",CONCATENATE(\"(\",ROUND(ТРУБА!J124,3),\")\")))","v":""},null,{"$f":"IF(ТРУБА!Q124=0,\"\",ROUND(ТРУБА!Q124,3))","v":""},null,{"$f":"IF(ТРУБА!R124=0,\"\",ROUND(ТРУБА!R124,3))","v":""},null,"кг",{"$f":"IF(ТРУБА!F124=0,\"\",CONCATENATE(ТРУБА!F124,\" шт.   \",ТРУБА!D124))","v":""}]
["z",null,{"$f":"ТРУБА!H125","v":"Труба 20х20х1,5"},{"$f":"IF(ТРУБА!U125 =0,\"\",ROUND(ТРУБА!U125,3))","v":""},{"$f":"CONCATENATE(IF(ТРУБА!I125=0,\"\",ROUND(ТРУБА!I125,3)),IF(AND(ТРУБА!I125>0,ТРУБА!J125>0),\"+\",\"\"),IF(ТРУБА!J125=0,\"\",CONCATENATE(\"(\",ROUND(ТРУБА!J125,3),\")\")))","v":""},null,{"$f":"IF(ТРУБА!Q125=0,\"\",ROUND(ТРУБА!Q125,3))","v":""},null,{"$f":"IF(ТРУБА!R125=0,\"\",ROUND(ТРУБА!R125,3))","v":""},null,"кг",{"$f":"IF(ТРУБА!F125=0,\"\",CONCATENATE(ТРУБА!F125,\" шт.   \",ТРУБА!D125))","v":""}]
["z",null,{"$f":"ТРУБА!H126","v":"Труба 25х1,5"},{"$f":"IF(ТРУБА!U126 =0,\"\",ROUND(ТРУБА!U126,3))","v":""},{"$f":"CONCATENATE(IF(ТРУБА!I126=0,\"\",ROUND(ТРУБА!I126,3)),IF(AND(ТРУБА!I126>0,ТРУБА!J126>0),\"+\",\"\"),IF(ТРУБА!J126=0,\"\",CONCATENATE(\"(\",ROUND(ТРУБА!J126,3),\")\")))","v":""},null,{"$f":"IF(ТРУБА!Q126=0,\"\",ROUND(ТРУБА!Q126,3))","v":""},null,{"$f":"IF(ТРУБА!R126=0,\"\",ROUND(ТРУБА!R126,3))","v":""},null,"кг",{"$f":"IF(ТРУБА!F126=0,\"\",CONCATENATE(ТРУБА!F126,\" шт.   \",ТРУБА!D126))","v":""}]
["z",null,{"$f":"ТРУБА!H127","v":"Труба 25х25х0,8"},{"$f":"IF(ТРУБА!U127 =0,\"\",ROUND(ТРУБА!U127,3))","v":""},{"$f":"CONCATENATE(IF(ТРУБА!I127=0,\"\",ROUND(ТРУБА!I127,3)),IF(AND(ТРУБА!I127>0,ТРУБА!J127>0),\"+\",\"\"),IF(ТРУБА!J127=0,\"\",CONCATENATE(\"(\",ROUND(ТРУБА!J127,3),\")\")))","v":""},null,{"$f":"IF(ТРУБА!Q127=0,\"\",ROUND(ТРУБА!Q127,3))","v":""},null,{"$f":"IF(ТРУБА!R127=0,\"\",ROUND(ТРУБА!R127,3))","v":""},null,"кг",{"$f":"IF(ТРУБА!F127=0,\"\",CONCATENATE(ТРУБА!F127,\" шт.   \",ТРУБА!D127))","v":""}]
["z",null,{"$f":"ТРУБА!H128","v":"Труба 25х25х1"},{"$f":"IF(ТРУБА!U128 =0,\"\",ROUND(ТРУБА!U128,3))","v":""},{"$f":"CONCATENATE(IF(ТРУБА!I128=0,\"\",ROUND(ТРУБА!I128,3)),IF(AND(ТРУБА!I128>0,ТРУБА!J128>0),\"+\",\"\"),IF(ТРУБА!J128=0,\"\",CONCATENATE(\"(\",ROUND(ТРУБА!J128,3),\")\")))","v":""},null,{"$f":"IF(ТРУБА!Q128=0,\"\",ROUND(ТРУБА!Q128,3))","v":""},null,{"$f":"IF(ТРУБА!R128=0,\"\",ROUND(ТРУБА!R128,3))","v":""},null,"кг",{"$f":"IF(ТРУБА!F128=0,\"\",CONCATENATE(ТРУБА!F128,\" шт.   \",ТРУБА!D128))","v":""}]
["z",null,{"$f":"ТРУБА!H129","v":"Труба 25х25х1,2"},{"$f":"IF(ТРУБА!U129 =0,\"\",ROUND(ТРУБА!U129,3))","v":""},{"$f":"CONCATENATE(IF(ТРУБА!I129=0,\"\",ROUND(ТРУБА!I129,3)),IF(AND(ТРУБА!I129>0,ТРУБА!J129>0),\"+\",\"\"),IF(ТРУБА!J129=0,\"\",CONCATENATE(\"(\",ROUND(ТРУБА!J129,3),\")\")))","v":""},null,{"$f":"IF(ТРУБА!Q129=0,\"\",ROUND(ТРУБА!Q129,3))","v":""},null,{"$f":"IF(ТРУБА!R129=0,\"\",ROUND(ТРУБА!R129,3))","v":-0.48099999999999998},null,"кг",{"$f":"IF(ТРУБА!F129=0,\"\",CONCATENATE(ТРУБА!F129,\" шт.   \",ТРУБА!D129))","v":""}]
["z",null,{"$f":"ТРУБА!H130","v":"Труба 30х15х1,5"},{"$f":"IF(ТРУБА!U130 =0,\"\",ROUND(ТРУБА!U130,3))","v":""},{"$f":"CONCATENATE(IF(ТРУБА!I130=0,\"\",ROUND(ТРУБА!I130,3)),IF(AND(ТРУБА!I130>0,ТРУБА!J130>0),\"+\",\"\"),IF(ТРУБА!J130=0,\"\",CONCATENATE(\"(\",ROUND(ТРУБА!J130,3),\")\")))","v":""},null,{"$f":"IF(ТРУБА!Q130=0,\"\",ROUND(ТРУБА!Q130,3))","v":""},null,{"$f":"IF(ТРУБА!R130=0,\"\",ROUND(ТРУБА!R130,3))","v":""},null,"кг",{"$f":"IF(ТРУБА!F130=0,\"\",CONCATENATE(ТРУБА!F130,\" шт.   \",ТРУБА!D130))","v":""}]
["",null,{"$f":"ТРУБА!H131","v":"Труба 30х20х1,2"},{"$f":"IF(ТРУБА!U131 =0,\"\",ROUND(ТРУБА!U131,3))","v":162.91399999999999},{"$f":"CONCATENATE(IF(ТРУБА!I131=0,\"\",ROUND(ТРУБА!I131,3)),IF(AND(ТРУБА!I131>0,ТРУБА!J131>0),\"+\",\"\"),IF(ТРУБА!J131=0,\"\",CONCATENATE(\"(\",ROUND(ТРУБА!J131,3),\")\")))","v":"168,96+(1,316)"},null,{"$f":"IF(ТРУБА!Q131=0,\"\",ROUND(ТРУБА!Q131,3))","v":2.3439999999999999},null,{"$f":"IF(ТРУБА!R131=0,\"\",ROUND(ТРУБА!R131,3))","v":5.0170000000000003},null,"кг",{"$f":"IF(ТРУБА!F131=0,\"\",CONCATENATE(ТРУБА!F131,\" шт.   \",ТРУБА!D131))","v":"32 шт.   6000"}]
["z",null,{"$f":"ТРУБА!H132","v":"Труба 30х30х2"},{"$f":"IF(ТРУБА!U132 =0,\"\",ROUND(ТРУБА!U132,3))","v":""},{"$f":"CONCATENATE(IF(ТРУБА!I132=0,\"\",ROUND(ТРУБА!I132,3)),IF(AND(ТРУБА!I132>0,ТРУБА!J132>0),\"+\",\"\"),IF(ТРУБА!J132=0,\"\",CONCATENATE(\"(\",ROUND(ТРУБА!J132,3),\")\")))","v":""},null,{"$f":"IF(ТРУБА!Q132=0,\"\",ROUND(ТРУБА!Q132,3))","v":""},null,{"$f":"IF(ТРУБА!R132=0,\"\",ROUND(ТРУБА!R132,3))","v":""},null,"кг",{"$f":"IF(ТРУБА!F132=0,\"\",CONCATENATE(ТРУБА!F132,\" шт.   \",ТРУБА!D132))","v":""}]
["z",null,{"$f":"ТРУБА!H133","v":"Труба 30х80х2"},{"$f":"IF(ТРУБА!U133 =0,\"\",ROUND(ТРУБА!U133,3))","v":""},{"$f":"CONCATENATE(IF(ТРУБА!I133=0,\"\",ROUND(ТРУБА!I133,3)),IF(AND(ТРУБА!I133>0,ТРУБА!J133>0),\"+\",\"\"),IF(ТРУБА!J133=0,\"\",CONCATENATE(\"(\",ROUND(ТРУБА!J133,3),\")\")))","v":""},null,{"$f":"IF(ТРУБА!Q133=0,\"\",ROUND(ТРУБА!Q133,3))","v":""},null,{"$f":"IF(ТРУБА!R133=0,\"\",ROUND(ТРУБА!R133,3))","v":""},null,"кг",{"$f":"IF(ТРУБА!F133=0,\"\",CONCATENATE(ТРУБА!F133,\" шт.   \",ТРУБА!D133))","v":""}]
["z",null,{"$f":"ТРУБА!H134","v":"Труба 32.5х3"},{"$f":"IF(ТРУБА!U134 =0,\"\",ROUND(ТРУБА!U134,3))","v":""},{"$f":"CONCATENATE(IF(ТРУБА!I134=0,\"\",ROUND(ТРУБА!I134,3)),IF(AND(ТРУБА!I134>0,ТРУБА!J134>0),\"+\",\"\"),IF(ТРУБА!J134=0,\"\",CONCATENATE(\"(\",ROUND(ТРУБА!J134,3),\")\")))","v":""},null,{"$f":"IF(ТРУБА!Q134=0,\"\",ROUND(ТРУБА!Q134,3))","v":""},null,{"$f":"IF(ТРУБА!R134=0,\"\",ROUND(ТРУБА!R134,3))","v":""},null,"кг",{"$f":"IF(ТРУБА!F134=0,\"\",CONCATENATE(ТРУБА!F134,\" шт.   \",ТРУБА!D134))","v":""}]
["z",null,{"$f":"ТРУБА!H135","v":"Труба 40х20х1"},{"$f":"IF(ТРУБА!U135 =0,\"\",ROUND(ТРУБА!U135,3))","v":""},{"$f":"CONCATENATE(IF(ТРУБА!I135=0,\"\",ROUND(ТРУБА!I135,3)),IF(AND(ТРУБА!I135>0,ТРУБА!J135>0),\"+\",\"\"),IF(ТРУБА!J135=0,\"\",CONCATENATE(\"(\",ROUND(ТРУБА!J135,3),\")\")))","v":""},null,{"$f":"IF(ТРУБА!Q135=0,\"\",ROUND(ТРУБА!Q135,3))","v":""},null,{"$f":"IF(ТРУБА!R135=0,\"\",ROUND(ТРУБА!R135,3))","v":""},null,"кг",{"$f":"IF(ТРУБА!F135=0,\"\",CONCATENATE(ТРУБА!F135,\" шт.   \",ТРУБА!D135))","v":""}]
["z",null,{"$f":"ТРУБА!H136","v":"Труба 40х20х1,2"},{"$f":"IF(ТРУБА!U136 =0,\"\",ROUND(ТРУБА!U136,3))","v":""},{"$f":"CONCATENATE(IF(ТРУБА!I136=0,\"\",ROUND(ТРУБА!I136,3)),IF(AND(ТРУБА!I136>0,ТРУБА!J136>0),\"+\",\"\"),IF(ТРУБА!J136=0,\"\",CONCATENATE(\"(\",ROUND(ТРУБА!J136,3),\")\")))","v":""},null,{"$f":"IF(ТРУБА!Q136=0,\"\",ROUND(ТРУБА!Q136,3))","v":""},null,{"$f":"IF(ТРУБА!R136=0,\"\",ROUND(ТРУБА!R136,3))","v":""},null,"кг",{"$f":"IF(ТРУБА!F136=0,\"\",CONCATENATE(ТРУБА!F136,\" шт.   \",ТРУБА!D136))","v":""}]
["z",null,{"$f":"ТРУБА!H137","v":"Труба 60х30х2"},{"$f":"IF(ТРУБА!U137 =0,\"\",ROUND(ТРУБА!U137,3))","v":""},{"$f":"CONCATENATE(IF(ТРУБА!I137=0,\"\",ROUND(ТРУБА!I137,3)),IF(AND(ТРУБА!I137>0,ТРУБА!J137>0),\"+\",\"\"),IF(ТРУБА!J137=0,\"\",CONCATENATE(\"(\",ROUND(ТРУБА!J137,3),\")\")))","v":""},null,{"$f":"IF(ТРУБА!Q137=0,\"\",ROUND(ТРУБА!Q137,3))","v":""},null,{"$f":"IF(ТРУБА!R137=0,\"\",ROUND(ТРУБА!R137,3))","v":""},null,"кг",{"$f":"IF(ТРУБА!F137=0,\"\",CONCATENATE(ТРУБА!F137,\" шт.   \",ТРУБА!D137))","v":""}]
["z",null,{"$f":"ТРУБА!H138","v":"Труба пл.ов. 30х15х1,2"},{"$f":"IF(ТРУБА!U138 =0,\"\",ROUND(ТРУБА!U138,3))","v":""},{"$f":"CONCATENATE(IF(ТРУБА!I138=0,\"\",ROUND(ТРУБА!I138,3)),IF(AND(ТРУБА!I138>0,ТРУБА!J138>0),\"+\",\"\"),IF(ТРУБА!J138=0,\"\",CONCATENATE(\"(\",ROUND(ТРУБА!J138,3),\")\")))","v":""},null,{"$f":"IF(ТРУБА!Q138=0,\"\",ROUND(ТРУБА!Q138,3))","v":""},null,{"$f":"IF(ТРУБА!R138=0,\"\",ROUND(ТРУБА!R138,3))","v":-3.08},null,"кг",{"$f":"IF(ТРУБА!F138=0,\"\",CONCATENATE(ТРУБА!F138,\" шт.   \",ТРУБА!D138))","v":""}]
["z",null,{"$f":"ТРУБА!H139","v":"Труба пл.ов. 30х15х1,5"},{"$f":"IF(ТРУБА!U139 =0,\"\",ROUND(ТРУБА!U139,3))","v":""},{"$f":"CONCATENATE(IF(ТРУБА!I139=0,\"\",ROUND(ТРУБА!I139,3)),IF(AND(ТРУБА!I139>0,ТРУБА!J139>0),\"+\",\"\"),IF(ТРУБА!J139=0,\"\",CONCATENATE(\"(\",ROUND(ТРУБА!J139,3),\")\")))","v":""},null,{"$f":"IF(ТРУБА!Q139=0,\"\",ROUND(ТРУБА!Q139,3))","v":""},null,{"$f":"IF(ТРУБА!R139=0,\"\",ROUND(ТРУБА!R139,3))","v":""},null,"кг",{"$f":"IF(ТРУБА!F139=0,\"\",CONCATENATE(ТРУБА!F139,\" шт.   \",ТРУБА!D139))","v":""}]
["z",null,{"$f":"ТРУБА!F140","v":0}]
[null,null,null,null,null,null,null,null,null,null,null,"Заготовительный труба"]
[{"$f":"IF(D65=\"\",\"z\",\"\")","v":"z"}]
["",null,"ПВХ 0,4* мм",{"$f":"ПВХ!J65","v":331.73999339342117},{"$f":"CONCATENATE(IF(ПВХ!G65=0,\"\",ROUND(ПВХ!G65,3)),IF(AND(ПВХ!G65>0,ПВХ!H65>0),\"+\",\"\"),IF(ПВХ!H65=0,\"\",CONCATENATE(\"(\",ROUND(ПВХ!H65,3),\")\")))","v":"11,2+(362,917)"},null,{"$f":"IF(ПВХ!I65=0,\"\",ROUND(ПВХ!I65,3))","v":1.391},null,{"$f":"IF(ПВХ!K65=0,\"\",ROUND(ПВХ!K65,3))","v":40.985999999999997},null,"м2",{"$f":"IF(ПВХ!B65=0,\"\",CONCATENATE(ПВХ!B65,\" шт.   \",ПВХ!C65,\"х\",ПВХ!D65))","v":"8 шт.   1000х1400"}]
[null,null,"ВСЕГО",{"$f":"SUM(D16:D62)","v":1341.9780000000001},null,null,null,null,null,null,"кг"]

{"sheet":"Лист2","index":9,"n_rows":4,"n_cols":11,"rows_kept":4,"cut":false,"hidden":false,"merged":[]}
[545]
[null,null,null,null,null,null,null,null,null,null,{"$f":"\"лист\"&IF(AND(MOD(A1,100)>4,MOD(A1,100)<20),\"ов\",LOOKUP(MOD(A1,10),{0,1,2,5},{\"ов\",\"\",\"а\",\"ов\"}))","v":"листов"}]
[null,null,null,null,null,null,null,null,null,null,{"$f":"\"лист\"&LOOKUP((LEFTB(RIGHTB(0&A1,2))<>\"1\")*RIGHTB(0&A1),{0,1,2,5},{\"ов\",\"\",\"а\",\"ов\"})","v":"листов"}]
[null,null,null,null,null,null,null,null,null,null,{"$f":"\"лист\"&TEXT(RIGHTB(MAX(MOD(A1-11,100),9)),\"[<1]\"\"\"\";[<4]а;ов\")","v":"листов"}]