{"text_format":"1","workbook":"xlsx","n_sheets":10,"sheets":["ТРУБА","ЛИСТ","ПРОВОЛОКА","ПВХ","Д-труба","Д-лист","Д-проволока","Д-пвх","\"З\"","Лист2"],"not_rendered":{"charts":0,"images":0,"macros":1,"external_links":0,"defined_names":5,"comments":2,"pivot_tables":0},"unopened":[],"bounds":{"document_bytes":16777216,"sheet_cells":100000,"rows_first":2000,"rows_last":500,"rows_between":2000,"halvings":0,"cell_chars":16384,"cell_head_chars":4096},"cells_cut":0,"cells_raw":0,"read":"whole","date_system":"1900"}

{"sheet":"ТРУБА","index":0,"n_rows":148,"n_cols":42,"rows_kept":148,"cut":false,"hidden":false,"merged":[[117,8,117,9],[117,14,117,16],[58,6,59,6],[58,7,59,7],[58,8,59,8],[58,9,59,9],[58,11,59,11],[58,16,58,17],[58,15,59,15],[117,27,117,30],[117,24,117,26],[117,18,117,20],[58,24,59,24],[58,22,59,22],[58,19,58,20],[58,18,59,18],[58,21,59,21],[58,23,59,23],[1,13,1,14],[58,1,59,1],[58,2,59,2],[58,3,59,3],[58,4,59,4],[58,5,59,5],[2,7,2,9],[3,2,3,13],[58,12,59,12],[58,13,58,14],[5,1,5,5],[5,13,6,13]]}
["z",null,null,null,null,null,null,null,null,null,"z","z","z",null,null,null,null,null,null,null,null,null,null,"z","z","z","z","z","z","z","z","z","z","z","z","z","z","z","z","z","z","z"]
[null,null,null,null,null,"            Приложение № 2 к ЛЗК ___",null,null,null,null,null,null,null,{"$f":"TODAY()","v":"2023-07-27"}]
[null,null,null,null,null,null,null,{"$f":"CONCATENATE(\"НЕ СОВПАДЕНИЕ \",ROUND(M6-M7,3),\" кг.\")","v":"НЕ СОВПАДЕНИЕ 22,196 кг."}]
[null,null,"(19137.022.20.9016) Кронштейн 240 "]
[null,null,{"$f":"CONCATENATE(\"Изделие из: \",IF(ТРУБА!M7>0,\"ТРУБА, \",\"\"),IF(ЛИСТ!L7>0,\"ЛИСТ, \",\"\"),IF(ПРОВОЛОКА!R83>0,\"ПРОВОЛОКА, \",\"\"),IF(ПВХ!I60>0,\"ПВХ \",\"\"))","v":"Изделие из: ТРУБА, ЛИСТ, ПРОВОЛОКА, ПВХ "},null,null,null,null,null,null,null,null,"Коэфициент ","Маса "]
[null,"См. Косые резы и выполнять согласно чертежа",null,null,null,null,null,null,"План / шт",110,null,null,{"$f":"SUM(Таблица1[Столбец19])","v":162.91440272331238},"\"дырки\""]
[null,"№ п/п","Длина ","Ширина (условная расчет программы)","Кол-во\nна\nизделие","Вращение детали\n1 - да\n0 - нет","Толщина","Материал\n(профиль трубы)","Наименование \nдетали","кол-во на план","ГОСТ",{"$f":"SUM(J8:J57)","v":1430},{"$f":"SUM(M8:M57)","v":140.71805000000001},null,null,null,null,null,"номерация"]
[{"$f":"IF(E8=0,\"z\",\"\")","v":""},{"$f":"IF(J8=0,\"\",S8)","v":1},425,500,2,0,{"$f":"IF(K8=\"\",\"\",VLOOKUP(K8,Таблица1[[#All],[ГОСТ]:[точка]],8,0))","v":"1"},{"$f":"IF(K8=\"\",\"\",VLOOKUP(K8,Таблица1[[#All],[ГОСТ]:[точка]],2,0))","v":"Труба 10х10"},"перемычка",{"$f":"E8*$J$6","v":220},"Труба 10х10х1",{"$f":"IF(K8=\"\",\"\",VLOOKUP(K8,Таблица1[[#All],[ГОСТ]:[коэф]],9,0))","v":0.54},{"$f":"IFERROR(C8*D8*J8*L8/1000000-IF(E8=0,0,N8),\"\")","v":25.245000000000001},0,null,null,null,null,{"$f":"IF(J8=0,0,1)","v":1}]
[{"$f":"IF(E9=0,\"z\",\"\")","v":""},2,280,500,2,0,{"$f":"IF(K9=\"\",\"\",VLOOKUP(K9,Таблица1[[#All],[ГОСТ]:[точка]],8,0))","v":"12"},{"$f":"IF(K9=\"\",\"\",VLOOKUP(K9,Таблица1[[#All],[ГОСТ]:[точка]],2,0))","v":"Круг 12"},"основа",{"$f":"E9*$J$6","v":220},"Круг 12",{"$f":"IF(K9=\"\",\"\",VLOOKUP(K9,Таблица1[[#All],[ГОСТ]:[коэф]],9,0))","v":1.776},{"$f":"IFERROR(C9*D9*J9*L9/1000000-IF(E9=0,0,N9),\"\")","v":54.700800000000001},0,null,null,null,null,{"$f":"IF(J9=0,S8,S8+1)","v":2}]
["",3,273,500,1,0,{"$f":"IF(K10=\"\",\"\",VLOOKUP(K10,Таблица1[[#All],[ГОСТ]:[точка]],8,0))","v":"1.2"},{"$f":"IF(K10=\"\",\"\",VLOOKUP(K10,Таблица1[[#All],[ГОСТ]:[точка]],2,0))","v":"Труба 25х25"},"херня",110,"Труба 25х25х1,2",{"$f":"IF(K10=\"\",\"\",VLOOKUP(K10,Таблица1[[#All],[ГОСТ]:[коэф]],9,0))","v":1.75},26.276250000000001,null,null,null,null,null,3]
{"$rows_left_out":139}
{"sheet":"ЛИСТ","index":1,"n_rows":150,"n_cols":35,"rows_kept":150,"cut":false,"hidden":false,"merged":[[2,14,2,15],[116,1,116,9],[119,2,119,3],[3,3,3,8],[2,7,2,9],[59,7,60,7],[59,8,60,8],[59,9,60,9],[59,6,60,6],[59,1,60,1],[59,2,60,2],[59,3,60,3],[59,4,60,4],[59,5,60,5],[59,29,60,29],[59,28,60,28],[59,24,60,24],[59,23,60,23],[59,11,60,11],[59,14,60,14],[59,17,60,17],[59,20,60,20],[5,26,6,26],[59,18,59,19],[59,21,59,22],[119,15,119,17],[119,12,119,14],[119,18,119,20],[59,15,59,16],[119,22,119,24],[119,21,120,21],[119,25,120,25],[118,15,118,20],[59,12,59,13]]}
["z",null,null,null,null,null,null,null,null,null,"z","z",null,null,null,null,null,null,null,null,null,null,null,null,null,null,"z","z","z","z","z","z","z","z","z"]
[null,null,null,null,null,"            Приложение № 1 к ЛЗК ___"]
[null,null,null,null,null,null,null,{"$f":"CONCATENATE(\"НЕ СОВПАДЕНИЕ  \",ROUND(L6-L7,3),\" кг\")","v":"НЕ СОВПАДЕНИЕ  -17522,433 кг"},null,null,null,0,null,null,{"$f":"TODAY()","v":"2023-07-27"}]
[null,null,null,{"$f":"ТРУБА!C4","v":"(19137.022.20.9016) Кронштейн 240 "}]
[null,null,null,{"$f":"CONCATENATE(\"Изделие из: \",IF(ТРУБА!M7>0,\"ТРУБА, \",\"\"),IF(ЛИСТ!L7>0,\"ЛИСТ, \",\"\"),IF(ПРОВОЛОКА!R83>0,\"ПРОВОЛОКА, \",\"\"),IF(ПВХ!I60>0,\"ПВХ \",\"\"))","v":"Изделие из: ТРУБА, ЛИСТ, ПРОВОЛОКА, ПВХ "},null,null,null,null,null,null,null,null,null,null,"по картам",null,null,null,null,null,null,null,"Сумма"]
[null,null,null,null,null,"План ",null,80,"шт",null,null,{"$f":"SUM(Таблица3[Столбец25])","v":176.3443462570969},null,null,"кол-во","сумма",null,null,null,null,null,null,{"$f":"SUM(W8:W57)","v":43.210102137851912},null,null,null,"разница\nмассы \n(рас-фак)"]
[null,"№\nп/п","Длина ","Ширина","Кол-во\nна\nизделие","Вращение детали\n1 - да\n0 - нет","S тол-на","материал","Наименование детали","Кол-во на план","ГОСТ",{"$f":"SUM(L8:L57)","v":17698.777674646397},"Площадь\nфакт\nм2","Площадь \nрасч\nм2",null,{"$f":"SUM(P8:P57)","v":7.2107000000000004E-2},"коэф\nмассы","толщина\n(запятая)","номерация",null,"Длина\nреза\nмм","Кол-во \nна \nплан","Угар/\nплан/\nдетали"," общая \nдлина \nреза/м/п"]
[{"$f":"IF(E8=0,\"z\",\"\")","v":""},{"$f":"IF(E8=0,\"\",S8)","v":1},970,520,1,1,{"$f":"IF(K8=\"\",\"\",VLOOKUP(K8,Таблица3[[#All],[Столбец9]:[точка]],24,0))","v":"1.5"},{"$f":"IF(K8=\"\",\"\",VLOOKUP(K8,Таблица3[[#All],[Столбец9]:[точка]],21,0))","v":"Лист лазер"},"деталька",{"$f":"$H$6*E8","v":80},"Лист 1,5",{"$f":"IFERROR(IF(M8=0,N8*J8*R8*Q8,M8*J8*R8*Q8),\"\")","v":448.23595391999999},0.47438399999999997,{"$f":"C8*D8/1000000","v":0.50439999999999996},0,{"$f":"O8*N8","v":0},{"$f":"IFERROR(VLOOKUP(H8,Таблица3[[#All],[Столбец28]:[Столбец30]],3,0),\"0\")","v":7.8739999999999997},{"$f":"IF(K8=\"\",\"\",VLOOKUP(K8,Таблица3[[#All],[Столбец9]:[точка]],3,0))","v":1.5},{"$f":"IF(J8=0,0,1)","v":1},null,{"$f":"(C8+D8)*2","v":2980},{"$f":"U8*J8/1000","v":238.4},{"$f":"IF(R8=\"\",\"\",X8*0.15*R8*Q8/1000)","v":1.2586368528},{"$f":"U8*V8/1000","v":710.43200000000002},null,null,{"$f":"IF(M8=0,0,(N8-M8)*J8*R8*Q8)","v":28.361518079999986}]
[{"$f":"IF(E9=0,\"z\",\"\")","v":""},2,303,303,5,1,{"$f":"IF(K9=\"\",\"\",VLOOKUP(K9,Таблица3[[#All],[Столбец9]:[точка]],24,0))","v":"2"},{"$f":"IF(K9=\"\",\"\",VLOOKUP(K9,Таблица3[[#All],[Столбец9]:[точка]],21,0))","v":"Лист лазер"},"штучка",{"$f":"$H$6*E9","v":400},"Лист 2",{"$f":"IFERROR(IF(M9=0,N9*J9*R9*Q9,M9*J9*R9*Q9),\"\")","v":454.21641439999996},7.2107000000000004E-2,{"$f":"C9*D9/1000000","v":9.1809000000000002E-2},0,{"$f":"IF(M9=0,O9*N9,M9)","v":7.2107000000000004E-2},{"$f":"IFERROR(VLOOKUP(H9,Таблица3[[#All],[Столбец28]:[Столбец30]],3,0),\"0\")","v":7.8739999999999997},{"$f":"IF(K9=\"\",\"\",VLOOKUP(K9,Таблица3[[#All],[Столбец9]:[точка]],3,0))","v":2},{"$f":"IF(J9=0,S8,S8+1)","v":2},null,{"$f":"(C9+D9)*2","v":1212},{"$f":"U9*J9/1000","v":484.8},1.3879758067199999,{"$f":"U9*V9/1000","v":587.57759999999996},null,null,{"$f":"IF(M9=0,0,(N9-M9)*J9*R9*Q9)","v":124.10683839999997}]
["",3,654,565,72,1,{"$f":"IF(K10=\"\",\"\",VLOOKUP(K10,Таблица3[[#All],[Столбец9]:[точка]],24,0))","v":"1"},{"$f":"IF(K10=\"\",\"\",VLOOKUP(K10,Таблица3[[#All],[Столбец9]:[точка]],21,0))","v":"листоц"},null,5760,"Лист ОЦ 1",16790.532508108798,null,{"$f":"C10*D10/1000000","v":0.36951000000000001},0,{"$f":"IF(M10=0,O10*N10,M10)","v":0},{"$f":"IFERROR(VLOOKUP(H10,Таблица3[[#All],[Столбец28]:[Столбец30]],3,0),\"0\")","v":7.8888879999999997},{"$f":"IF(K10=\"\",\"\",VLOOKUP(K10,Таблица3[[#All],[Столбец9]:[точка]],3,0))","v":1},{"$f":"IF(J10=0,S9,S9+1)","v":3},null,{"$f":"(C10+D10)*2","v":2438},{"$f":"U10*J10/1000","v":14042.88},{"$f":"IF(R10=\"\",\"\",X10*0.15*R10*Q10/1000)","v":40.513236139127812},{"$f":"U10*V10/1000","v":34236.541440000001},null,null,0]
{"$rows_left_out":141}
{"sheet":"ПРОВОЛОКА","index":2,"n_rows":90,"n_cols":26,"rows_kept":90,"cut":false,"hidden":false,"merged":[[1,17,1,18],[5,0,7,0],[3,13,3,23],[4,1,4,2],[5,19,6,20],[5,17,6,18],[5,16,7,16],[5,1,5,2],[5,5,7,5],[5,4,7,4],[5,3,7,3],[6,2,7,2],[6,1,7,1],[5,15,7,15],[5,14,7,14],[5,13,7,13],[5,24,7,24],[5,25,7,25],[5,7,7,7],[5,6,7,6],[5,21,7,21],[5,22,7,22],[5,23,7,23],[5,12,7,12],[5,11,7,11],[5,10,7,10],[5,9,7,9],[5,8,7,8]]}
[null,null,null,"z","z",null,null,"z",null,null,null,"z","z"]
["Согласовано: Нач.техотдела                                         ",null,null,null,null,null,null,null,null,null,null,null,null,null,"запуск ",null,null,{"$f":"TODAY()","v":"2023-07-27"}]
[null,null,null,null,null,{"$f":"CONCATENATE(\"Изделие из: \",IF(ТРУБА!M7>0,\"ТРУБА, \",\"\"),IF(ЛИСТ!L7>0,\"ЛИСТ, \",\"\"),IF(ПРОВОЛОКА!R83>0,\"ПРОВОЛОКА, \",\"\"),IF(ПВХ!I60>0,\"ПВХ \",\"\"))","v":"Изделие из: ТРУБА, ЛИСТ, ПРОВОЛОКА, ПВХ "}]
["Технологическая ведомость материалов № _________по проволоке на",null,null,null,null,null,null,null,null,null,null,null,null,{"$f":"ТРУБА!C4","v":"(19137.022.20.9016) Кронштейн 240 "}]
[null,1500]
[null,"Наименование",null,"+10","План","Ø проволоки,мм","длина заготовки,мм","вес  метра проволоки","Кол-во на\nизделие\nшт","Кол-во на план\nшт","время на заготовку","время изготовления на 1 изделие, мин","вес заготовки\nкг","вес на изделие\nкг","Время изготовления на план,мин","Остаток проволоки с преды-дущего изделия (бухты), кг","Приход бухты прово-локи, кг","Общий вес на план, кг ",null,"Техноло-гический остаток обкуска в лом, кг",null,"Остаток бухты прово-локи, кг","ОТК","Принял","Дата передачи","Время передачи"]
[null,"Øх","Длина"]
[null,null,null,null,null,null,null,null,null,null,null,null,null,null,null,null,null,"теория","факт","теория","факт"]
[]
["2д","Ø8,0х",1000,10,{"$f":"$B$5","v":1500},8,{"$f":"C10+D10","v":1010},0.38800000000000001,1,{"$f":"E10*I10","v":1500},{"$f":"G10/162","v":6.2345679012345681},{"$f":"I10*K10/60","v":0.10390946502057613},{"$f":"G10*H10/1000","v":0.39188000000000001},{"$f":"I10*M10","v":0.39188000000000001},{"$f":"L10*E10","v":155.8641975308642},null,null,{"$f":"M10*J10","v":587.82000000000005},null,{"$f":"H10*0.01*J10","v":5.82}]
{"$rows_left_out":81}
{"sheet":"ПВХ","index":3,"n_rows":70,"n_cols":12,"rows_kept":70,"cut":false,"hidden":false,"merged":[[3,4,3,9],[7,4,7,6],[61,2,61,3]]}
["z",null,null,null,null,null,null,null,null,null,null,"z"]
[null,null,null,null,null,"            Приложение № 3 к ЛЗК _____"]
[null,null,null,null,null,null,null,null,null,{"$f":"TODAY()","v":"2023-07-27"}]
[null,null,null,null,{"$f":"ТРУБА!C4","v":"(19137.022.20.9016) Кронштейн 240 "}]
[null,null,{"$f":"CONCATENATE(\"Изделие из: \",IF(ТРУБА!M7>0,\"ТРУБА, \",\"\"),IF(ЛИСТ!L7>0,\"ЛИСТ, \",\"\"),IF(ПРОВОЛОКА!R83>0,\"ПРОВОЛОКА, \",\"\"),IF(ПВХ!I60>0,\"ПВХ \",\"\"))","v":"Изделие из: ТРУБА, ЛИСТ, ПРОВОЛОКА, ПВХ "}]
[]
[null,null,null,null,null,"План",1000]
[null,null,null,null,"Количество деталей на план",null,null,{"$f":"SUM(H10:H34)","v":12000},"Общая"]
[null,"№ п/п","длина ","ширина","кол-во на изделие","материал","толщина","кол-во на план","Кол-во листов ПВХ шт",null,null,"автономерация"]
[{"$f":"IF(E10=0,\"z\",\"\")","v":""},{"$f":"IF(H10=0,\"\",L10)","v":1},105,188,1,"ПВХ ",0.4,{"$f":"E10*$G$7","v":1000},{"$f":"SUMIFS($G$37:$G$59,$D$37:$D$59,$D$65,$C$37:$C$59,$C$65)","v":8},null,1,{"$f":"IF(H10=0,0,1)","v":1}]
{"$rows_left_out":61}
{"sheet":"Д-труба","index":4,"n_rows":52,"n_cols":8,"rows_kept":52,"cut":false,"hidden":false,"merged":[]}
["z",null,null,"план","на1кт","кол.на.пл","вес1кт","вес.план"]
[{"$f":"IF(ТРУБА!J8=0,\"z\",\"\")","v":""},{"$f":"VLOOKUP(ТРУБА!K8,Таблица1[[#All],[ГОСТ]:[Столбец33]],4,0)","v":"Труба"},{"$f":"CONCATENATE(VLOOKUP(ТРУБА!K8,Таблица1[[#All],[ГОСТ]:[Столбец34]],5,0),\"х\",ТРУБА!C8)","v":"10х10х1х425"},{"$f":"ТРУБА!$J$6","v":110},{"$f":"ТРУБА!E8","v":2},{"$f":"ТРУБА!J8","v":220},{"$f":"ТРУБА!M8/ТРУБА!$J$6","v":0.22950000000000001},{"$f":"ТРУБА!M8","v":25.245000000000001}]
[{"$f":"IF(ТРУБА!J9=0,\"z\",\"\")","v":""},{"$f":"VLOOKUP(ТРУБА!K9,Таблица1[[#All],[ГОСТ]:[Столбец33]],4,0)","v":"Круг"},{"$f":"CONCATENATE(VLOOKUP(ТРУБА!K9,Таблица1[[#All],[ГОСТ]:[Столбец34]],5,0),\"х\",ТРУБА!C9)","v":"12х280"},{"$f":"ТРУБА!$J$6","v":110},{"$f":"ТРУБА!E9","v":2},{"$f":"ТРУБА!J9","v":220},{"$f":"ТРУБА!M9/ТРУБА!$J$6","v":0.49728},{"$f":"ТРУБА!M9","v":54.700800000000001}]
[{"$f":"IF(ТРУБА!J10=0,\"z\",\"\")","v":""},{"$f":"VLOOKUP(ТРУБА!K10,Таблица1[[#All],[ГОСТ]:[Столбец33]],4,0)","v":"Труба"},{"$f":"CONCATENATE(VLOOKUP(ТРУБА!K10,Таблица1[[#All],[ГОСТ]:[Столбец34]],5,0),\"х\",ТРУБА!C10)","v":"25х25х1.2х273"},{"$f":"ТРУБА!$J$6","v":110},{"$f":"ТРУБА!E10","v":1},{"$f":"ТРУБА!J10","v":110},{"$f":"ТРУБА!M10/ТРУБА!$J$6","v":0.238875},{"$f":"ТРУБА!M10","v":26.276250000000001}]
[{"$f":"IF(ТРУБА!J11=0,\"z\",\"\")","v":"z"},{"$f":"VLOOKUP(ТРУБА!K11,Таблица1[[#All],[ГОСТ]:[Столбец33]],4,0)","v":"Труба"},{"$f":"CONCATENATE(VLOOKUP(ТРУБА!K11,Таблица1[[#All],[ГОСТ]:[Столбец34]],5,0),\"х\",ТРУБА!C11)","v":"25х25х1х"},{"$f":"ТРУБА!$J$6","v":110},{"$f":"ТРУБА!E11","v":0},{"$f":"ТРУБА!J11","v":0},{"$f":"ТРУБА!M11/ТРУБА!$J$6","v":0},{"$f":"ТРУБА!M11","v":0}]
[{"$f":"IF(ТРУБА!J12=0,\"z\",\"\")","v":"z"},{"$f":"VLOOKUP(ТРУБА!K12,Таблица1[[#All],[ГОСТ]:[Столбец33]],4,0)","v":{"$error":"#N/A"}},{"$f":"CONCATENATE(VLOOKUP(ТРУБА!K12,Таблица1[[#All],[ГОСТ]:[Столбец34]],5,0),\"х\",ТРУБА!C12)","v":{"$error":"#N/A"}},{"$f":"ТРУБА!$J$6","v":110},{"$f":"ТРУБА!E12","v":0},{"$f":"ТРУБА!J12","v":0},{"$f":"ТРУБА!M12/ТРУБА!$J$6","v":{"$error":"#VALUE!"}},{"$f":"ТРУБА!M12","v":""}]
[{"$f":"IF(ТРУБА!J13=0,\"z\",\"\")","v":"z"},{"$f":"VLOOKUP(ТРУБА!K13,Таблица1[[#All],[ГОСТ]:[Столбец33]],4,0)","v":{"$error":"#N/A"}},{"$f":"CONCATENATE(VLOOKUP(ТРУБА!K13,Таблица1[[#All],[ГОСТ]:[Столбец34]],5,0),\"х\",ТРУБА!C13)","v":{"$error":"#N/A"}},{"$f":"ТРУБА!$J$6","v":110},{"$f":"ТРУБА!E13","v":0},{"$f":"ТРУБА!J13","v":0},{"$f":"ТРУБА!M13/ТРУБА!$J$6","v":{"$error":"#VALUE!"}},{"$f":"ТРУБА!M13","v":""}]
[{"$f":"IF(ТРУБА!J14=0,\"z\",\"\")","v":"z"},{"$f":"VLOOKUP(ТРУБА!K14,Таблица1[[#All],[ГОСТ]:[Столбец33]],4,0)","v":{"$error":"#N/A"}},{"$f":"CONCATENATE(VLOOKUP(ТРУБА!K14,Таблица1[[#All],[ГОСТ]:[Столбец34]],5,0),\"х\",ТРУБА!C14)","v":{"$error":"#N/A"}},{"$f":"ТРУБА!$J$6","v":110},{"$f":"ТРУБА!E14","v":0},{"$f":"ТРУБА!J14","v":0},{"$f":"ТРУБА!M14/ТРУБА!$J$6","v":{"$error":"#VALUE!"}},{"$f":"ТРУБА!M14","v":""}]
[{"$f":"IF(ТРУБА!J15=0,\"z\",\"\")","v":"z"},{"$f":"VLOOKUP(ТРУБА!K15,Таблица1[[#All],[ГОСТ]:[Столбец33]],4,0)","v":{"$error":"#N/A"}},{"$f":"CONCATENATE(VLOOKUP(ТРУБА!K15,Таблица1[[#All],[ГОСТ]:[Столбец34]],5,0),\"х\",ТРУБА!C15)","v":{"$error":"#N/A"}},{"$f":"ТРУБА!$J$6","v":110},{"$f":"ТРУБА!E15","v":0},{"$f":"ТРУБА!J15","v":0},{"$f":"ТРУБА!M15/ТРУБА!$J$6","v":{"$error":"#VALUE!"}},{"$f":"ТРУБА!M15","v":""}]
[{"$f":"IF(ТРУБА!J16=0,\"z\",\"\")","v":"z"},{"$f":"VLOOKUP(ТРУБА!K16,Таблица1[[#All],[ГОСТ]:[Столбец33]],4,0)","v":{"$error":"#N/A"}},{"$f":"CONCATENATE(VLOOKUP(ТРУБА!K16,Таблица1[[#All],[ГОСТ]:[Столбец34]],5,0),\"х\",ТРУБА!C16)","v":{"$error":"#N/A"}},{"$f":"ТРУБА!$J$6","v":110},{"$f":"ТРУБА!E16","v":0},{"$f":"ТРУБА!J16","v":0},{"$f":"ТРУБА!M16/ТРУБА!$J$6","v":{"$error":"#VALUE!"}},{"$f":"ТРУБА!M16","v":""}]
{"$rows_left_out":43}
{"sheet":"Д-лист","index":5,"n_rows":51,"n_cols":8,"rows_kept":51,"cut":false,"hidden":false,"merged":[]}
["z",null,null,"план","на1кт","кол.на.пл","вес1кт","вес.план"]
[{"$f":"IF(ЛИСТ!J8=0,\"z\",\"\")","v":""},{"$f":"VLOOKUP(ЛИСТ!H8,Таблица3[[#All],[Столбец28]:[Столбец30]],2,0)","v":"Лист"},{"$f":"CONCATENATE(ЛИСТ!C8,\"х\",ЛИСТ!D8,\"х\",ЛИСТ!G8)","v":"970х520х1.5"},{"$f":"ЛИСТ!$H$6","v":80},{"$f":"ЛИСТ!E8","v":1},{"$f":"ЛИСТ!J8","v":80},{"$f":"H2/D2","v":5.6029494240000002},{"$f":"ЛИСТ!L8","v":448.23595391999999}]
[{"$f":"IF(ЛИСТ!J9=0,\"z\",\"\")","v":""},{"$f":"VLOOKUP(ЛИСТ!H9,Таблица3[[#All],[Столбец28]:[Столбец30]],2,0)","v":"Лист"},{"$f":"CONCATENATE(ЛИСТ!C9,\"х\",ЛИСТ!D9,\"х\",ЛИСТ!G9)","v":"303х303х2"},{"$f":"ЛИСТ!$H$6","v":80},{"$f":"ЛИСТ!E9","v":5},{"$f":"ЛИСТ!J9","v":400},{"$f":"H3/D3","v":5.6777051799999994},{"$f":"ЛИСТ!L9","v":454.21641439999996}]
[{"$f":"IF(ЛИСТ!J10=0,\"z\",\"\")","v":""},{"$f":"VLOOKUP(ЛИСТ!H10,Таблица3[[#All],[Столбец28]:[Столбец30]],2,0)","v":"Лист ОЦ"},{"$f":"CONCATENATE(ЛИСТ!C10,\"х\",ЛИСТ!D10,\"х\",ЛИСТ!G10)","v":"654х565х1"},{"$f":"ЛИСТ!$H$6","v":80},{"$f":"ЛИСТ!E10","v":72},{"$f":"ЛИСТ!J10","v":5760},209.88165635135996,{"$f":"ЛИСТ!L10","v":16790.532508108798}]
[{"$f":"IF(ЛИСТ!J11=0,\"z\",\"\")","v":""},{"$f":"VLOOKUP(ЛИСТ!H11,Таблица3[[#All],[Столбец28]:[Столбец30]],2,0)","v":"Сетка ПВЛ"},{"$f":"CONCATENATE(ЛИСТ!C11,\"х\",ЛИСТ!D11,\"х\",ЛИСТ!G11)","v":"45х557х1"},{"$f":"ЛИСТ!$H$6","v":80},{"$f":"ЛИСТ!E11","v":1},{"$f":"ЛИСТ!J11","v":80},{"$f":"H5/D5","v":7.2409977719999991E-2},{"$f":"ЛИСТ!L11","v":5.7927982175999997}]
[{"$f":"IF(ЛИСТ!J12=0,\"z\",\"\")","v":"z"},{"$f":"VLOOKUP(ЛИСТ!H12,Таблица3[[#All],[Столбец28]:[Столбец30]],2,0)","v":{"$error":"#N/A"}},{"$f":"CONCATENATE(ЛИСТ!C12,\"х\",ЛИСТ!D12,\"х\",ЛИСТ!G12)","v":"хх"},{"$f":"ЛИСТ!$H$6","v":80},{"$f":"ЛИСТ!E12","v":0},{"$f":"ЛИСТ!J12","v":0},{"$error":"#VALUE!"},{"$f":"ЛИСТ!L12","v":""}]
[{"$f":"IF(ЛИСТ!J13=0,\"z\",\"\")","v":"z"},{"$f":"VLOOKUP(ЛИСТ!H13,Таблица3[[#All],[Столбец28]:[Столбец30]],2,0)","v":"Сетка ПВЛ"},{"$f":"CONCATENATE(ЛИСТ!C13,\"х\",ЛИСТ!D13,\"х\",ЛИСТ!G13)","v":"хх1"},{"$f":"ЛИСТ!$H$6","v":80},{"$f":"ЛИСТ!E13","v":0},{"$f":"ЛИСТ!J13","v":0},0,{"$f":"ЛИСТ!L13","v":0}]
[{"$f":"IF(ЛИСТ!J14=0,\"z\",\"\")","v":"z"},{"$f":"VLOOKUP(ЛИСТ!H14,Таблица3[[#All],[Столбец28]:[Столбец30]],2,0)","v":{"$error":"#N/A"}},{"$f":"CONCATENATE(ЛИСТ!C14,\"х\",ЛИСТ!D14,\"х\",ЛИСТ!G14)","v":"хх"},{"$f":"ЛИСТ!$H$6","v":80},{"$f":"ЛИСТ!E14","v":0},{"$f":"ЛИСТ!J14","v":0},{"$error":"#VALUE!"},{"$f":"ЛИСТ!L14","v":""}]
[{"$f":"IF(ЛИСТ!J15=0,\"z\",\"\")","v":"z"},{"$f":"VLOOKUP(ЛИСТ!H15,Таблица3[[#All],[Столбец28]:[Столбец30]],2,0)","v":{"$error":"#N/A"}},{"$f":"CONCATENATE(ЛИСТ!C15,\"х\",ЛИСТ!D15,\"х\",ЛИСТ!G15)","v":"хх"},{"$f":"ЛИСТ!$H$6","v":80},{"$f":"ЛИСТ!E15","v":0},{"$f":"ЛИСТ!J15","v":0},{"$error":"#VALUE!"},{"$f":"ЛИСТ!L15","v":""}]
[{"$f":"IF(ЛИСТ!J16=0,\"z\",\"\")","v":"z"},{"$f":"VLOOKUP(ЛИСТ!H16,Таблица3[[#All],[Столбец28]:[Столбец30]],2,0)","v":{"$error":"#N/A"}},{"$f":"CONCATENATE(ЛИСТ!C16,\"х\",ЛИСТ!D16,\"х\",ЛИСТ!G16)","v":"хх"},{"$f":"ЛИСТ!$H$6","v":80},{"$f":"ЛИСТ!E16","v":0},{"$f":"ЛИСТ!J16","v":0},{"$error":"#VALUE!"},{"$f":"ЛИСТ!L16","v":""}]
{"$rows_left_out":42}
{"sheet":"Д-проволока","index":6,"n_rows":72,"n_cols":8,"rows_kept":72,"cut":false,"hidden":false,"merged":[]}
[null,null,null,"план","на1кт","кол.на.пл","вес1кт","вес.план"]
[{"$f":"ПРОВОЛОКА!A10","v":"2д"},{"$f":"IF(E2=0,\"z\",\"Проволока\")","v":"Проволока"},{"$f":"CONCATENATE(ПРОВОЛОКА!B10,ПРОВОЛОКА!C10)","v":"Ø8,0х1000"},{"$f":"ПРОВОЛОКА!E10","v":1500},{"$f":"ПРОВОЛОКА!I10","v":1},{"$f":"ПРОВОЛОКА!J10","v":1500},{"$f":"ПРОВОЛОКА!N10","v":0.39188000000000001},{"$f":"ПРОВОЛОКА!R10","v":587.82000000000005}]
[{"$f":"ПРОВОЛОКА!A11","v":"гиб"},{"$f":"IF(E3=0,\"z\",\"Проволока\")","v":"Проволока"},{"$f":"CONCATENATE(ПРОВОЛОКА!B11,ПРОВОЛОКА!C11)","v":"Ø8,0х100"},{"$f":"ПРОВОЛОКА!E11","v":1500},{"$f":"ПРОВОЛОКА!I11","v":5},{"$f":"ПРОВОЛОКА!J11","v":7500},{"$f":"ПРОВОЛОКА!N11","v":0.22310000000000002},{"$f":"ПРОВОЛОКА!R11","v":334.65000000000003}]
[{"$f":"ПРОВОЛОКА!A12","v":"z"},"z",{"$f":"CONCATENATE(ПРОВОЛОКА!B12,ПРОВОЛОКА!C12)","v":"Ø8,0х"},{"$f":"ПРОВОЛОКА!E12","v":1500},{"$f":"ПРОВОЛОКА!I12","v":0},{"$f":"ПРОВОЛОКА!J12","v":0},{"$f":"ПРОВОЛОКА!N12","v":0},{"$f":"ПРОВОЛОКА!R12","v":0}]
[{"$f":"ПРОВОЛОКА!A13","v":"z"},"z",{"$f":"CONCATENATE(ПРОВОЛОКА!B13,ПРОВОЛОКА!C13)","v":"Ø8,0х"},{"$f":"ПРОВОЛОКА!E13","v":1500},{"$f":"ПРОВОЛОКА!I13","v":0},{"$f":"ПРОВОЛОКА!J13","v":0},{"$f":"ПРОВОЛОКА!N13","v":0},{"$f":"ПРОВОЛОКА!R13","v":0}]
[{"$f":"ПРОВОЛОКА!A14","v":"z"},"z",{"$f":"CONCATENATE(ПРОВОЛОКА!B14,ПРОВОЛОКА!C14)","v":"Ø8,0х"},{"$f":"ПРОВОЛОКА!E14","v":1500},{"$f":"ПРОВОЛОКА!I14","v":0},{"$f":"ПРОВОЛОКА!J14","v":0},{"$f":"ПРОВОЛОКА!N14","v":0},{"$f":"ПРОВОЛОКА!R14","v":0}]
["z","z",{"$f":"CONCATENATE(ПРОВОЛОКА!B15,ПРОВОЛОКА!C15)","v":""},{"$f":"ПРОВОЛОКА!E15","v":0},{"$f":"ПРОВОЛОКА!I15","v":0},{"$f":"ПРОВОЛОКА!J15","v":0},{"$f":"ПРОВОЛОКА!N15","v":0.61498000000000008},{"$f":"ПРОВОЛОКА!R15","v":922.47}]
[{"$f":"ПРОВОЛОКА!A16","v":"z"},"z",{"$f":"CONCATENATE(ПРОВОЛОКА!B16,ПРОВОЛОКА!C16)","v":"Ø6,0х"},{"$f":"ПРОВОЛОКА!E16","v":1500},{"$f":"ПРОВОЛОКА!I16","v":0},{"$f":"ПРОВОЛОКА!J16","v":0},{"$f":"ПРОВОЛОКА!N16","v":0},{"$f":"ПРОВОЛОКА!R16","v":0}]
[{"$f":"ПРОВОЛОКА!A17","v":"z"},"z",{"$f":"CONCATENATE(ПРОВОЛОКА!B17,ПРОВОЛОКА!C17)","v":"Ø6,0х"},{"$f":"ПРОВОЛОКА!E17","v":1500},{"$f":"ПРОВОЛОКА!I17","v":0},{"$f":"ПРОВОЛОКА!J17","v":0},{"$f":"ПРОВОЛОКА!N17","v":0},{"$f":"ПРОВОЛОКА!R17","v":0}]
[{"$f":"ПРОВОЛОКА!A18","v":"z"},"z",{"$f":"CONCATENATE(ПРОВОЛОКА!B18,ПРОВОЛОКА!C18)","v":"Ø6,0х"},{"$f":"ПРОВОЛОКА!E18","v":1500},{"$f":"ПРОВОЛОКА!I18","v":0},{"$f":"ПРОВОЛОКА!J18","v":0},{"$f":"ПРОВОЛОКА!N18","v":0},{"$f":"ПРОВОЛОКА!R18","v":0}]
{"$rows_left_out":63}
{"sheet":"Д-пвх","index":7,"n_rows":26,"n_cols":6,"rows_kept":26,"cut":false,"hidden":false,"merged":[]}
["z",null,null,"план","на1кт","кол.на.пл"]
[{"$f":"IF(ПВХ!H10=0,\"z\",\"\")","v":""},{"$f":"CONCATENATE(ПВХ!F10,\" \",ПВХ!G10)","v":"ПВХ  0,4"},{"$f":"CONCATENATE(ПВХ!C10,\"х\",ПВХ!D10,\"х\",ПВХ!G10)","v":"105х188х0,4"},{"$f":"ПВХ!$G$7","v":1000},{"$f":"ПВХ!E10","v":1},{"$f":"D2*E2","v":1000}]
[{"$f":"IF(ПВХ!H11=0,\"z\",\"\")","v":""},{"$f":"CONCATENATE(ПВХ!F11,\" \",ПВХ!G11)","v":"ПВХ  0,4"},{"$f":"CONCATENATE(ПВХ!C11,\"х\",ПВХ!D11,\"х\",ПВХ!G11)","v":"50х100х0,4"},{"$f":"ПВХ!$G$7","v":1000},{"$f":"ПВХ!E11","v":6},{"$f":"D3*E3","v":6000}]
[{"$f":"IF(ПВХ!H12=0,\"z\",\"\")","v":""},{"$f":"CONCATENATE(ПВХ!F12,\" \",ПВХ!G12)","v":"ПВХ  0,4"},{"$f":"CONCATENATE(ПВХ!C12,\"х\",ПВХ!D12,\"х\",ПВХ!G12)","v":"654х856х0,4"},{"$f":"ПВХ!$G$7","v":1000},{"$f":"ПВХ!E12","v":5},5000]
[{"$f":"IF(ПВХ!H13=0,\"z\",\"\")","v":"z"},{"$f":"CONCATENATE(ПВХ!F13,\" \",ПВХ!G13)","v":"ПВХ  0,4"},{"$f":"CONCATENATE(ПВХ!C13,\"х\",ПВХ!D13,\"х\",ПВХ!G13)","v":"хх0,4"},{"$f":"ПВХ!$G$7","v":1000},{"$f":"ПВХ!E13","v":0},0]
[{"$f":"IF(ПВХ!H14=0,\"z\",\"\")","v":"z"},{"$f":"CONCATENATE(ПВХ!F14,\" \",ПВХ!G14)","v":"ПВХ  0,4"},{"$f":"CONCATENATE(ПВХ!C14,\"х\",ПВХ!D14,\"х\",ПВХ!G14)","v":"хх0,4"},{"$f":"ПВХ!$G$7","v":1000},{"$f":"ПВХ!E14","v":0},0]
[{"$f":"IF(ПВХ!H15=0,\"z\",\"\")","v":"z"},{"$f":"CONCATENATE(ПВХ!F15,\" \",ПВХ!G15)","v":"ПВХ  0,4"},{"$f":"CONCATENATE(ПВХ!C15,\"х\",ПВХ!D15,\"х\",ПВХ!G15)","v":"хх0,4"},{"$f":"ПВХ!$G$7","v":1000},{"$f":"ПВХ!E15","v":0},0]
[{"$f":"IF(ПВХ!H16=0,\"z\",\"\")","v":"z"},{"$f":"CONCATENATE(ПВХ!F16,\" \",ПВХ!G16)","v":"ПВХ  0,4"},{"$f":"CONCATENATE(ПВХ!C16,\"х\",ПВХ!D16,\"х\",ПВХ!G16)","v":"хх0,4"},{"$f":"ПВХ!$G$7","v":1000},{"$f":"ПВХ!E16","v":0},0]
[{"$f":"IF(ПВХ!H17=0,\"z\",\"\")","v":"z"},{"$f":"CONCATENATE(ПВХ!F17,\" \",ПВХ!G17)","v":"ПВХ  0,4"},{"$f":"CONCATENATE(ПВХ!C17,\"х\",ПВХ!D17,\"х\",ПВХ!G17)","v":"хх0,4"},{"$f":"ПВХ!$G$7","v":1000},{"$f":"ПВХ!E17","v":0},0]
[{"$f":"IF(ПВХ!H18=0,\"z\",\"\")","v":"z"},{"$f":"CONCATENATE(ПВХ!F18,\" \",ПВХ!G18)","v":"ПВХ  0,4"},{"$f":"CONCATENATE(ПВХ!C18,\"х\",ПВХ!D18,\"х\",ПВХ!G18)","v":"хх0,4"},{"$f":"ПВХ!$G$7","v":1000},{"$f":"ПВХ!E18","v":0},0]
{"$rows_left_out":17}
{"sheet":"\"З\"","index":8,"n_rows":67,"n_cols":15,"rows_kept":67,"cut":false,"hidden":false,"merged":[[12,0,14,0],[42,11,42,14],[63,11,63,14],[12,3,12,10],[6,8,6,10],[13,5,14,5],[13,4,14,4],[13,3,14,3],[12,2,14,2],[12,1,14,1],[13,6,13,7],[13,8,13,9],[6,2,6,7],[9,1,9,2],[10,1,10,2]]}
["z"]
[null,"Утверждено:"]
[null,null,null,null,null,null,"Лимит установил"]
[]
[null,"Дата:"]
[]
[null,null,"Лимитно-заборная карта ЛЗК №",null,null,null,null,null,"30272 (050.05.23) № 08",null,null,"З"]
[null,null,null,"на отпуск материалов на изделие  ",{"$f":"ТРУБА!C4","v":"(19137.022.20.9016) Кронштейн 240 "}]
[]
[null,"Количество общее: ",null,{"$f":"CONCATENATE(ТРУБА!J6,\" шт.\")","v":"110 шт."}]
{"$rows_left_out":58}
{"sheet":"Лист2","index":9,"n_rows":4,"n_cols":11,"rows_kept":4,"cut":false,"hidden":false,"merged":[]}
[545]
[null,null,null,null,null,null,null,null,null,null,{"$f":"\"лист\"&IF(AND(MOD(A1,100)>4,MOD(A1,100)<20),\"ов\",LOOKUP(MOD(A1,10),{0,1,2,5},{\"ов\",\"\",\"а\",\"ов\"}))","v":"листов"}]
[null,null,null,null,null,null,null,null,null,null,{"$f":"\"лист\"&LOOKUP((LEFTB(RIGHTB(0&A1,2))<>\"1\")*RIGHTB(0&A1),{0,1,2,5},{\"ов\",\"\",\"а\",\"ов\"})","v":"листов"}]
[null,null,null,null,null,null,null,null,null,null,{"$f":"\"лист\"&TEXT(RIGHTB(MAX(MOD(A1-11,100),9)),\"[<1]\"\"\"\";[<4]а;ов\")","v":"листов"}]