{"text_format":"1","workbook":"xlsx","n_sheets":3,"sheets":["СВОДНАЯ","СВОДНАЯ (2)","без форматирования таблицы"],"not_rendered":{"charts":0,"images":0,"macros":1,"external_links":0,"defined_names":1,"comments":0,"pivot_tables":2},"unopened":[],"bounds":{"document_bytes":16777216,"sheet_cells":100000,"rows_first":2000,"rows_last":500,"rows_between":2000,"halvings":0,"cell_chars":16384,"cell_head_chars":4096},"cells_cut":0,"cells_raw":0,"read":"whole","date_system":"1900"}

{"sheet":"СВОДНАЯ","index":0,"n_rows":10,"n_cols":13,"rows_kept":10,"cut":false,"hidden":false,"merged":[]}
[]
[]
["Количество по полю Для сводной сцепка"]
["Для сводной сцепка","Итог",null,null,null,"win11 2 2 k11, k12",null,null,null,"Названия строк","n_clients","n_urls","svs_codes"]
["(пусто)",null,null,null,null,"win10 1 1 k13",null,null,null,"win12",1,1,"k13"]
["win12 1 1 k13",1,null,null,null,"AntiMW 3 2 k49,k50",null,null,null,"win11",16,2,"k11, k12"]
["win11 168 2 k11, k12",168,null,null,null,null,null,null,null,"win10",7,1,"k13"]
["win10 82 1 k13",82,null,null,null,null,null,null,null,"AntiMW",24,2,"k49, k50"]
["AntiMW 249 2 k49, k50",249]
["Общий итог",500]

{"sheet":"СВОДНАЯ (2)","index":1,"n_rows":54,"n_cols":13,"rows_kept":54,"cut":false,"hidden":false,"merged":[]}
[]
[]
["Количество по полю Для сводной сцепка"]
["Для сводной сцепка","Клиент","Итог",null,null,"win11 2 2 k11, k12",null,null,null,"Названия строк","n_clients","n_urls","svs_codes"]
["(пусто)","(пусто)",null,null,null,"win10 1 1 k13",null,null,null,"win12",1,1,"k13"]
["win12 1 1 k13","Иванов9",1,null,null,"AntiMW 3 2 k49,k50",null,null,null,"win11",16,2,"k11, k12"]
["win11 168 2 k11, k12","Иванов",77,null,null,null,null,null,null,"win10",7,1,"k13"]
[null,"Иванов1",1,null,null,null,null,null,null,"AntiMW",24,2,"k49, k50"]
[null,"Иванов10",1]
[null,"Иванов11",1]
[null,"Иванов13",1]
[null,"Иванов14",1]
[null,"Иванов16",1]
[null,"Иванов17",1]
[null,"Иванов19",1]
[null,"Иванов2",1]
[null,"Иванов20",1]
[null,"Иванов4",1]
[null,"Иванов5",1]
[null,"Иванов7",1]
[null,"Иванов8",1]
[null,"Петров",77]
["win10 82 1 k13","Иванов12",1]
[null,"Иванов15",1]
[null,"Иванов18",1]
[null,"Иванов21",1]
[null,"Иванов3",1]
[null,"Иванов6",1]
[null,"Петров",76]
["AntiMW 249 2 k49, k50","Иванов1",1]
[null,"Иванов10",1]
[null,"Иванов11",1]
[null,"Иванов12",1]
[null,"Иванов13",1]
[null,"Иванов14",1]
[null,"Иванов15",1]
[null,"Иванов16",1]
[null,"Иванов17",1]
[null,"Иванов18",1]
[null,"Иванов19",1]
[null,"Иванов2",1]
[null,"Иванов20",1]
[null,"Иванов21",1]
[null,"Иванов3",1]
[null,"Иванов4",1]
[null,"Иванов5",1]
[null,"Иванов6",1]
[null,"Иванов7",1]
[null,"Иванов8",1]
[null,"Иванов9",1]
[null,"Котов",76]
[null,"Петров",76]
[null,"Сидоров",76]
["Общий итог",null,500]

{"sheet":"без форматирования таблицы","index":2,"n_rows":501,"n_cols":6,"rows_kept":501,"cut":false,"hidden":false,"merged":[]}
["Клиент","Софт","Производитель","Код услуги","Урл на софт","Для сводной сцепка"]
["Иванов1","win11","Microsoft","k11","урл1",{"$f":"CONCATENATE(B2,\" \",COUNTIF(B:B,B2),\" \",LEN(сцепитьЕсли2(B:B,B2,D:D,\", \",1))-LEN(SUBSTITUTE(сцепитьЕсли2(B:B,B2,D:D,\"; \",1),\"k\",)),\" \",сцепитьЕсли2(B:B,B2,D:D,\", \",1))","v":"win11 168 2 k11, k12"}]
["Иванов2","win11","Microsoft","k12","урл2",{"$f":"CONCATENATE(B3,\" \",COUNTIF(B:B,B3),\" \",LEN(сцепитьЕсли2(B:B,B3,D:D,\", \",1))-LEN(SUBSTITUTE(сцепитьЕсли2(B:B,B3,D:D,\"; \",1),\"k\",)),\" \",сцепитьЕсли2(B:B,B3,D:D,\", \",1))","v":"win11 168 2 k11, k12"}]
["Иванов3","win10","Microsoft","k13","урл1",{"$f":"CONCATENATE(B4,\" \",COUNTIF(B:B,B4),\" \",LEN(сцепитьЕсли2(B:B,B4,D:D,\", \",1))-LEN(SUBSTITUTE(сцепитьЕсли2(B:B,B4,D:D,\"; \",1),\"k\",)),\" \",сцепитьЕсли2(B:B,B4,D:D,\", \",1))","v":"win10 82 1 k13"}]
["Иванов4","AntiMW","Kasper","k49","урл10",{"$f":"CONCATENATE(B5,\" \",COUNTIF(B:B,B5),\" \",LEN(сцепитьЕсли2(B:B,B5,D:D,\", \",1))-LEN(SUBSTITUTE(сцепитьЕсли2(B:B,B5,D:D,\"; \",1),\"k\",)),\" \",сцепитьЕсли2(B:B,B5,D:D,\", \",1))","v":"AntiMW 249 2 k49, k50"}]
["Иванов5","AntiMW","Kasper","k50","урл10",{"$f":"CONCATENATE(B6,\" \",COUNTIF(B:B,B6),\" \",LEN(сцепитьЕсли2(B:B,B6,D:D,\", \",1))-LEN(SUBSTITUTE(сцепитьЕсли2(B:B,B6,D:D,\"; \",1),\"k\",)),\" \",сцепитьЕсли2(B:B,B6,D:D,\", \",1))","v":"AntiMW 249 2 k49, k50"}]
["Иванов6","AntiMW","Kasper","k49","урл50",{"$f":"CONCATENATE(B7,\" \",COUNTIF(B:B,B7),\" \",LEN(сцепитьЕсли2(B:B,B7,D:D,\", \",1))-LEN(SUBSTITUTE(сцепитьЕсли2(B:B,B7,D:D,\"; \",1),\"k\",)),\" \",сцепитьЕсли2(B:B,B7,D:D,\", \",1))","v":"AntiMW 249 2 k49, k50"}]
["Иванов7","win11","Microsoft","k11","урл1",{"$f":"CONCATENATE(B8,\" \",COUNTIF(B:B,B8),\" \",LEN(сцепитьЕсли2(B:B,B8,D:D,\", \",1))-LEN(SUBSTITUTE(сцепитьЕсли2(B:B,B8,D:D,\"; \",1),\"k\",)),\" \",сцепитьЕсли2(B:B,B8,D:D,\", \",1))","v":"win11 168 2 k11, k12"}]
["Иванов8","win11","Microsoft","k12","урл2",{"$f":"CONCATENATE(B9,\" \",COUNTIF(B:B,B9),\" \",LEN(сцепитьЕсли2(B:B,B9,D:D,\", \",1))-LEN(SUBSTITUTE(сцепитьЕсли2(B:B,B9,D:D,\"; \",1),\"k\",)),\" \",сцепитьЕсли2(B:B,B9,D:D,\", \",1))","v":"win11 168 2 k11, k12"}]
["Иванов9","win12","Microsoft","k13","урл1",{"$f":"CONCATENATE(B10,\" \",COUNTIF(B:B,B10),\" \",LEN(сцепитьЕсли2(B:B,B10,D:D,\", \",1))-LEN(SUBSTITUTE(сцепитьЕсли2(B:B,B10,D:D,\"; \",1),\"k\",)),\" \",сцепитьЕсли2(B:B,B10,D:D,\", \",1))","v":"win12 1 1 k13"}]
["Иванов10","AntiMW","Kasper","k49","урл10",{"$f":"CONCATENATE(B11,\" \",COUNTIF(B:B,B11),\" \",LEN(сцепитьЕсли2(B:B,B11,D:D,\", \",1))-LEN(SUBSTITUTE(сцепитьЕсли2(B:B,B11,D:D,\"; \",1),\"k\",)),\" \",сцепитьЕсли2(B:B,B11,D:D,\", \",1))","v":"AntiMW 249 2 k49, k50"}]
["Иванов11","AntiMW","Kasper","k50","урл10",{"$f":"CONCATENATE(B12,\" \",COUNTIF(B:B,B12),\" \",LEN(сцепитьЕсли2(B:B,B12,D:D,\", \",1))-LEN(SUBSTITUTE(сцепитьЕсли2(B:B,B12,D:D,\"; \",1),\"k\",)),\" \",сцепитьЕсли2(B:B,B12,D:D,\", \",1))","v":"AntiMW 249 2 k49, k50"}]
["Иванов12","AntiMW","Kasper","k49","урл50",{"$f":"CONCATENATE(B13,\" \",COUNTIF(B:B,B13),\" \",LEN(сцепитьЕсли2(B:B,B13,D:D,\", \",1))-LEN(SUBSTITUTE(сцепитьЕсли2(B:B,B13,D:D,\"; \",1),\"k\",)),\" \",сцепитьЕсли2(B:B,B13,D:D,\", \",1))","v":"AntiMW 249 2 k49, k50"}]
["Иванов13","win11","Microsoft","k11","урл1",{"$f":"CONCATENATE(B14,\" \",COUNTIF(B:B,B14),\" \",LEN(сцепитьЕсли2(B:B,B14,D:D,\", \",1))-LEN(SUBSTITUTE(сцепитьЕсли2(B:B,B14,D:D,\"; \",1),\"k\",)),\" \",сцепитьЕсли2(B:B,B14,D:D,\", \",1))","v":"win11 168 2 k11, k12"}]
["Иванов14","win11","Microsoft","k12","урл2",{"$f":"CONCATENATE(B15,\" \",COUNTIF(B:B,B15),\" \",LEN(сцепитьЕсли2(B:B,B15,D:D,\", \",1))-LEN(SUBSTITUTE(сцепитьЕсли2(B:B,B15,D:D,\"; \",1),\"k\",)),\" \",сцепитьЕсли2(B:B,B15,D:D,\", \",1))","v":"win11 168 2 k11, k12"}]
["Иванов15","win10","Microsoft","k13","урл1",{"$f":"CONCATENATE(B16,\" \",COUNTIF(B:B,B16),\" \",LEN(сцепитьЕсли2(B:B,B16,D:D,\", \",1))-LEN(SUBSTITUTE(сцепитьЕсли2(B:B,B16,D:D,\"; \",1),\"k\",)),\" \",сцепитьЕсли2(B:B,B16,D:D,\", \",1))","v":"win10 82 1 k13"}]
["Иванов16","AntiMW","Kasper","k49","урл10",{"$f":"CONCATENATE(B17,\" \",COUNTIF(B:B,B17),\" \",LEN(сцепитьЕсли2(B:B,B17,D:D,\", \",1))-LEN(SUBSTITUTE(сцепитьЕсли2(B:B,B17,D:D,\"; \",1),\"k\",)),\" \",сцепитьЕсли2(B:B,B17,D:D,\", \",1))","v":"AntiMW 249 2 k49, k50"}]
["Иванов17","AntiMW","Kasper","k50","урл10",{"$f":"CONCATENATE(B18,\" \",COUNTIF(B:B,B18),\" \",LEN(сцепитьЕсли2(B:B,B18,D:D,\", \",1))-LEN(SUBSTITUTE(сцепитьЕсли2(B:B,B18,D:D,\"; \",1),\"k\",)),\" \",сцепитьЕсли2(B:B,B18,D:D,\", \",1))","v":"AntiMW 249 2 k49, k50"}]
["Иванов18","AntiMW","Kasper","k49","урл50",{"$f":"CONCATENATE(B19,\" \",COUNTIF(B:B,B19),\" \",LEN(сцепитьЕсли2(B:B,B19,D:D,\", \",1))-LEN(SUBSTITUTE(сцепитьЕсли2(B:B,B19,D:D,\"; \",1),\"k\",)),\" \",сцепитьЕсли2(B:B,B19,D:D,\", \",1))","v":"AntiMW 249 2 k49, k50"}]
["Иванов19","win11","Microsoft","k11","урл1",{"$f":"CONCATENATE(B20,\" \",COUNTIF(B:B,B20),\" \",LEN(сцепитьЕсли2(B:B,B20,D:D,\", \",1))-LEN(SUBSTITUTE(сцепитьЕсли2(B:B,B20,D:D,\"; \",1),\"k\",)),\" \",сцепитьЕсли2(B:B,B20,D:D,\", \",1))","v":"win11 168 2 k11, k12"}]
["Иванов20","win11","Microsoft","k12","урл2",{"$f":"CONCATENATE(B21,\" \",COUNTIF(B:B,B21),\" \",LEN(сцепитьЕсли2(B:B,B21,D:D,\", \",1))-LEN(SUBSTITUTE(сцепитьЕсли2(B:B,B21,D:D,\"; \",1),\"k\",)),\" \",сцепитьЕсли2(B:B,B21,D:D,\", \",1))","v":"win11 168 2 k11, k12"}]
["Иванов21","win10","Microsoft","k13","урл1",{"$f":"CONCATENATE(B22,\" \",COUNTIF(B:B,B22),\" \",LEN(сцепитьЕсли2(B:B,B22,D:D,\", \",1))-LEN(SUBSTITUTE(сцепитьЕсли2(B:B,B22,D:D,\"; \",1),\"k\",)),\" \",сцепитьЕсли2(B:B,B22,D:D,\", \",1))","v":"win10 82 1 k13"}]
["Иванов1","AntiMW","Kasper","k49","урл10",{"$f":"CONCATENATE(B23,\" \",COUNTIF(B:B,B23),\" \",LEN(сцепитьЕсли2(B:B,B23,D:D,\", \",1))-LEN(SUBSTITUTE(сцепитьЕсли2(B:B,B23,D:D,\"; \",1),\"k\",)),\" \",сцепитьЕсли2(B:B,B23,D:D,\", \",1))","v":"AntiMW 249 2 k49, k50"}]
["Иванов2","AntiMW","Kasper","k50","урл10",{"$f":"CONCATENATE(B24,\" \",COUNTIF(B:B,B24),\" \",LEN(сцепитьЕсли2(B:B,B24,D:D,\", \",1))-LEN(SUBSTITUTE(сцепитьЕсли2(B:B,B24,D:D,\"; \",1),\"k\",)),\" \",сцепитьЕсли2(B:B,B24,D:D,\", \",1))","v":"AntiMW 249 2 k49, k50"}]
["Иванов3","AntiMW","Kasper","k49","урл50",{"$f":"CONCATENATE(B25,\" \",COUNTIF(B:B,B25),\" \",LEN(сцепитьЕсли2(B:B,B25,D:D,\", \",1))-LEN(SUBSTITUTE(сцепитьЕсли2(B:B,B25,D:D,\"; \",1),\"k\",)),\" \",сцепитьЕсли2(B:B,B25,D:D,\", \",1))","v":"AntiMW 249 2 k49, k50"}]
["Иванов4","win11","Microsoft","k11","урл1",{"$f":"CONCATENATE(B26,\" \",COUNTIF(B:B,B26),\" \",LEN(сцепитьЕсли2(B:B,B26,D:D,\", \",1))-LEN(SUBSTITUTE(сцепитьЕсли2(B:B,B26,D:D,\"; \",1),\"k\",)),\" \",сцепитьЕсли2(B:B,B26,D:D,\", \",1))","v":"win11 168 2 k11, k12"}]
["Иванов5","win11","Microsoft","k12","урл2",{"$f":"CONCATENATE(B27,\" \",COUNTIF(B:B,B27),\" \",LEN(сцепитьЕсли2(B:B,B27,D:D,\", \",1))-LEN(SUBSTITUTE(сцепитьЕсли2(B:B,B27,D:D,\"; \",1),\"k\",)),\" \",сцепитьЕсли2(B:B,B27,D:D,\", \",1))","v":"win11 168 2 k11, k12"}]
["Иванов6","win10","Microsoft","k13","урл1",{"$f":"CONCATENATE(B28,\" \",COUNTIF(B:B,B28),\" \",LEN(сцепитьЕсли2(B:B,B28,D:D,\", \",1))-LEN(SUBSTITUTE(сцепитьЕсли2(B:B,B28,D:D,\"; \",1),\"k\",)),\" \",сцепитьЕсли2(B:B,B28,D:D,\", \",1))","v":"win10 82 1 k13"}]
["Иванов7","AntiMW","Kasper","k49","урл10",{"$f":"CONCATENATE(B29,\" \",COUNTIF(B:B,B29),\" \",LEN(сцепитьЕсли2(B:B,B29,D:D,\", \",1))-LEN(SUBSTITUTE(сцепитьЕсли2(B:B,B29,D:D,\"; \",1),\"k\",)),\" \",сцепитьЕсли2(B:B,B29,D:D,\", \",1))","v":"AntiMW 249 2 k49, k50"}]
["Иванов8","AntiMW","Kasper","k50","урл10",{"$f":"CONCATENATE(B30,\" \",COUNTIF(B:B,B30),\" \",LEN(сцепитьЕсли2(B:B,B30,D:D,\", \",1))-LEN(SUBSTITUTE(сцепитьЕсли2(B:B,B30,D:D,\"; \",1),\"k\",)),\" \",сцепитьЕсли2(B:B,B30,D:D,\", \",1))","v":"AntiMW 249 2 k49, k50"}]
["Иванов9","AntiMW","Kasper","k49","урл50",{"$f":"CONCATENATE(B31,\" \",COUNTIF(B:B,B31),\" \",LEN(сцепитьЕсли2(B:B,B31,D:D,\", \",1))-LEN(SUBSTITUTE(сцепитьЕсли2(B:B,B31,D:D,\"; \",1),\"k\",)),\" \",сцепитьЕсли2(B:B,B31,D:D,\", \",1))","v":"AntiMW 249 2 k49, k50"}]
["Иванов10","win11","Microsoft","k11","урл1",{"$f":"CONCATENATE(B32,\" \",COUNTIF(B:B,B32),\" \",LEN(сцепитьЕсли2(B:B,B32,D:D,\", \",1))-LEN(SUBSTITUTE(сцепитьЕсли2(B:B,B32,D:D,\"; \",1),\"k\",)),\" \",сцепитьЕсли2(B:B,B32,D:D,\", \",1))","v":"win11 168 2 k11, k12"}]
["Иванов11","win11","Microsoft","k12","урл2",{"$f":"CONCATENATE(B33,\" \",COUNTIF(B:B,B33),\" \",LEN(сцепитьЕсли2(B:B,B33,D:D,\", \",1))-LEN(SUBSTITUTE(сцепитьЕсли2(B:B,B33,D:D,\"; \",1),\"k\",)),\" \",сцепитьЕсли2(B:B,B33,D:D,\", \",1))","v":"win11 168 2 k11, k12"}]
["Иванов12","win10","Microsoft","k13","урл1",{"$f":"CONCATENATE(B34,\" \",COUNTIF(B:B,B34),\" \",LEN(сцепитьЕсли2(B:B,B34,D:D,\", \",1))-LEN(SUBSTITUTE(сцепитьЕсли2(B:B,B34,D:D,\"; \",1),\"k\",)),\" \",сцепитьЕсли2(B:B,B34,D:D,\", \",1))","v":"win10 82 1 k13"}]
["Иванов13","AntiMW","Kasper","k49","урл10",{"$f":"CONCATENATE(B35,\" \",COUNTIF(B:B,B35),\" \",LEN(сцепитьЕсли2(B:B,B35,D:D,\", \",1))-LEN(SUBSTITUTE(сцепитьЕсли2(B:B,B35,D:D,\"; \",1),\"k\",)),\" \",сцепитьЕсли2(B:B,B35,D:D,\", \",1))","v":"AntiMW 249 2 k49, k50"}]
["Иванов14","AntiMW","Kasper","k50","урл10",{"$f":"CONCATENATE(B36,\" \",COUNTIF(B:B,B36),\" \",LEN(сцепитьЕсли2(B:B,B36,D:D,\", \",1))-LEN(SUBSTITUTE(сцепитьЕсли2(B:B,B36,D:D,\"; \",1),\"k\",)),\" \",сцепитьЕсли2(B:B,B36,D:D,\", \",1))","v":"AntiMW 249 2 k49, k50"}]
["Иванов15","AntiMW","Kasper","k49","урл50",{"$f":"CONCATENATE(B37,\" \",COUNTIF(B:B,B37),\" \",LEN(сцепитьЕсли2(B:B,B37,D:D,\", \",1))-LEN(SUBSTITUTE(сцепитьЕсли2(B:B,B37,D:D,\"; \",1),\"k\",)),\" \",сцепитьЕсли2(B:B,B37,D:D,\", \",1))","v":"AntiMW 249 2 k49, k50"}]
["Иванов16","win11","Microsoft","k11","урл1",{"$f":"CONCATENATE(B38,\" \",COUNTIF(B:B,B38),\" \",LEN(сцепитьЕсли2(B:B,B38,D:D,\", \",1))-LEN(SUBSTITUTE(сцепитьЕсли2(B:B,B38,D:D,\"; \",1),\"k\",)),\" \",сцепитьЕсли2(B:B,B38,D:D,\", \",1))","v":"win11 168 2 k11, k12"}]
["Иванов17","win11","Microsoft","k12","урл2",{"$f":"CONCATENATE(B39,\" \",COUNTIF(B:B,B39),\" \",LEN(сцепитьЕсли2(B:B,B39,D:D,\", \",1))-LEN(SUBSTITUTE(сцепитьЕсли2(B:B,B39,D:D,\"; \",1),\"k\",)),\" \",сцепитьЕсли2(B:B,B39,D:D,\", \",1))","v":"win11 168 2 k11, k12"}]
["Иванов18","win10","Microsoft","k13","урл1",{"$f":"CONCATENATE(B40,\" \",COUNTIF(B:B,B40),\" \",LEN(сцепитьЕсли2(B:B,B40,D:D,\", \",1))-LEN(SUBSTITUTE(сцепитьЕсли2(B:B,B40,D:D,\"; \",1),\"k\",)),\" \",сцепитьЕсли2(B:B,B40,D:D,\", \",1))","v":"win10 82 1 k13"}]
["Иванов19","AntiMW","Kasper","k49","урл10",{"$f":"CONCATENATE(B41,\" \",COUNTIF(B:B,B41),\" \",LEN(сцепитьЕсли2(B:B,B41,D:D,\", \",1))-LEN(SUBSTITUTE(сцепитьЕсли2(B:B,B41,D:D,\"; \",1),\"k\",)),\" \",сцепитьЕсли2(B:B,B41,D:D,\", \",1))","v":"AntiMW 249 2 k49, k50"}]
["Иванов20","AntiMW","Kasper","k50","урл10",{"$f":"CONCATENATE(B42,\" \",COUNTIF(B:B,B42),\" \",LEN(сцепитьЕсли2(B:B,B42,D:D,\", \",1))-LEN(SUBSTITUTE(сцепитьЕсли2(B:B,B42,D:D,\"; \",1),\"k\",)),\" \",сцепитьЕсли2(B:B,B42,D:D,\", \",1))","v":"AntiMW 249 2 k49, k50"}]
["Иванов21","AntiMW","Kasper","k49","урл50",{"$f":"CONCATENATE(B43,\" \",COUNTIF(B:B,B43),\" \",LEN(сцепитьЕсли2(B:B,B43,D:D,\", \",1))-LEN(SUBSTITUTE(сцепитьЕсли2(B:B,B43,D:D,\"; \",1),\"k\",)),\" \",сцепитьЕсли2(B:B,B43,D:D,\", \",1))","v":"AntiMW 249 2 k49, k50"}]
["Иванов","win11","Microsoft","k11","урл1",{"$f":"CONCATENATE(B44,\" \",COUNTIF(B:B,B44),\" \",LEN(сцепитьЕсли2(B:B,B44,D:D,\", \",1))-LEN(SUBSTITUTE(сцепитьЕсли2(B:B,B44,D:D,\"; \",1),\"k\",)),\" \",сцепитьЕсли2(B:B,B44,D:D,\", \",1))","v":"win11 168 2 k11, k12"}]
["Петров","win11","Microsoft","k12","урл2",{"$f":"CONCATENATE(B45,\" \",COUNTIF(B:B,B45),\" \",LEN(сцепитьЕсли2(B:B,B45,D:D,\", \",1))-LEN(SUBSTITUTE(сцепитьЕсли2(B:B,B45,D:D,\"; \",1),\"k\",)),\" \",сцепитьЕсли2(B:B,B45,D:D,\", \",1))","v":"win11 168 2 k11, k12"}]
["Петров","win10","Microsoft","k13","урл1",{"$f":"CONCATENATE(B46,\" \",COUNTIF(B:B,B46),\" \",LEN(сцепитьЕсли2(B:B,B46,D:D,\", \",1))-LEN(SUBSTITUTE(сцепитьЕсли2(B:B,B46,D:D,\"; \",1),\"k\",)),\" \",сцепитьЕсли2(B:B,B46,D:D,\", \",1))","v":"win10 82 1 k13"}]
["Сидоров","AntiMW","Kasper","k49","урл10",{"$f":"CONCATENATE(B47,\" \",COUNTIF(B:B,B47),\" \",LEN(сцепитьЕсли2(B:B,B47,D:D,\", \",1))-LEN(SUBSTITUTE(сцепитьЕсли2(B:B,B47,D:D,\"; \",1),\"k\",)),\" \",сцепитьЕсли2(B:B,B47,D:D,\", \",1))","v":"AntiMW 249 2 k49, k50"}]
["Котов","AntiMW","Kasper","k50","урл10",{"$f":"CONCATENATE(B48,\" \",COUNTIF(B:B,B48),\" \",LEN(сцепитьЕсли2(B:B,B48,D:D,\", \",1))-LEN(SUBSTITUTE(сцепитьЕсли2(B:B,B48,D:D,\"; \",1),\"k\",)),\" \",сцепитьЕсли2(B:B,B48,D:D,\", \",1))","v":"AntiMW 249 2 k49, k50"}]
["Петров","AntiMW","Kasper","k49","урл50",{"$f":"CONCATENATE(B49,\" \",COUNTIF(B:B,B49),\" \",LEN(сцепитьЕсли2(B:B,B49,D:D,\", \",1))-LEN(SUBSTITUTE(сцепитьЕсли2(B:B,B49,D:D,\"; \",1),\"k\",)),\" \",сцепитьЕсли2(B:B,B49,D:D,\", \",1))","v":"AntiMW 249 2 k49, k50"}]
["Иванов","win11","Microsoft","k11","урл1",{"$f":"CONCATENATE(B50,\" \",COUNTIF(B:B,B50),\" \",LEN(сцепитьЕсли2(B:B,B50,D:D,\", \",1))-LEN(SUBSTITUTE(сцепитьЕсли2(B:B,B50,D:D,\"; \",1),\"k\",)),\" \",сцепитьЕсли2(B:B,B50,D:D,\", \",1))","v":"win11 168 2 k11, k12"}]
["Петров","win11","Microsoft","k12","урл2",{"$f":"CONCATENATE(B51,\" \",COUNTIF(B:B,B51),\" \",LEN(сцепитьЕсли2(B:B,B51,D:D,\", \",1))-LEN(SUBSTITUTE(сцепитьЕсли2(B:B,B51,D:D,\"; \",1),\"k\",)),\" \",сцепитьЕсли2(B:B,B51,D:D,\", \",1))","v":"win11 168 2 k11, k12"}]
["Петров","win10","Microsoft","k13","урл1",{"$f":"CONCATENATE(B52,\" \",COUNTIF(B:B,B52),\" \",LEN(сцепитьЕсли2(B:B,B52,D:D,\", \",1))-LEN(SUBSTITUTE(сцепитьЕсли2(B:B,B52,D:D,\"; \",1),\"k\",)),\" \",сцепитьЕсли2(B:B,B52,D:D,\", \",1))","v":"win10 82 1 k13"}]
["Сидоров","AntiMW","Kasper","k49","урл10",{"$f":"CONCATENATE(B53,\" \",COUNTIF(B:B,B53),\" \",LEN(сцепитьЕсли2(B:B,B53,D:D,\", \",1))-LEN(SUBSTITUTE(сцепитьЕсли2(B:B,B53,D:D,\"; \",1),\"k\",)),\" \",сцепитьЕсли2(B:B,B53,D:D,\", \",1))","v":"AntiMW 249 2 k49, k50"}]
["Котов","AntiMW","Kasper","k50","урл10",{"$f":"CONCATENATE(B54,\" \",COUNTIF(B:B,B54),\" \",LEN(сцепитьЕсли2(B:B,B54,D:D,\", \",1))-LEN(SUBSTITUTE(сцепитьЕсли2(B:B,B54,D:D,\"; \",1),\"k\",)),\" \",сцепитьЕсли2(B:B,B54,D:D,\", \",1))","v":"AntiMW 249 2 k49, k50"}]
["Петров","AntiMW","Kasper","k49","урл50",{"$f":"CONCATENATE(B55,\" \",COUNTIF(B:B,B55),\" \",LEN(сцепитьЕсли2(B:B,B55,D:D,\", \",1))-LEN(SUBSTITUTE(сцепитьЕсли2(B:B,B55,D:D,\"; \",1),\"k\",)),\" \",сцепитьЕсли2(B:B,B55,D:D,\", \",1))","v":"AntiMW 249 2 k49, k50"}]
["Иванов","win11","Microsoft","k11","урл1",{"$f":"CONCATENATE(B56,\" \",COUNTIF(B:B,B56),\" \",LEN(сцепитьЕсли2(B:B,B56,D:D,\", \",1))-LEN(SUBSTITUTE(сцепитьЕсли2(B:B,B56,D:D,\"; \",1),\"k\",)),\" \",сцепитьЕсли2(B:B,B56,D:D,\", \",1))","v":"win11 168 2 k11, k12"}]
["Петров","win11","Microsoft","k12","урл2",{"$f":"CONCATENATE(B57,\" \",COUNTIF(B:B,B57),\" \",LEN(сцепитьЕсли2(B:B,B57,D:D,\", \",1))-LEN(SUBSTITUTE(сцепитьЕсли2(B:B,B57,D:D,\"; \",1),\"k\",)),\" \",сцепитьЕсли2(B:B,B57,D:D,\", \",1))","v":"win11 168 2 k11, k12"}]
["Петров","win10","Microsoft","k13","урл1",{"$f":"CONCATENATE(B58,\" \",COUNTIF(B:B,B58),\" \",LEN(сцепитьЕсли2(B:B,B58,D:D,\", \",1))-LEN(SUBSTITUTE(сцепитьЕсли2(B:B,B58,D:D,\"; \",1),\"k\",)),\" \",сцепитьЕсли2(B:B,B58,D:D,\", \",1))","v":"win10 82 1 k13"}]
["Сидоров","AntiMW","Kasper","k49","урл10",{"$f":"CONCATENATE(B59,\" \",COUNTIF(B:B,B59),\" \",LEN(сцепитьЕсли2(B:B,B59,D:D,\", \",1))-LEN(SUBSTITUTE(сцепитьЕсли2(B:B,B59,D:D,\"; \",1),\"k\",)),\" \",сцепитьЕсли2(B:B,B59,D:D,\", \",1))","v":"AntiMW 249 2 k49, k50"}]
["Котов","AntiMW","Kasper","k50","урл10",{"$f":"CONCATENATE(B60,\" \",COUNTIF(B:B,B60),\" \",LEN(сцепитьЕсли2(B:B,B60,D:D,\", \",1))-LEN(SUBSTITUTE(сцепитьЕсли2(B:B,B60,D:D,\"; \",1),\"k\",)),\" \",сцепитьЕсли2(B:B,B60,D:D,\", \",1))","v":"AntiMW 249 2 k49, k50"}]
["Петров","AntiMW","Kasper","k49","урл50",{"$f":"CONCATENATE(B61,\" \",COUNTIF(B:B,B61),\" \",LEN(сцепитьЕсли2(B:B,B61,D:D,\", \",1))-LEN(SUBSTITUTE(сцепитьЕсли2(B:B,B61,D:D,\"; \",1),\"k\",)),\" \",сцепитьЕсли2(B:B,B61,D:D,\", \",1))","v":"AntiMW 249 2 k49, k50"}]
["Иванов","win11","Microsoft","k11","урл1",{"$f":"CONCATENATE(B62,\" \",COUNTIF(B:B,B62),\" \",LEN(сцепитьЕсли2(B:B,B62,D:D,\", \",1))-LEN(SUBSTITUTE(сцепитьЕсли2(B:B,B62,D:D,\"; \",1),\"k\",)),\" \",сцепитьЕсли2(B:B,B62,D:D,\", \",1))","v":"win11 168 2 k11, k12"}]
["Петров","win11","Microsoft","k12","урл2",{"$f":"CONCATENATE(B63,\" \",COUNTIF(B:B,B63),\" \",LEN(сцепитьЕсли2(B:B,B63,D:D,\", \",1))-LEN(SUBSTITUTE(сцепитьЕсли2(B:B,B63,D:D,\"; \",1),\"k\",)),\" \",сцепитьЕсли2(B:B,B63,D:D,\", \",1))","v":"win11 168 2 k11, k12"}]
["Петров","win10","Microsoft","k13","урл1",{"$f":"CONCATENATE(B64,\" \",COUNTIF(B:B,B64),\" \",LEN(сцепитьЕсли2(B:B,B64,D:D,\", \",1))-LEN(SUBSTITUTE(сцепитьЕсли2(B:B,B64,D:D,\"; \",1),\"k\",)),\" \",сцепитьЕсли2(B:B,B64,D:D,\", \",1))","v":"win10 82 1 k13"}]
["Сидоров","AntiMW","Kasper","k49","урл10",{"$f":"CONCATENATE(B65,\" \",COUNTIF(B:B,B65),\" \",LEN(сцепитьЕсли2(B:B,B65,D:D,\", \",1))-LEN(SUBSTITUTE(сцепитьЕсли2(B:B,B65,D:D,\"; \",1),\"k\",)),\" \",сцепитьЕсли2(B:B,B65,D:D,\", \",1))","v":"AntiMW 249 2 k49, k50"}]
["Котов","AntiMW","Kasper","k50","урл10",{"$f":"CONCATENATE(B66,\" \",COUNTIF(B:B,B66),\" \",LEN(сцепитьЕсли2(B:B,B66,D:D,\", \",1))-LEN(SUBSTITUTE(сцепитьЕсли2(B:B,B66,D:D,\"; \",1),\"k\",)),\" \",сцепитьЕсли2(B:B,B66,D:D,\", \",1))","v":"AntiMW 249 2 k49, k50"}]
["Петров","AntiMW","Kasper","k49","урл50",{"$f":"CONCATENATE(B67,\" \",COUNTIF(B:B,B67),\" \",LEN(сцепитьЕсли2(B:B,B67,D:D,\", \",1))-LEN(SUBSTITUTE(сцепитьЕсли2(B:B,B67,D:D,\"; \",1),\"k\",)),\" \",сцепитьЕсли2(B:B,B67,D:D,\", \",1))","v":"AntiMW 249 2 k49, k50"}]
["Иванов","win11","Microsoft","k11","урл1",{"$f":"CONCATENATE(B68,\" \",COUNTIF(B:B,B68),\" \",LEN(сцепитьЕсли2(B:B,B68,D:D,\", \",1))-LEN(SUBSTITUTE(сцепитьЕсли2(B:B,B68,D:D,\"; \",1),\"k\",)),\" \",сцепитьЕсли2(B:B,B68,D:D,\", \",1))","v":"win11 168 2 k11, k12"}]
["Петров","win11","Microsoft","k12","урл2",{"$f":"CONCATENATE(B69,\" \",COUNTIF(B:B,B69),\" \",LEN(сцепитьЕсли2(B:B,B69,D:D,\", \",1))-LEN(SUBSTITUTE(сцепитьЕсли2(B:B,B69,D:D,\"; \",1),\"k\",)),\" \",сцепитьЕсли2(B:B,B69,D:D,\", \",1))","v":"win11 168 2 k11, k12"}]
["Петров","win10","Microsoft","k13","урл1",{"$f":"CONCATENATE(B70,\" \",COUNTIF(B:B,B70),\" \",LEN(сцепитьЕсли2(B:B,B70,D:D,\", \",1))-LEN(SUBSTITUTE(сцепитьЕсли2(B:B,B70,D:D,\"; \",1),\"k\",)),\" \",сцепитьЕсли2(B:B,B70,D:D,\", \",1))","v":"win10 82 1 k13"}]
["Сидоров","AntiMW","Kasper","k49","урл10",{"$f":"CONCATENATE(B71,\" \",COUNTIF(B:B,B71),\" \",LEN(сцепитьЕсли2(B:B,B71,D:D,\", \",1))-LEN(SUBSTITUTE(сцепитьЕсли2(B:B,B71,D:D,\"; \",1),\"k\",)),\" \",сцепитьЕсли2(B:B,B71,D:D,\", \",1))","v":"AntiMW 249 2 k49, k50"}]
["Котов","AntiMW","Kasper","k50","урл10",{"$f":"CONCATENATE(B72,\" \",COUNTIF(B:B,B72),\" \",LEN(сцепитьЕсли2(B:B,B72,D:D,\", \",1))-LEN(SUBSTITUTE(сцепитьЕсли2(B:B,B72,D:D,\"; \",1),\"k\",)),\" \",сцепитьЕсли2(B:B,B72,D:D,\", \",1))","v":"AntiMW 249 2 k49, k50"}]
["Петров","AntiMW","Kasper","k49","урл50",{"$f":"CONCATENATE(B73,\" \",COUNTIF(B:B,B73),\" \",LEN(сцепитьЕсли2(B:B,B73,D:D,\", \",1))-LEN(SUBSTITUTE(сцепитьЕсли2(B:B,B73,D:D,\"; \",1),\"k\",)),\" \",сцепитьЕсли2(B:B,B73,D:D,\", \",1))","v":"AntiMW 249 2 k49, k50"}]
["Иванов","win11","Microsoft","k11","урл1",{"$f":"CONCATENATE(B74,\" \",COUNTIF(B:B,B74),\" \",LEN(сцепитьЕсли2(B:B,B74,D:D,\", \",1))-LEN(SUBSTITUTE(сцепитьЕсли2(B:B,B74,D:D,\"; \",1),\"k\",)),\" \",сцепитьЕсли2(B:B,B74,D:D,\", \",1))","v":"win11 168 2 k11, k12"}]
["Петров","win11","Microsoft","k12","урл2",{"$f":"CONCATENATE(B75,\" \",COUNTIF(B:B,B75),\" \",LEN(сцепитьЕсли2(B:B,B75,D:D,\", \",1))-LEN(SUBSTITUTE(сцепитьЕсли2(B:B,B75,D:D,\"; \",1),\"k\",)),\" \",сцепитьЕсли2(B:B,B75,D:D,\", \",1))","v":"win11 168 2 k11, k12"}]
["Петров","win10","Microsoft","k13","урл1",{"$f":"CONCATENATE(B76,\" \",COUNTIF(B:B,B76),\" \",LEN(сцепитьЕсли2(B:B,B76,D:D,\", \",1))-LEN(SUBSTITUTE(сцепитьЕсли2(B:B,B76,D:D,\"; \",1),\"k\",)),\" \",сцепитьЕсли2(B:B,B76,D:D,\", \",1))","v":"win10 82 1 k13"}]
["Сидоров","AntiMW","Kasper","k49","урл10",{"$f":"CONCATENATE(B77,\" \",COUNTIF(B:B,B77),\" \",LEN(сцепитьЕсли2(B:B,B77,D:D,\", \",1))-LEN(SUBSTITUTE(сцепитьЕсли2(B:B,B77,D:D,\"; \",1),\"k\",)),\" \",сцепитьЕсли2(B:B,B77,D:D,\", \",1))","v":"AntiMW 249 2 k49, k50"}]
["Котов","AntiMW","Kasper","k50","урл10",{"$f":"CONCATENATE(B78,\" \",COUNTIF(B:B,B78),\" \",LEN(сцепитьЕсли2(B:B,B78,D:D,\", \",1))-LEN(SUBSTITUTE(сцепитьЕсли2(B:B,B78,D:D,\"; \",1),\"k\",)),\" \",сцепитьЕсли2(B:B,B78,D:D,\", \",1))","v":"AntiMW 249 2 k49, k50"}]
["Петров","AntiMW","Kasper","k49","урл50",{"$f":"CONCATENATE(B79,\" \",COUNTIF(B:B,B79),\" \",LEN(сцепитьЕсли2(B:B,B79,D:D,\", \",1))-LEN(SUBSTITUTE(сцепитьЕсли2(B:B,B79,D:D,\"; \",1),\"k\",)),\" \",сцепитьЕсли2(B:B,B79,D:D,\", \",1))","v":"AntiMW 249 2 k49, k50"}]
["Иванов","win11","Microsoft","k11","урл1",{"$f":"CONCATENATE(B80,\" \",COUNTIF(B:B,B80),\" \",LEN(сцепитьЕсли2(B:B,B80,D:D,\", \",1))-LEN(SUBSTITUTE(сцепитьЕсли2(B:B,B80,D:D,\"; \",1),\"k\",)),\" \",сцепитьЕсли2(B:B,B80,D:D,\", \",1))","v":"win11 168 2 k11, k12"}]
["Петров","win11","Microsoft","k12","урл2",{"$f":"CONCATENATE(B81,\" \",COUNTIF(B:B,B81),\" \",LEN(сцепитьЕсли2(B:B,B81,D:D,\", \",1))-LEN(SUBSTITUTE(сцепитьЕсли2(B:B,B81,D:D,\"; \",1),\"k\",)),\" \",сцепитьЕсли2(B:B,B81,D:D,\", \",1))","v":"win11 168 2 k11, k12"}]
["Петров","win10","Microsoft","k13","урл1",{"$f":"CONCATENATE(B82,\" \",COUNTIF(B:B,B82),\" \",LEN(сцепитьЕсли2(B:B,B82,D:D,\", \",1))-LEN(SUBSTITUTE(сцепитьЕсли2(B:B,B82,D:D,\"; \",1),\"k\",)),\" \",сцепитьЕсли2(B:B,B82,D:D,\", \",1))","v":"win10 82 1 k13"}]
["Сидоров","AntiMW","Kasper","k49","урл10",{"$f":"CONCATENATE(B83,\" \",COUNTIF(B:B,B83),\" \",LEN(сцепитьЕсли2(B:B,B83,D:D,\", \",1))-LEN(SUBSTITUTE(сцепитьЕсли2(B:B,B83,D:D,\"; \",1),\"k\",)),\" \",сцепитьЕсли2(B:B,B83,D:D,\", \",1))","v":"AntiMW 249 2 k49, k50"}]
["Котов","AntiMW","Kasper","k50","урл10",{"$f":"CONCATENATE(B84,\" \",COUNTIF(B:B,B84),\" \",LEN(сцепитьЕсли2(B:B,B84,D:D,\", \",1))-LEN(SUBSTITUTE(сцепитьЕсли2(B:B,B84,D:D,\"; \",1),\"k\",)),\" \",сцепитьЕсли2(B:B,B84,D:D,\", \",1))","v":"AntiMW 249 2 k49, k50"}]
["Петров","AntiMW","Kasper","k49","урл50",{"$f":"CONCATENATE(B85,\" \",COUNTIF(B:B,B85),\" \",LEN(сцепитьЕсли2(B:B,B85,D:D,\", \",1))-LEN(SUBSTITUTE(сцепитьЕсли2(B:B,B85,D:D,\"; \",1),\"k\",)),\" \",сцепитьЕсли2(B:B,B85,D:D,\", \",1))","v":"AntiMW 249 2 k49, k50"}]
["Иванов","win11","Microsoft","k11","урл1",{"$f":"CONCATENATE(B86,\" \",COUNTIF(B:B,B86),\" \",LEN(сцепитьЕсли2(B:B,B86,D:D,\", \",1))-LEN(SUBSTITUTE(сцепитьЕсли2(B:B,B86,D:D,\"; \",1),\"k\",)),\" \",сцепитьЕсли2(B:B,B86,D:D,\", \",1))","v":"win11 168 2 k11, k12"}]
["Петров","win11","Microsoft","k12","урл2",{"$f":"CONCATENATE(B87,\" \",COUNTIF(B:B,B87),\" \",LEN(сцепитьЕсли2(B:B,B87,D:D,\", \",1))-LEN(SUBSTITUTE(сцепитьЕсли2(B:B,B87,D:D,\"; \",1),\"k\",)),\" \",сцепитьЕсли2(B:B,B87,D:D,\", \",1))","v":"win11 168 2 k11, k12"}]
["Петров","win10","Microsoft","k13","урл1",{"$f":"CONCATENATE(B88,\" \",COUNTIF(B:B,B88),\" \",LEN(сцепитьЕсли2(B:B,B88,D:D,\", \",1))-LEN(SUBSTITUTE(сцепитьЕсли2(B:B,B88,D:D,\"; \",1),\"k\",)),\" \",сцепитьЕсли2(B:B,B88,D:D,\", \",1))","v":"win10 82 1 k13"}]
["Сидоров","AntiMW","Kasper","k49","урл10",{"$f":"CONCATENATE(B89,\" \",COUNTIF(B:B,B89),\" \",LEN(сцепитьЕсли2(B:B,B89,D:D,\", \",1))-LEN(SUBSTITUTE(сцепитьЕсли2(B:B,B89,D:D,\"; \",1),\"k\",)),\" \",сцепитьЕсли2(B:B,B89,D:D,\", \",1))","v":"AntiMW 249 2 k49, k50"}]
["Котов","AntiMW","Kasper","k50","урл10",{"$f":"CONCATENATE(B90,\" \",COUNTIF(B:B,B90),\" \",LEN(сцепитьЕсли2(B:B,B90,D:D,\", \",1))-LEN(SUBSTITUTE(сцепитьЕсли2(B:B,B90,D:D,\"; \",1),\"k\",)),\" \",сцепитьЕсли2(B:B,B90,D:D,\", \",1))","v":"AntiMW 249 2 k49, k50"}]
["Петров","AntiMW","Kasper","k49","урл50",{"$f":"CONCATENATE(B91,\" \",COUNTIF(B:B,B91),\" \",LEN(сцепитьЕсли2(B:B,B91,D:D,\", \",1))-LEN(SUBSTITUTE(сцепитьЕсли2(B:B,B91,D:D,\"; \",1),\"k\",)),\" \",сцепитьЕсли2(B:B,B91,D:D,\", \",1))","v":"AntiMW 249 2 k49, k50"}]
["Иванов","win11","Microsoft","k11","урл1",{"$f":"CONCATENATE(B92,\" \",COUNTIF(B:B,B92),\" \",LEN(сцепитьЕсли2(B:B,B92,D:D,\", \",1))-LEN(SUBSTITUTE(сцепитьЕсли2(B:B,B92,D:D,\"; \",1),\"k\",)),\" \",сцепитьЕсли2(B:B,B92,D:D,\", \",1))","v":"win11 168 2 k11, k12"}]
["Петров","win11","Microsoft","k12","урл2",{"$f":"CONCATENATE(B93,\" \",COUNTIF(B:B,B93),\" \",LEN(сцепитьЕсли2(B:B,B93,D:D,\", \",1))-LEN(SUBSTITUTE(сцепитьЕсли2(B:B,B93,D:D,\"; \",1),\"k\",)),\" \",сцепитьЕсли2(B:B,B93,D:D,\", \",1))","v":"win11 168 2 k11, k12"}]
["Петров","win10","Microsoft","k13","урл1",{"$f":"CONCATENATE(B94,\" \",COUNTIF(B:B,B94),\" \",LEN(сцепитьЕсли2(B:B,B94,D:D,\", \",1))-LEN(SUBSTITUTE(сцепитьЕсли2(B:B,B94,D:D,\"; \",1),\"k\",)),\" \",сцепитьЕсли2(B:B,B94,D:D,\", \",1))","v":"win10 82 1 k13"}]
["Сидоров","AntiMW","Kasper","k49","урл10",{"$f":"CONCATENATE(B95,\" \",COUNTIF(B:B,B95),\" \",LEN(сцепитьЕсли2(B:B,B95,D:D,\", \",1))-LEN(SUBSTITUTE(сцепитьЕсли2(B:B,B95,D:D,\"; \",1),\"k\",)),\" \",сцепитьЕсли2(B:B,B95,D:D,\", \",1))","v":"AntiMW 249 2 k49, k50"}]
["Котов","AntiMW","Kasper","k50","урл10",{"$f":"CONCATENATE(B96,\" \",COUNTIF(B:B,B96),\" \",LEN(сцепитьЕсли2(B:B,B96,D:D,\", \",1))-LEN(SUBSTITUTE(сцепитьЕсли2(B:B,B96,D:D,\"; \",1),\"k\",)),\" \",сцепитьЕсли2(B:B,B96,D:D,\", \",1))","v":"AntiMW 249 2 k49, k50"}]
["Петров","AntiMW","Kasper","k49","урл50",{"$f":"CONCATENATE(B97,\" \",COUNTIF(B:B,B97),\" \",LEN(сцепитьЕсли2(B:B,B97,D:D,\", \",1))-LEN(SUBSTITUTE(сцепитьЕсли2(B:B,B97,D:D,\"; \",1),\"k\",)),\" \",сцепитьЕсли2(B:B,B97,D:D,\", \",1))","v":"AntiMW 249 2 k49, k50"}]
["Иванов","win11","Microsoft","k11","урл1",{"$f":"CONCATENATE(B98,\" \",COUNTIF(B:B,B98),\" \",LEN(сцепитьЕсли2(B:B,B98,D:D,\", \",1))-LEN(SUBSTITUTE(сцепитьЕсли2(B:B,B98,D:D,\"; \",1),\"k\",)),\" \",сцепитьЕсли2(B:B,B98,D:D,\", \",1))","v":"win11 168 2 k11, k12"}]
["Петров","win11","Microsoft","k12","урл2",{"$f":"CONCATENATE(B99,\" \",COUNTIF(B:B,B99),\" \",LEN(сцепитьЕсли2(B:B,B99,D:D,\", \",1))-LEN(SUBSTITUTE(сцепитьЕсли2(B:B,B99,D:D,\"; \",1),\"k\",)),\" \",сцепитьЕсли2(B:B,B99,D:D,\", \",1))","v":"win11 168 2 k11, k12"}]
["Петров","win10","Microsoft","k13","урл1",{"$f":"CONCATENATE(B100,\" \",COUNTIF(B:B,B100),\" \",LEN(сцепитьЕсли2(B:B,B100,D:D,\", \",1))-LEN(SUBSTITUTE(сцепитьЕсли2(B:B,B100,D:D,\"; \",1),\"k\",)),\" \",сцепитьЕсли2(B:B,B100,D:D,\", \",1))","v":"win10 82 1 k13"}]
["Сидоров","AntiMW","Kasper","k49","урл10",{"$f":"CONCATENATE(B101,\" \",COUNTIF(B:B,B101),\" \",LEN(сцепитьЕсли2(B:B,B101,D:D,\", \",1))-LEN(SUBSTITUTE(сцепитьЕсли2(B:B,B101,D:D,\"; \",1),\"k\",)),\" \",сцепитьЕсли2(B:B,B101,D:D,\", \",1))","v":"AntiMW 249 2 k49, k50"}]
["Котов","AntiMW","Kasper","k50","урл10",{"$f":"CONCATENATE(B102,\" \",COUNTIF(B:B,B102),\" \",LEN(сцепитьЕсли2(B:B,B102,D:D,\", \",1))-LEN(SUBSTITUTE(сцепитьЕсли2(B:B,B102,D:D,\"; \",1),\"k\",)),\" \",сцепитьЕсли2(B:B,B102,D:D,\", \",1))","v":"AntiMW 249 2 k49, k50"}]
["Петров","AntiMW","Kasper","k49","урл50",{"$f":"CONCATENATE(B103,\" \",COUNTIF(B:B,B103),\" \",LEN(сцепитьЕсли2(B:B,B103,D:D,\", \",1))-LEN(SUBSTITUTE(сцепитьЕсли2(B:B,B103,D:D,\"; \",1),\"k\",)),\" \",сцепитьЕсли2(B:B,B103,D:D,\", \",1))","v":"AntiMW 249 2 k49, k50"}]
["Иванов","win11","Microsoft","k11","урл1",{"$f":"CONCATENATE(B104,\" \",COUNTIF(B:B,B104),\" \",LEN(сцепитьЕсли2(B:B,B104,D:D,\", \",1))-LEN(SUBSTITUTE(сцепитьЕсли2(B:B,B104,D:D,\"; \",1),\"k\",)),\" \",сцепитьЕсли2(B:B,B104,D:D,\", \",1))","v":"win11 168 2 k11, k12"}]
["Петров","win11","Microsoft","k12","урл2",{"$f":"CONCATENATE(B105,\" \",COUNTIF(B:B,B105),\" \",LEN(сцепитьЕсли2(B:B,B105,D:D,\", \",1))-LEN(SUBSTITUTE(сцепитьЕсли2(B:B,B105,D:D,\"; \",1),\"k\",)),\" \",сцепитьЕсли2(B:B,B105,D:D,\", \",1))","v":"win11 168 2 k11, k12"}]
["Петров","win10","Microsoft","k13","урл1",{"$f":"CONCATENATE(B106,\" \",COUNTIF(B:B,B106),\" \",LEN(сцепитьЕсли2(B:B,B106,D:D,\", \",1))-LEN(SUBSTITUTE(сцепитьЕсли2(B:B,B106,D:D,\"; \",1),\"k\",)),\" \",сцепитьЕсли2(B:B,B106,D:D,\", \",1))","v":"win10 82 1 k13"}]
["Сидоров","AntiMW","Kasper","k49","урл10",{"$f":"CONCATENATE(B107,\" \",COUNTIF(B:B,B107),\" \",LEN(сцепитьЕсли2(B:B,B107,D:D,\", \",1))-LEN(SUBSTITUTE(сцепитьЕсли2(B:B,B107,D:D,\"; \",1),\"k\",)),\" \",сцепитьЕсли2(B:B,B107,D:D,\", \",1))","v":"AntiMW 249 2 k49, k50"}]
["Котов","AntiMW","Kasper","k50","урл10",{"$f":"CONCATENATE(B108,\" \",COUNTIF(B:B,B108),\" \",LEN(сцепитьЕсли2(B:B,B108,D:D,\", \",1))-LEN(SUBSTITUTE(сцепитьЕсли2(B:B,B108,D:D,\"; \",1),\"k\",)),\" \",сцепитьЕсли2(B:B,B108,D:D,\", \",1))","v":"AntiMW 249 2 k49, k50"}]
["Петров","AntiMW","Kasper","k49","урл50",{"$f":"CONCATENATE(B109,\" \",COUNTIF(B:B,B109),\" \",LEN(сцепитьЕсли2(B:B,B109,D:D,\", \",1))-LEN(SUBSTITUTE(сцепитьЕсли2(B:B,B109,D:D,\"; \",1),\"k\",)),\" \",сцепитьЕсли2(B:B,B109,D:D,\", \",1))","v":"AntiMW 249 2 k49, k50"}]
["Иванов","win11","Microsoft","k11","урл1",{"$f":"CONCATENATE(B110,\" \",COUNTIF(B:B,B110),\" \",LEN(сцепитьЕсли2(B:B,B110,D:D,\", \",1))-LEN(SUBSTITUTE(сцепитьЕсли2(B:B,B110,D:D,\"; \",1),\"k\",)),\" \",сцепитьЕсли2(B:B,B110,D:D,\", \",1))","v":"win11 168 2 k11, k12"}]
["Петров","win11","Microsoft","k12","урл2",{"$f":"CONCATENATE(B111,\" \",COUNTIF(B:B,B111),\" \",LEN(сцепитьЕсли2(B:B,B111,D:D,\", \",1))-LEN(SUBSTITUTE(сцепитьЕсли2(B:B,B111,D:D,\"; \",1),\"k\",)),\" \",сцепитьЕсли2(B:B,B111,D:D,\", \",1))","v":"win11 168 2 k11, k12"}]
["Петров","win10","Microsoft","k13","урл1",{"$f":"CONCATENATE(B112,\" \",COUNTIF(B:B,B112),\" \",LEN(сцепитьЕсли2(B:B,B112,D:D,\", \",1))-LEN(SUBSTITUTE(сцепитьЕсли2(B:B,B112,D:D,\"; \",1),\"k\",)),\" \",сцепитьЕсли2(B:B,B112,D:D,\", \",1))","v":"win10 82 1 k13"}]
["Сидоров","AntiMW","Kasper","k49","урл10",{"$f":"CONCATENATE(B113,\" \",COUNTIF(B:B,B113),\" \",LEN(сцепитьЕсли2(B:B,B113,D:D,\", \",1))-LEN(SUBSTITUTE(сцепитьЕсли2(B:B,B113,D:D,\"; \",1),\"k\",)),\" \",сцепитьЕсли2(B:B,B113,D:D,\", \",1))","v":"AntiMW 249 2 k49, k50"}]
["Котов","AntiMW","Kasper","k50","урл10",{"$f":"CONCATENATE(B114,\" \",COUNTIF(B:B,B114),\" \",LEN(сцепитьЕсли2(B:B,B114,D:D,\", \",1))-LEN(SUBSTITUTE(сцепитьЕсли2(B:B,B114,D:D,\"; \",1),\"k\",)),\" \",сцепитьЕсли2(B:B,B114,D:D,\", \",1))","v":"AntiMW 249 2 k49, k50"}]
["Петров","AntiMW","Kasper","k49","урл50",{"$f":"CONCATENATE(B115,\" \",COUNTIF(B:B,B115),\" \",LEN(сцепитьЕсли2(B:B,B115,D:D,\", \",1))-LEN(SUBSTITUTE(сцепитьЕсли2(B:B,B115,D:D,\"; \",1),\"k\",)),\" \",сцепитьЕсли2(B:B,B115,D:D,\", \",1))","v":"AntiMW 249 2 k49, k50"}]
["Иванов","win11","Microsoft","k11","урл1",{"$f":"CONCATENATE(B116,\" \",COUNTIF(B:B,B116),\" \",LEN(сцепитьЕсли2(B:B,B116,D:D,\", \",1))-LEN(SUBSTITUTE(сцепитьЕсли2(B:B,B116,D:D,\"; \",1),\"k\",)),\" \",сцепитьЕсли2(B:B,B116,D:D,\", \",1))","v":"win11 168 2 k11, k12"}]
["Петров","win11","Microsoft","k12","урл2",{"$f":"CONCATENATE(B117,\" \",COUNTIF(B:B,B117),\" \",LEN(сцепитьЕсли2(B:B,B117,D:D,\", \",1))-LEN(SUBSTITUTE(сцепитьЕсли2(B:B,B117,D:D,\"; \",1),\"k\",)),\" \",сцепитьЕсли2(B:B,B117,D:D,\", \",1))","v":"win11 168 2 k11, k12"}]
["Петров","win10","Microsoft","k13","урл1",{"$f":"CONCATENATE(B118,\" \",COUNTIF(B:B,B118),\" \",LEN(сцепитьЕсли2(B:B,B118,D:D,\", \",1))-LEN(SUBSTITUTE(сцепитьЕсли2(B:B,B118,D:D,\"; \",1),\"k\",)),\" \",сцепитьЕсли2(B:B,B118,D:D,\", \",1))","v":"win10 82 1 k13"}]
["Сидоров","AntiMW","Kasper","k49","урл10",{"$f":"CONCATENATE(B119,\" \",COUNTIF(B:B,B119),\" \",LEN(сцепитьЕсли2(B:B,B119,D:D,\", \",1))-LEN(SUBSTITUTE(сцепитьЕсли2(B:B,B119,D:D,\"; \",1),\"k\",)),\" \",сцепитьЕсли2(B:B,B119,D:D,\", \",1))","v":"AntiMW 249 2 k49, k50"}]
["Котов","AntiMW","Kasper","k50","урл10",{"$f":"CONCATENATE(B120,\" \",COUNTIF(B:B,B120),\" \",LEN(сцепитьЕсли2(B:B,B120,D:D,\", \",1))-LEN(SUBSTITUTE(сцепитьЕсли2(B:B,B120,D:D,\"; \",1),\"k\",)),\" \",сцепитьЕсли2(B:B,B120,D:D,\", \",1))","v":"AntiMW 249 2 k49, k50"}]
["Петров","AntiMW","Kasper","k49","урл50",{"$f":"CONCATENATE(B121,\" \",COUNTIF(B:B,B121),\" \",LEN(сцепитьЕсли2(B:B,B121,D:D,\", \",1))-LEN(SUBSTITUTE(сцепитьЕсли2(B:B,B121,D:D,\"; \",1),\"k\",)),\" \",сцепитьЕсли2(B:B,B121,D:D,\", \",1))","v":"AntiMW 249 2 k49, k50"}]
["Иванов","win11","Microsoft","k11","урл1",{"$f":"CONCATENATE(B122,\" \",COUNTIF(B:B,B122),\" \",LEN(сцепитьЕсли2(B:B,B122,D:D,\", \",1))-LEN(SUBSTITUTE(сцепитьЕсли2(B:B,B122,D:D,\"; \",1),\"k\",)),\" \",сцепитьЕсли2(B:B,B122,D:D,\", \",1))","v":"win11 168 2 k11, k12"}]
["Петров","win11","Microsoft","k12","урл2",{"$f":"CONCATENATE(B123,\" \",COUNTIF(B:B,B123),\" \",LEN(сцепитьЕсли2(B:B,B123,D:D,\", \",1))-LEN(SUBSTITUTE(сцепитьЕсли2(B:B,B123,D:D,\"; \",1),\"k\",)),\" \",сцепитьЕсли2(B:B,B123,D:D,\", \",1))","v":"win11 168 2 k11, k12"}]
["Петров","win10","Microsoft","k13","урл1",{"$f":"CONCATENATE(B124,\" \",COUNTIF(B:B,B124),\" \",LEN(сцепитьЕсли2(B:B,B124,D:D,\", \",1))-LEN(SUBSTITUTE(сцепитьЕсли2(B:B,B124,D:D,\"; \",1),\"k\",)),\" \",сцепитьЕсли2(B:B,B124,D:D,\", \",1))","v":"win10 82 1 k13"}]
["Сидоров","AntiMW","Kasper","k49","урл10",{"$f":"CONCATENATE(B125,\" \",COUNTIF(B:B,B125),\" \",LEN(сцепитьЕсли2(B:B,B125,D:D,\", \",1))-LEN(SUBSTITUTE(сцепитьЕсли2(B:B,B125,D:D,\"; \",1),\"k\",)),\" \",сцепитьЕсли2(B:B,B125,D:D,\", \",1))","v":"AntiMW 249 2 k49, k50"}]
["Котов","AntiMW","Kasper","k50","урл10",{"$f":"CONCATENATE(B126,\" \",COUNTIF(B:B,B126),\" \",LEN(сцепитьЕсли2(B:B,B126,D:D,\", \",1))-LEN(SUBSTITUTE(сцепитьЕсли2(B:B,B126,D:D,\"; \",1),\"k\",)),\" \",сцепитьЕсли2(B:B,B126,D:D,\", \",1))","v":"AntiMW 249 2 k49, k50"}]
["Петров","AntiMW","Kasper","k49","урл50",{"$f":"CONCATENATE(B127,\" \",COUNTIF(B:B,B127),\" \",LEN(сцепитьЕсли2(B:B,B127,D:D,\", \",1))-LEN(SUBSTITUTE(сцепитьЕсли2(B:B,B127,D:D,\"; \",1),\"k\",)),\" \",сцепитьЕсли2(B:B,B127,D:D,\", \",1))","v":"AntiMW 249 2 k49, k50"}]
["Иванов","win11","Microsoft","k11","урл1",{"$f":"CONCATENATE(B128,\" \",COUNTIF(B:B,B128),\" \",LEN(сцепитьЕсли2(B:B,B128,D:D,\", \",1))-LEN(SUBSTITUTE(сцепитьЕсли2(B:B,B128,D:D,\"; \",1),\"k\",)),\" \",сцепитьЕсли2(B:B,B128,D:D,\", \",1))","v":"win11 168 2 k11, k12"}]
["Петров","win11","Microsoft","k12","урл2",{"$f":"CONCATENATE(B129,\" \",COUNTIF(B:B,B129),\" \",LEN(сцепитьЕсли2(B:B,B129,D:D,\", \",1))-LEN(SUBSTITUTE(сцепитьЕсли2(B:B,B129,D:D,\"; \",1),\"k\",)),\" \",сцепитьЕсли2(B:B,B129,D:D,\", \",1))","v":"win11 168 2 k11, k12"}]
["Петров","win10","Microsoft","k13","урл1",{"$f":"CONCATENATE(B130,\" \",COUNTIF(B:B,B130),\" \",LEN(сцепитьЕсли2(B:B,B130,D:D,\", \",1))-LEN(SUBSTITUTE(сцепитьЕсли2(B:B,B130,D:D,\"; \",1),\"k\",)),\" \",сцепитьЕсли2(B:B,B130,D:D,\", \",1))","v":"win10 82 1 k13"}]
["Сидоров","AntiMW","Kasper","k49","урл10",{"$f":"CONCATENATE(B131,\" \",COUNTIF(B:B,B131),\" \",LEN(сцепитьЕсли2(B:B,B131,D:D,\", \",1))-LEN(SUBSTITUTE(сцепитьЕсли2(B:B,B131,D:D,\"; \",1),\"k\",)),\" \",сцепитьЕсли2(B:B,B131,D:D,\", \",1))","v":"AntiMW 249 2 k49, k50"}]
["Котов","AntiMW","Kasper","k50","урл10",{"$f":"CONCATENATE(B132,\" \",COUNTIF(B:B,B132),\" \",LEN(сцепитьЕсли2(B:B,B132,D:D,\", \",1))-LEN(SUBSTITUTE(сцепитьЕсли2(B:B,B132,D:D,\"; \",1),\"k\",)),\" \",сцепитьЕсли2(B:B,B132,D:D,\", \",1))","v":"AntiMW 249 2 k49, k50"}]
["Петров","AntiMW","Kasper","k49","урл50",{"$f":"CONCATENATE(B133,\" \",COUNTIF(B:B,B133),\" \",LEN(сцепитьЕсли2(B:B,B133,D:D,\", \",1))-LEN(SUBSTITUTE(сцепитьЕсли2(B:B,B133,D:D,\"; \",1),\"k\",)),\" \",сцепитьЕсли2(B:B,B133,D:D,\", \",1))","v":"AntiMW 249 2 k49, k50"}]
["Иванов","win11","Microsoft","k11","урл1",{"$f":"CONCATENATE(B134,\" \",COUNTIF(B:B,B134),\" \",LEN(сцепитьЕсли2(B:B,B134,D:D,\", \",1))-LEN(SUBSTITUTE(сцепитьЕсли2(B:B,B134,D:D,\"; \",1),\"k\",)),\" \",сцепитьЕсли2(B:B,B134,D:D,\", \",1))","v":"win11 168 2 k11, k12"}]
["Петров","win11","Microsoft","k12","урл2",{"$f":"CONCATENATE(B135,\" \",COUNTIF(B:B,B135),\" \",LEN(сцепитьЕсли2(B:B,B135,D:D,\", \",1))-LEN(SUBSTITUTE(сцепитьЕсли2(B:B,B135,D:D,\"; \",1),\"k\",)),\" \",сцепитьЕсли2(B:B,B135,D:D,\", \",1))","v":"win11 168 2 k11, k12"}]
["Петров","win10","Microsoft","k13","урл1",{"$f":"CONCATENATE(B136,\" \",COUNTIF(B:B,B136),\" \",LEN(сцепитьЕсли2(B:B,B136,D:D,\", \",1))-LEN(SUBSTITUTE(сцепитьЕсли2(B:B,B136,D:D,\"; \",1),\"k\",)),\" \",сцепитьЕсли2(B:B,B136,D:D,\", \",1))","v":"win10 82 1 k13"}]
["Сидоров","AntiMW","Kasper","k49","урл10",{"$f":"CONCATENATE(B137,\" \",COUNTIF(B:B,B137),\" \",LEN(сцепитьЕсли2(B:B,B137,D:D,\", \",1))-LEN(SUBSTITUTE(сцепитьЕсли2(B:B,B137,D:D,\"; \",1),\"k\",)),\" \",сцепитьЕсли2(B:B,B137,D:D,\", \",1))","v":"AntiMW 249 2 k49, k50"}]
["Котов","AntiMW","Kasper","k50","урл10",{"$f":"CONCATENATE(B138,\" \",COUNTIF(B:B,B138),\" \",LEN(сцепитьЕсли2(B:B,B138,D:D,\", \",1))-LEN(SUBSTITUTE(сцепитьЕсли2(B:B,B138,D:D,\"; \",1),\"k\",)),\" \",сцепитьЕсли2(B:B,B138,D:D,\", \",1))","v":"AntiMW 249 2 k49, k50"}]
["Петров","AntiMW","Kasper","k49","урл50",{"$f":"CONCATENATE(B139,\" \",COUNTIF(B:B,B139),\" \",LEN(сцепитьЕсли2(B:B,B139,D:D,\", \",1))-LEN(SUBSTITUTE(сцепитьЕсли2(B:B,B139,D:D,\"; \",1),\"k\",)),\" \",сцепитьЕсли2(B:B,B139,D:D,\", \",1))","v":"AntiMW 249 2 k49, k50"}]
["Иванов","win11","Microsoft","k11","урл1",{"$f":"CONCATENATE(B140,\" \",COUNTIF(B:B,B140),\" \",LEN(сцепитьЕсли2(B:B,B140,D:D,\", \",1))-LEN(SUBSTITUTE(сцепитьЕсли2(B:B,B140,D:D,\"; \",1),\"k\",)),\" \",сцепитьЕсли2(B:B,B140,D:D,\", \",1))","v":"win11 168 2 k11, k12"}]
["Петров","win11","Microsoft","k12","урл2",{"$f":"CONCATENATE(B141,\" \",COUNTIF(B:B,B141),\" \",LEN(сцепитьЕсли2(B:B,B141,D:D,\", \",1))-LEN(SUBSTITUTE(сцепитьЕсли2(B:B,B141,D:D,\"; \",1),\"k\",)),\" \",сцепитьЕсли2(B:B,B141,D:D,\", \",1))","v":"win11 168 2 k11, k12"}]
["Петров","win10","Microsoft","k13","урл1",{"$f":"CONCATENATE(B142,\" \",COUNTIF(B:B,B142),\" \",LEN(сцепитьЕсли2(B:B,B142,D:D,\", \",1))-LEN(SUBSTITUTE(сцепитьЕсли2(B:B,B142,D:D,\"; \",1),\"k\",)),\" \",сцепитьЕсли2(B:B,B142,D:D,\", \",1))","v":"win10 82 1 k13"}]
["Сидоров","AntiMW","Kasper","k49","урл10",{"$f":"CONCATENATE(B143,\" \",COUNTIF(B:B,B143),\" \",LEN(сцепитьЕсли2(B:B,B143,D:D,\", \",1))-LEN(SUBSTITUTE(сцепитьЕсли2(B:B,B143,D:D,\"; \",1),\"k\",)),\" \",сцепитьЕсли2(B:B,B143,D:D,\", \",1))","v":"AntiMW 249 2 k49, k50"}]
["Котов","AntiMW","Kasper","k50","урл10",{"$f":"CONCATENATE(B144,\" \",COUNTIF(B:B,B144),\" \",LEN(сцепитьЕсли2(B:B,B144,D:D,\", \",1))-LEN(SUBSTITUTE(сцепитьЕсли2(B:B,B144,D:D,\"; \",1),\"k\",)),\" \",сцепитьЕсли2(B:B,B144,D:D,\", \",1))","v":"AntiMW 249 2 k49, k50"}]
["Петров","AntiMW","Kasper","k49","урл50",{"$f":"CONCATENATE(B145,\" \",COUNTIF(B:B,B145),\" \",LEN(сцепитьЕсли2(B:B,B145,D:D,\", \",1))-LEN(SUBSTITUTE(сцепитьЕсли2(B:B,B145,D:D,\"; \",1),\"k\",)),\" \",сцепитьЕсли2(B:B,B145,D:D,\", \",1))","v":"AntiMW 249 2 k49, k50"}]
["Иванов","win11","Microsoft","k11","урл1",{"$f":"CONCATENATE(B146,\" \",COUNTIF(B:B,B146),\" \",LEN(сцепитьЕсли2(B:B,B146,D:D,\", \",1))-LEN(SUBSTITUTE(сцепитьЕсли2(B:B,B146,D:D,\"; \",1),\"k\",)),\" \",сцепитьЕсли2(B:B,B146,D:D,\", \",1))","v":"win11 168 2 k11, k12"}]
["Петров","win11","Microsoft","k12","урл2",{"$f":"CONCATENATE(B147,\" \",COUNTIF(B:B,B147),\" \",LEN(сцепитьЕсли2(B:B,B147,D:D,\", \",1))-LEN(SUBSTITUTE(сцепитьЕсли2(B:B,B147,D:D,\"; \",1),\"k\",)),\" \",сцепитьЕсли2(B:B,B147,D:D,\", \",1))","v":"win11 168 2 k11, k12"}]
["Петров","win10","Microsoft","k13","урл1",{"$f":"CONCATENATE(B148,\" \",COUNTIF(B:B,B148),\" \",LEN(сцепитьЕсли2(B:B,B148,D:D,\", \",1))-LEN(SUBSTITUTE(сцепитьЕсли2(B:B,B148,D:D,\"; \",1),\"k\",)),\" \",сцепитьЕсли2(B:B,B148,D:D,\", \",1))","v":"win10 82 1 k13"}]
["Сидоров","AntiMW","Kasper","k49","урл10",{"$f":"CONCATENATE(B149,\" \",COUNTIF(B:B,B149),\" \",LEN(сцепитьЕсли2(B:B,B149,D:D,\", \",1))-LEN(SUBSTITUTE(сцепитьЕсли2(B:B,B149,D:D,\"; \",1),\"k\",)),\" \",сцепитьЕсли2(B:B,B149,D:D,\", \",1))","v":"AntiMW 249 2 k49, k50"}]
["Котов","AntiMW","Kasper","k50","урл10",{"$f":"CONCATENATE(B150,\" \",COUNTIF(B:B,B150),\" \",LEN(сцепитьЕсли2(B:B,B150,D:D,\", \",1))-LEN(SUBSTITUTE(сцепитьЕсли2(B:B,B150,D:D,\"; \",1),\"k\",)),\" \",сцепитьЕсли2(B:B,B150,D:D,\", \",1))","v":"AntiMW 249 2 k49, k50"}]
["Петров","AntiMW","Kasper","k49","урл50",{"$f":"CONCATENATE(B151,\" \",COUNTIF(B:B,B151),\" \",LEN(сцепитьЕсли2(B:B,B151,D:D,\", \",1))-LEN(SUBSTITUTE(сцепитьЕсли2(B:B,B151,D:D,\"; \",1),\"k\",)),\" \",сцепитьЕсли2(B:B,B151,D:D,\", \",1))","v":"AntiMW 249 2 k49, k50"}]
["Иванов","win11","Microsoft","k11","урл1",{"$f":"CONCATENATE(B152,\" \",COUNTIF(B:B,B152),\" \",LEN(сцепитьЕсли2(B:B,B152,D:D,\", \",1))-LEN(SUBSTITUTE(сцепитьЕсли2(B:B,B152,D:D,\"; \",1),\"k\",)),\" \",сцепитьЕсли2(B:B,B152,D:D,\", \",1))","v":"win11 168 2 k11, k12"}]
["Петров","win11","Microsoft","k12","урл2",{"$f":"CONCATENATE(B153,\" \",COUNTIF(B:B,B153),\" \",LEN(сцепитьЕсли2(B:B,B153,D:D,\", \",1))-LEN(SUBSTITUTE(сцепитьЕсли2(B:B,B153,D:D,\"; \",1),\"k\",)),\" \",сцепитьЕсли2(B:B,B153,D:D,\", \",1))","v":"win11 168 2 k11, k12"}]
["Петров","win10","Microsoft","k13","урл1",{"$f":"CONCATENATE(B154,\" \",COUNTIF(B:B,B154),\" \",LEN(сцепитьЕсли2(B:B,B154,D:D,\", \",1))-LEN(SUBSTITUTE(сцепитьЕсли2(B:B,B154,D:D,\"; \",1),\"k\",)),\" \",сцепитьЕсли2(B:B,B154,D:D,\", \",1))","v":"win10 82 1 k13"}]
["Сидоров","AntiMW","Kasper","k49","урл10",{"$f":"CONCATENATE(B155,\" \",COUNTIF(B:B,B155),\" \",LEN(сцепитьЕсли2(B:B,B155,D:D,\", \",1))-LEN(SUBSTITUTE(сцепитьЕсли2(B:B,B155,D:D,\"; \",1),\"k\",)),\" \",сцепитьЕсли2(B:B,B155,D:D,\", \",1))","v":"AntiMW 249 2 k49, k50"}]
["Котов","AntiMW","Kasper","k50","урл10",{"$f":"CONCATENATE(B156,\" \",COUNTIF(B:B,B156),\" \",LEN(сцепитьЕсли2(B:B,B156,D:D,\", \",1))-LEN(SUBSTITUTE(сцепитьЕсли2(B:B,B156,D:D,\"; \",1),\"k\",)),\" \",сцепитьЕсли2(B:B,B156,D:D,\", \",1))","v":"AntiMW 249 2 k49, k50"}]
["Петров","AntiMW","Kasper","k49","урл50",{"$f":"CONCATENATE(B157,\" \",COUNTIF(B:B,B157),\" \",LEN(сцепитьЕсли2(B:B,B157,D:D,\", \",1))-LEN(SUBSTITUTE(сцепитьЕсли2(B:B,B157,D:D,\"; \",1),\"k\",)),\" \",сцепитьЕсли2(B:B,B157,D:D,\", \",1))","v":"AntiMW 249 2 k49, k50"}]
["Иванов","win11","Microsoft","k11","урл1",{"$f":"CONCATENATE(B158,\" \",COUNTIF(B:B,B158),\" \",LEN(сцепитьЕсли2(B:B,B158,D:D,\", \",1))-LEN(SUBSTITUTE(сцепитьЕсли2(B:B,B158,D:D,\"; \",1),\"k\",)),\" \",сцепитьЕсли2(B:B,B158,D:D,\", \",1))","v":"win11 168 2 k11, k12"}]
["Петров","win11","Microsoft","k12","урл2",{"$f":"CONCATENATE(B159,\" \",COUNTIF(B:B,B159),\" \",LEN(сцепитьЕсли2(B:B,B159,D:D,\", \",1))-LEN(SUBSTITUTE(сцепитьЕсли2(B:B,B159,D:D,\"; \",1),\"k\",)),\" \",сцепитьЕсли2(B:B,B159,D:D,\", \",1))","v":"win11 168 2 k11, k12"}]
["Петров","win10","Microsoft","k13","урл1",{"$f":"CONCATENATE(B160,\" \",COUNTIF(B:B,B160),\" \",LEN(сцепитьЕсли2(B:B,B160,D:D,\", \",1))-LEN(SUBSTITUTE(сцепитьЕсли2(B:B,B160,D:D,\"; \",1),\"k\",)),\" \",сцепитьЕсли2(B:B,B160,D:D,\", \",1))","v":"win10 82 1 k13"}]
["Сидоров","AntiMW","Kasper","k49","урл10",{"$f":"CONCATENATE(B161,\" \",COUNTIF(B:B,B161),\" \",LEN(сцепитьЕсли2(B:B,B161,D:D,\", \",1))-LEN(SUBSTITUTE(сцепитьЕсли2(B:B,B161,D:D,\"; \",1),\"k\",)),\" \",сцепитьЕсли2(B:B,B161,D:D,\", \",1))","v":"AntiMW 249 2 k49, k50"}]
["Котов","AntiMW","Kasper","k50","урл10",{"$f":"CONCATENATE(B162,\" \",COUNTIF(B:B,B162),\" \",LEN(сцепитьЕсли2(B:B,B162,D:D,\", \",1))-LEN(SUBSTITUTE(сцепитьЕсли2(B:B,B162,D:D,\"; \",1),\"k\",)),\" \",сцепитьЕсли2(B:B,B162,D:D,\", \",1))","v":"AntiMW 249 2 k49, k50"}]
["Петров","AntiMW","Kasper","k49","урл50",{"$f":"CONCATENATE(B163,\" \",COUNTIF(B:B,B163),\" \",LEN(сцепитьЕсли2(B:B,B163,D:D,\", \",1))-LEN(SUBSTITUTE(сцепитьЕсли2(B:B,B163,D:D,\"; \",1),\"k\",)),\" \",сцепитьЕсли2(B:B,B163,D:D,\", \",1))","v":"AntiMW 249 2 k49, k50"}]
["Иванов","win11","Microsoft","k11","урл1",{"$f":"CONCATENATE(B164,\" \",COUNTIF(B:B,B164),\" \",LEN(сцепитьЕсли2(B:B,B164,D:D,\", \",1))-LEN(SUBSTITUTE(сцепитьЕсли2(B:B,B164,D:D,\"; \",1),\"k\",)),\" \",сцепитьЕсли2(B:B,B164,D:D,\", \",1))","v":"win11 168 2 k11, k12"}]
["Петров","win11","Microsoft","k12","урл2",{"$f":"CONCATENATE(B165,\" \",COUNTIF(B:B,B165),\" \",LEN(сцепитьЕсли2(B:B,B165,D:D,\", \",1))-LEN(SUBSTITUTE(сцепитьЕсли2(B:B,B165,D:D,\"; \",1),\"k\",)),\" \",сцепитьЕсли2(B:B,B165,D:D,\", \",1))","v":"win11 168 2 k11, k12"}]
["Петров","win10","Microsoft","k13","урл1",{"$f":"CONCATENATE(B166,\" \",COUNTIF(B:B,B166),\" \",LEN(сцепитьЕсли2(B:B,B166,D:D,\", \",1))-LEN(SUBSTITUTE(сцепитьЕсли2(B:B,B166,D:D,\"; \",1),\"k\",)),\" \",сцепитьЕсли2(B:B,B166,D:D,\", \",1))","v":"win10 82 1 k13"}]
["Сидоров","AntiMW","Kasper","k49","урл10",{"$f":"CONCATENATE(B167,\" \",COUNTIF(B:B,B167),\" \",LEN(сцепитьЕсли2(B:B,B167,D:D,\", \",1))-LEN(SUBSTITUTE(сцепитьЕсли2(B:B,B167,D:D,\"; \",1),\"k\",)),\" \",сцепитьЕсли2(B:B,B167,D:D,\", \",1))","v":"AntiMW 249 2 k49, k50"}]
["Котов","AntiMW","Kasper","k50","урл10",{"$f":"CONCATENATE(B168,\" \",COUNTIF(B:B,B168),\" \",LEN(сцепитьЕсли2(B:B,B168,D:D,\", \",1))-LEN(SUBSTITUTE(сцепитьЕсли2(B:B,B168,D:D,\"; \",1),\"k\",)),\" \",сцепитьЕсли2(B:B,B168,D:D,\", \",1))","v":"AntiMW 249 2 k49, k50"}]
["Петров","AntiMW","Kasper","k49","урл50",{"$f":"CONCATENATE(B169,\" \",COUNTIF(B:B,B169),\" \",LEN(сцепитьЕсли2(B:B,B169,D:D,\", \",1))-LEN(SUBSTITUTE(сцепитьЕсли2(B:B,B169,D:D,\"; \",1),\"k\",)),\" \",сцепитьЕсли2(B:B,B169,D:D,\", \",1))","v":"AntiMW 249 2 k49, k50"}]
["Иванов","win11","Microsoft","k11","урл1",{"$f":"CONCATENATE(B170,\" \",COUNTIF(B:B,B170),\" \",LEN(сцепитьЕсли2(B:B,B170,D:D,\", \",1))-LEN(SUBSTITUTE(сцепитьЕсли2(B:B,B170,D:D,\"; \",1),\"k\",)),\" \",сцепитьЕсли2(B:B,B170,D:D,\", \",1))","v":"win11 168 2 k11, k12"}]
["Петров","win11","Microsoft","k12","урл2",{"$f":"CONCATENATE(B171,\" \",COUNTIF(B:B,B171),\" \",LEN(сцепитьЕсли2(B:B,B171,D:D,\", \",1))-LEN(SUBSTITUTE(сцепитьЕсли2(B:B,B171,D:D,\"; \",1),\"k\",)),\" \",сцепитьЕсли2(B:B,B171,D:D,\", \",1))","v":"win11 168 2 k11, k12"}]
["Петров","win10","Microsoft","k13","урл1",{"$f":"CONCATENATE(B172,\" \",COUNTIF(B:B,B172),\" \",LEN(сцепитьЕсли2(B:B,B172,D:D,\", \",1))-LEN(SUBSTITUTE(сцепитьЕсли2(B:B,B172,D:D,\"; \",1),\"k\",)),\" \",сцепитьЕсли2(B:B,B172,D:D,\", \",1))","v":"win10 82 1 k13"}]
["Сидоров","AntiMW","Kasper","k49","урл10",{"$f":"CONCATENATE(B173,\" \",COUNTIF(B:B,B173),\" \",LEN(сцепитьЕсли2(B:B,B173,D:D,\", \",1))-LEN(SUBSTITUTE(сцепитьЕсли2(B:B,B173,D:D,\"; \",1),\"k\",)),\" \",сцепитьЕсли2(B:B,B173,D:D,\", \",1))","v":"AntiMW 249 2 k49, k50"}]
["Котов","AntiMW","Kasper","k50","урл10",{"$f":"CONCATENATE(B174,\" \",COUNTIF(B:B,B174),\" \",LEN(сцепитьЕсли2(B:B,B174,D:D,\", \",1))-LEN(SUBSTITUTE(сцепитьЕсли2(B:B,B174,D:D,\"; \",1),\"k\",)),\" \",сцепитьЕсли2(B:B,B174,D:D,\", \",1))","v":"AntiMW 249 2 k49, k50"}]
["Петров","AntiMW","Kasper","k49","урл50",{"$f":"CONCATENATE(B175,\" \",COUNTIF(B:B,B175),\" \",LEN(сцепитьЕсли2(B:B,B175,D:D,\", \",1))-LEN(SUBSTITUTE(сцепитьЕсли2(B:B,B175,D:D,\"; \",1),\"k\",)),\" \",сцепитьЕсли2(B:B,B175,D:D,\", \",1))","v":"AntiMW 249 2 k49, k50"}]
["Иванов","win11","Microsoft","k11","урл1",{"$f":"CONCATENATE(B176,\" \",COUNTIF(B:B,B176),\" \",LEN(сцепитьЕсли2(B:B,B176,D:D,\", \",1))-LEN(SUBSTITUTE(сцепитьЕсли2(B:B,B176,D:D,\"; \",1),\"k\",)),\" \",сцепитьЕсли2(B:B,B176,D:D,\", \",1))","v":"win11 168 2 k11, k12"}]
["Петров","win11","Microsoft","k12","урл2",{"$f":"CONCATENATE(B177,\" \",COUNTIF(B:B,B177),\" \",LEN(сцепитьЕсли2(B:B,B177,D:D,\", \",1))-LEN(SUBSTITUTE(сцепитьЕсли2(B:B,B177,D:D,\"; \",1),\"k\",)),\" \",сцепитьЕсли2(B:B,B177,D:D,\", \",1))","v":"win11 168 2 k11, k12"}]
["Петров","win10","Microsoft","k13","урл1",{"$f":"CONCATENATE(B178,\" \",COUNTIF(B:B,B178),\" \",LEN(сцепитьЕсли2(B:B,B178,D:D,\", \",1))-LEN(SUBSTITUTE(сцепитьЕсли2(B:B,B178,D:D,\"; \",1),\"k\",)),\" \",сцепитьЕсли2(B:B,B178,D:D,\", \",1))","v":"win10 82 1 k13"}]
["Сидоров","AntiMW","Kasper","k49","урл10",{"$f":"CONCATENATE(B179,\" \",COUNTIF(B:B,B179),\" \",LEN(сцепитьЕсли2(B:B,B179,D:D,\", \",1))-LEN(SUBSTITUTE(сцепитьЕсли2(B:B,B179,D:D,\"; \",1),\"k\",)),\" \",сцепитьЕсли2(B:B,B179,D:D,\", \",1))","v":"AntiMW 249 2 k49, k50"}]
["Котов","AntiMW","Kasper","k50","урл10",{"$f":"CONCATENATE(B180,\" \",COUNTIF(B:B,B180),\" \",LEN(сцепитьЕсли2(B:B,B180,D:D,\", \",1))-LEN(SUBSTITUTE(сцепитьЕсли2(B:B,B180,D:D,\"; \",1),\"k\",)),\" \",сцепитьЕсли2(B:B,B180,D:D,\", \",1))","v":"AntiMW 249 2 k49, k50"}]
["Петров","AntiMW","Kasper","k49","урл50",{"$f":"CONCATENATE(B181,\" \",COUNTIF(B:B,B181),\" \",LEN(сцепитьЕсли2(B:B,B181,D:D,\", \",1))-LEN(SUBSTITUTE(сцепитьЕсли2(B:B,B181,D:D,\"; \",1),\"k\",)),\" \",сцепитьЕсли2(B:B,B181,D:D,\", \",1))","v":"AntiMW 249 2 k49, k50"}]
["Иванов","win11","Microsoft","k11","урл1",{"$f":"CONCATENATE(B182,\" \",COUNTIF(B:B,B182),\" \",LEN(сцепитьЕсли2(B:B,B182,D:D,\", \",1))-LEN(SUBSTITUTE(сцепитьЕсли2(B:B,B182,D:D,\"; \",1),\"k\",)),\" \",сцепитьЕсли2(B:B,B182,D:D,\", \",1))","v":"win11 168 2 k11, k12"}]
["Петров","win11","Microsoft","k12","урл2",{"$f":"CONCATENATE(B183,\" \",COUNTIF(B:B,B183),\" \",LEN(сцепитьЕсли2(B:B,B183,D:D,\", \",1))-LEN(SUBSTITUTE(сцепитьЕсли2(B:B,B183,D:D,\"; \",1),\"k\",)),\" \",сцепитьЕсли2(B:B,B183,D:D,\", \",1))","v":"win11 168 2 k11, k12"}]
["Петров","win10","Microsoft","k13","урл1",{"$f":"CONCATENATE(B184,\" \",COUNTIF(B:B,B184),\" \",LEN(сцепитьЕсли2(B:B,B184,D:D,\", \",1))-LEN(SUBSTITUTE(сцепитьЕсли2(B:B,B184,D:D,\"; \",1),\"k\",)),\" \",сцепитьЕсли2(B:B,B184,D:D,\", \",1))","v":"win10 82 1 k13"}]
["Сидоров","AntiMW","Kasper","k49","урл10",{"$f":"CONCATENATE(B185,\" \",COUNTIF(B:B,B185),\" \",LEN(сцепитьЕсли2(B:B,B185,D:D,\", \",1))-LEN(SUBSTITUTE(сцепитьЕсли2(B:B,B185,D:D,\"; \",1),\"k\",)),\" \",сцепитьЕсли2(B:B,B185,D:D,\", \",1))","v":"AntiMW 249 2 k49, k50"}]
["Котов","AntiMW","Kasper","k50","урл10",{"$f":"CONCATENATE(B186,\" \",COUNTIF(B:B,B186),\" \",LEN(сцепитьЕсли2(B:B,B186,D:D,\", \",1))-LEN(SUBSTITUTE(сцепитьЕсли2(B:B,B186,D:D,\"; \",1),\"k\",)),\" \",сцепитьЕсли2(B:B,B186,D:D,\", \",1))","v":"AntiMW 249 2 k49, k50"}]
["Петров","AntiMW","Kasper","k49","урл50",{"$f":"CONCATENATE(B187,\" \",COUNTIF(B:B,B187),\" \",LEN(сцепитьЕсли2(B:B,B187,D:D,\", \",1))-LEN(SUBSTITUTE(сцепитьЕсли2(B:B,B187,D:D,\"; \",1),\"k\",)),\" \",сцепитьЕсли2(B:B,B187,D:D,\", \",1))","v":"AntiMW 249 2 k49, k50"}]
["Иванов","win11","Microsoft","k11","урл1",{"$f":"CONCATENATE(B188,\" \",COUNTIF(B:B,B188),\" \",LEN(сцепитьЕсли2(B:B,B188,D:D,\", \",1))-LEN(SUBSTITUTE(сцепитьЕсли2(B:B,B188,D:D,\"; \",1),\"k\",)),\" \",сцепитьЕсли2(B:B,B188,D:D,\", \",1))","v":"win11 168 2 k11, k12"}]
["Петров","win11","Microsoft","k12","урл2",{"$f":"CONCATENATE(B189,\" \",COUNTIF(B:B,B189),\" \",LEN(сцепитьЕсли2(B:B,B189,D:D,\", \",1))-LEN(SUBSTITUTE(сцепитьЕсли2(B:B,B189,D:D,\"; \",1),\"k\",)),\" \",сцепитьЕсли2(B:B,B189,D:D,\", \",1))","v":"win11 168 2 k11, k12"}]
["Петров","win10","Microsoft","k13","урл1",{"$f":"CONCATENATE(B190,\" \",COUNTIF(B:B,B190),\" \",LEN(сцепитьЕсли2(B:B,B190,D:D,\", \",1))-LEN(SUBSTITUTE(сцепитьЕсли2(B:B,B190,D:D,\"; \",1),\"k\",)),\" \",сцепитьЕсли2(B:B,B190,D:D,\", \",1))","v":"win10 82 1 k13"}]
["Сидоров","AntiMW","Kasper","k49","урл10",{"$f":"CONCATENATE(B191,\" \",COUNTIF(B:B,B191),\" \",LEN(сцепитьЕсли2(B:B,B191,D:D,\", \",1))-LEN(SUBSTITUTE(сцепитьЕсли2(B:B,B191,D:D,\"; \",1),\"k\",)),\" \",сцепитьЕсли2(B:B,B191,D:D,\", \",1))","v":"AntiMW 249 2 k49, k50"}]
["Котов","AntiMW","Kasper","k50","урл10",{"$f":"CONCATENATE(B192,\" \",COUNTIF(B:B,B192),\" \",LEN(сцепитьЕсли2(B:B,B192,D:D,\", \",1))-LEN(SUBSTITUTE(сцепитьЕсли2(B:B,B192,D:D,\"; \",1),\"k\",)),\" \",сцепитьЕсли2(B:B,B192,D:D,\", \",1))","v":"AntiMW 249 2 k49, k50"}]
["Петров","AntiMW","Kasper","k49","урл50",{"$f":"CONCATENATE(B193,\" \",COUNTIF(B:B,B193),\" \",LEN(сцепитьЕсли2(B:B,B193,D:D,\", \",1))-LEN(SUBSTITUTE(сцепитьЕсли2(B:B,B193,D:D,\"; \",1),\"k\",)),\" \",сцепитьЕсли2(B:B,B193,D:D,\", \",1))","v":"AntiMW 249 2 k49, k50"}]
["Иванов","win11","Microsoft","k11","урл1",{"$f":"CONCATENATE(B194,\" \",COUNTIF(B:B,B194),\" \",LEN(сцепитьЕсли2(B:B,B194,D:D,\", \",1))-LEN(SUBSTITUTE(сцепитьЕсли2(B:B,B194,D:D,\"; \",1),\"k\",)),\" \",сцепитьЕсли2(B:B,B194,D:D,\", \",1))","v":"win11 168 2 k11, k12"}]
["Петров","win11","Microsoft","k12","урл2",{"$f":"CONCATENATE(B195,\" \",COUNTIF(B:B,B195),\" \",LEN(сцепитьЕсли2(B:B,B195,D:D,\", \",1))-LEN(SUBSTITUTE(сцепитьЕсли2(B:B,B195,D:D,\"; \",1),\"k\",)),\" \",сцепитьЕсли2(B:B,B195,D:D,\", \",1))","v":"win11 168 2 k11, k12"}]
["Петров","win10","Microsoft","k13","урл1",{"$f":"CONCATENATE(B196,\" \",COUNTIF(B:B,B196),\" \",LEN(сцепитьЕсли2(B:B,B196,D:D,\", \",1))-LEN(SUBSTITUTE(сцепитьЕсли2(B:B,B196,D:D,\"; \",1),\"k\",)),\" \",сцепитьЕсли2(B:B,B196,D:D,\", \",1))","v":"win10 82 1 k13"}]
["Сидоров","AntiMW","Kasper","k49","урл10",{"$f":"CONCATENATE(B197,\" \",COUNTIF(B:B,B197),\" \",LEN(сцепитьЕсли2(B:B,B197,D:D,\", \",1))-LEN(SUBSTITUTE(сцепитьЕсли2(B:B,B197,D:D,\"; \",1),\"k\",)),\" \",сцепитьЕсли2(B:B,B197,D:D,\", \",1))","v":"AntiMW 249 2 k49, k50"}]
["Котов","AntiMW","Kasper","k50","урл10",{"$f":"CONCATENATE(B198,\" \",COUNTIF(B:B,B198),\" \",LEN(сцепитьЕсли2(B:B,B198,D:D,\", \",1))-LEN(SUBSTITUTE(сцепитьЕсли2(B:B,B198,D:D,\"; \",1),\"k\",)),\" \",сцепитьЕсли2(B:B,B198,D:D,\", \",1))","v":"AntiMW 249 2 k49, k50"}]
["Петров","AntiMW","Kasper","k49","урл50",{"$f":"CONCATENATE(B199,\" \",COUNTIF(B:B,B199),\" \",LEN(сцепитьЕсли2(B:B,B199,D:D,\", \",1))-LEN(SUBSTITUTE(сцепитьЕсли2(B:B,B199,D:D,\"; \",1),\"k\",)),\" \",сцепитьЕсли2(B:B,B199,D:D,\", \",1))","v":"AntiMW 249 2 k49, k50"}]
["Иванов","win11","Microsoft","k11","урл1",{"$f":"CONCATENATE(B200,\" \",COUNTIF(B:B,B200),\" \",LEN(сцепитьЕсли2(B:B,B200,D:D,\", \",1))-LEN(SUBSTITUTE(сцепитьЕсли2(B:B,B200,D:D,\"; \",1),\"k\",)),\" \",сцепитьЕсли2(B:B,B200,D:D,\", \",1))","v":"win11 168 2 k11, k12"}]
["Петров","win11","Microsoft","k12","урл2",{"$f":"CONCATENATE(B201,\" \",COUNTIF(B:B,B201),\" \",LEN(сцепитьЕсли2(B:B,B201,D:D,\", \",1))-LEN(SUBSTITUTE(сцепитьЕсли2(B:B,B201,D:D,\"; \",1),\"k\",)),\" \",сцепитьЕсли2(B:B,B201,D:D,\", \",1))","v":"win11 168 2 k11, k12"}]
["Петров","win10","Microsoft","k13","урл1",{"$f":"CONCATENATE(B202,\" \",COUNTIF(B:B,B202),\" \",LEN(сцепитьЕсли2(B:B,B202,D:D,\", \",1))-LEN(SUBSTITUTE(сцепитьЕсли2(B:B,B202,D:D,\"; \",1),\"k\",)),\" \",сцепитьЕсли2(B:B,B202,D:D,\", \",1))","v":"win10 82 1 k13"}]
["Сидоров","AntiMW","Kasper","k49","урл10",{"$f":"CONCATENATE(B203,\" \",COUNTIF(B:B,B203),\" \",LEN(сцепитьЕсли2(B:B,B203,D:D,\", \",1))-LEN(SUBSTITUTE(сцепитьЕсли2(B:B,B203,D:D,\"; \",1),\"k\",)),\" \",сцепитьЕсли2(B:B,B203,D:D,\", \",1))","v":"AntiMW 249 2 k49, k50"}]
["Котов","AntiMW","Kasper","k50","урл10",{"$f":"CONCATENATE(B204,\" \",COUNTIF(B:B,B204),\" \",LEN(сцепитьЕсли2(B:B,B204,D:D,\", \",1))-LEN(SUBSTITUTE(сцепитьЕсли2(B:B,B204,D:D,\"; \",1),\"k\",)),\" \",сцепитьЕсли2(B:B,B204,D:D,\", \",1))","v":"AntiMW 249 2 k49, k50"}]
["Петров","AntiMW","Kasper","k49","урл50",{"$f":"CONCATENATE(B205,\" \",COUNTIF(B:B,B205),\" \",LEN(сцепитьЕсли2(B:B,B205,D:D,\", \",1))-LEN(SUBSTITUTE(сцепитьЕсли2(B:B,B205,D:D,\"; \",1),\"k\",)),\" \",сцепитьЕсли2(B:B,B205,D:D,\", \",1))","v":"AntiMW 249 2 k49, k50"}]
["Иванов","win11","Microsoft","k11","урл1",{"$f":"CONCATENATE(B206,\" \",COUNTIF(B:B,B206),\" \",LEN(сцепитьЕсли2(B:B,B206,D:D,\", \",1))-LEN(SUBSTITUTE(сцепитьЕсли2(B:B,B206,D:D,\"; \",1),\"k\",)),\" \",сцепитьЕсли2(B:B,B206,D:D,\", \",1))","v":"win11 168 2 k11, k12"}]
["Петров","win11","Microsoft","k12","урл2",{"$f":"CONCATENATE(B207,\" \",COUNTIF(B:B,B207),\" \",LEN(сцепитьЕсли2(B:B,B207,D:D,\", \",1))-LEN(SUBSTITUTE(сцепитьЕсли2(B:B,B207,D:D,\"; \",1),\"k\",)),\" \",сцепитьЕсли2(B:B,B207,D:D,\", \",1))","v":"win11 168 2 k11, k12"}]
["Петров","win10","Microsoft","k13","урл1",{"$f":"CONCATENATE(B208,\" \",COUNTIF(B:B,B208),\" \",LEN(сцепитьЕсли2(B:B,B208,D:D,\", \",1))-LEN(SUBSTITUTE(сцепитьЕсли2(B:B,B208,D:D,\"; \",1),\"k\",)),\" \",сцепитьЕсли2(B:B,B208,D:D,\", \",1))","v":"win10 82 1 k13"}]
["Сидоров","AntiMW","Kasper","k49","урл10",{"$f":"CONCATENATE(B209,\" \",COUNTIF(B:B,B209),\" \",LEN(сцепитьЕсли2(B:B,B209,D:D,\", \",1))-LEN(SUBSTITUTE(сцепитьЕсли2(B:B,B209,D:D,\"; \",1),\"k\",)),\" \",сцепитьЕсли2(B:B,B209,D:D,\", \",1))","v":"AntiMW 249 2 k49, k50"}]
["Котов","AntiMW","Kasper","k50","урл10",{"$f":"CONCATENATE(B210,\" \",COUNTIF(B:B,B210),\" \",LEN(сцепитьЕсли2(B:B,B210,D:D,\", \",1))-LEN(SUBSTITUTE(сцепитьЕсли2(B:B,B210,D:D,\"; \",1),\"k\",)),\" \",сцепитьЕсли2(B:B,B210,D:D,\", \",1))","v":"AntiMW 249 2 k49, k50"}]
["Петров","AntiMW","Kasper","k49","урл50",{"$f":"CONCATENATE(B211,\" \",COUNTIF(B:B,B211),\" \",LEN(сцепитьЕсли2(B:B,B211,D:D,\", \",1))-LEN(SUBSTITUTE(сцепитьЕсли2(B:B,B211,D:D,\"; \",1),\"k\",)),\" \",сцепитьЕсли2(B:B,B211,D:D,\", \",1))","v":"AntiMW 249 2 k49, k50"}]
["Иванов","win11","Microsoft","k11","урл1",{"$f":"CONCATENATE(B212,\" \",COUNTIF(B:B,B212),\" \",LEN(сцепитьЕсли2(B:B,B212,D:D,\", \",1))-LEN(SUBSTITUTE(сцепитьЕсли2(B:B,B212,D:D,\"; \",1),\"k\",)),\" \",сцепитьЕсли2(B:B,B212,D:D,\", \",1))","v":"win11 168 2 k11, k12"}]
["Петров","win11","Microsoft","k12","урл2",{"$f":"CONCATENATE(B213,\" \",COUNTIF(B:B,B213),\" \",LEN(сцепитьЕсли2(B:B,B213,D:D,\", \",1))-LEN(SUBSTITUTE(сцепитьЕсли2(B:B,B213,D:D,\"; \",1),\"k\",)),\" \",сцепитьЕсли2(B:B,B213,D:D,\", \",1))","v":"win11 168 2 k11, k12"}]
["Петров","win10","Microsoft","k13","урл1",{"$f":"CONCATENATE(B214,\" \",COUNTIF(B:B,B214),\" \",LEN(сцепитьЕсли2(B:B,B214,D:D,\", \",1))-LEN(SUBSTITUTE(сцепитьЕсли2(B:B,B214,D:D,\"; \",1),\"k\",)),\" \",сцепитьЕсли2(B:B,B214,D:D,\", \",1))","v":"win10 82 1 k13"}]
["Сидоров","AntiMW","Kasper","k49","урл10",{"$f":"CONCATENATE(B215,\" \",COUNTIF(B:B,B215),\" \",LEN(сцепитьЕсли2(B:B,B215,D:D,\", \",1))-LEN(SUBSTITUTE(сцепитьЕсли2(B:B,B215,D:D,\"; \",1),\"k\",)),\" \",сцепитьЕсли2(B:B,B215,D:D,\", \",1))","v":"AntiMW 249 2 k49, k50"}]
["Котов","AntiMW","Kasper","k50","урл10",{"$f":"CONCATENATE(B216,\" \",COUNTIF(B:B,B216),\" \",LEN(сцепитьЕсли2(B:B,B216,D:D,\", \",1))-LEN(SUBSTITUTE(сцепитьЕсли2(B:B,B216,D:D,\"; \",1),\"k\",)),\" \",сцепитьЕсли2(B:B,B216,D:D,\", \",1))","v":"AntiMW 249 2 k49, k50"}]
["Петров","AntiMW","Kasper","k49","урл50",{"$f":"CONCATENATE(B217,\" \",COUNTIF(B:B,B217),\" \",LEN(сцепитьЕсли2(B:B,B217,D:D,\", \",1))-LEN(SUBSTITUTE(сцепитьЕсли2(B:B,B217,D:D,\"; \",1),\"k\",)),\" \",сцепитьЕсли2(B:B,B217,D:D,\", \",1))","v":"AntiMW 249 2 k49, k50"}]
["Иванов","win11","Microsoft","k11","урл1",{"$f":"CONCATENATE(B218,\" \",COUNTIF(B:B,B218),\" \",LEN(сцепитьЕсли2(B:B,B218,D:D,\", \",1))-LEN(SUBSTITUTE(сцепитьЕсли2(B:B,B218,D:D,\"; \",1),\"k\",)),\" \",сцепитьЕсли2(B:B,B218,D:D,\", \",1))","v":"win11 168 2 k11, k12"}]
["Петров","win11","Microsoft","k12","урл2",{"$f":"CONCATENATE(B219,\" \",COUNTIF(B:B,B219),\" \",LEN(сцепитьЕсли2(B:B,B219,D:D,\", \",1))-LEN(SUBSTITUTE(сцепитьЕсли2(B:B,B219,D:D,\"; \",1),\"k\",)),\" \",сцепитьЕсли2(B:B,B219,D:D,\", \",1))","v":"win11 168 2 k11, k12"}]
["Петров","win10","Microsoft","k13","урл1",{"$f":"CONCATENATE(B220,\" \",COUNTIF(B:B,B220),\" \",LEN(сцепитьЕсли2(B:B,B220,D:D,\", \",1))-LEN(SUBSTITUTE(сцепитьЕсли2(B:B,B220,D:D,\"; \",1),\"k\",)),\" \",сцепитьЕсли2(B:B,B220,D:D,\", \",1))","v":"win10 82 1 k13"}]
["Сидоров","AntiMW","Kasper","k49","урл10",{"$f":"CONCATENATE(B221,\" \",COUNTIF(B:B,B221),\" \",LEN(сцепитьЕсли2(B:B,B221,D:D,\", \",1))-LEN(SUBSTITUTE(сцепитьЕсли2(B:B,B221,D:D,\"; \",1),\"k\",)),\" \",сцепитьЕсли2(B:B,B221,D:D,\", \",1))","v":"AntiMW 249 2 k49, k50"}]
["Котов","AntiMW","Kasper","k50","урл10",{"$f":"CONCATENATE(B222,\" \",COUNTIF(B:B,B222),\" \",LEN(сцепитьЕсли2(B:B,B222,D:D,\", \",1))-LEN(SUBSTITUTE(сцепитьЕсли2(B:B,B222,D:D,\"; \",1),\"k\",)),\" \",сцепитьЕсли2(B:B,B222,D:D,\", \",1))","v":"AntiMW 249 2 k49, k50"}]
["Петров","AntiMW","Kasper","k49","урл50",{"$f":"CONCATENATE(B223,\" \",COUNTIF(B:B,B223),\" \",LEN(сцепитьЕсли2(B:B,B223,D:D,\", \",1))-LEN(SUBSTITUTE(сцепитьЕсли2(B:B,B223,D:D,\"; \",1),\"k\",)),\" \",сцепитьЕсли2(B:B,B223,D:D,\", \",1))","v":"AntiMW 249 2 k49, k50"}]
["Иванов","win11","Microsoft","k11","урл1",{"$f":"CONCATENATE(B224,\" \",COUNTIF(B:B,B224),\" \",LEN(сцепитьЕсли2(B:B,B224,D:D,\", \",1))-LEN(SUBSTITUTE(сцепитьЕсли2(B:B,B224,D:D,\"; \",1),\"k\",)),\" \",сцепитьЕсли2(B:B,B224,D:D,\", \",1))","v":"win11 168 2 k11, k12"}]
["Петров","win11","Microsoft","k12","урл2",{"$f":"CONCATENATE(B225,\" \",COUNTIF(B:B,B225),\" \",LEN(сцепитьЕсли2(B:B,B225,D:D,\", \",1))-LEN(SUBSTITUTE(сцепитьЕсли2(B:B,B225,D:D,\"; \",1),\"k\",)),\" \",сцепитьЕсли2(B:B,B225,D:D,\", \",1))","v":"win11 168 2 k11, k12"}]
["Петров","win10","Microsoft","k13","урл1",{"$f":"CONCATENATE(B226,\" \",COUNTIF(B:B,B226),\" \",LEN(сцепитьЕсли2(B:B,B226,D:D,\", \",1))-LEN(SUBSTITUTE(сцепитьЕсли2(B:B,B226,D:D,\"; \",1),\"k\",)),\" \",сцепитьЕсли2(B:B,B226,D:D,\", \",1))","v":"win10 82 1 k13"}]
["Сидоров","AntiMW","Kasper","k49","урл10",{"$f":"CONCATENATE(B227,\" \",COUNTIF(B:B,B227),\" \",LEN(сцепитьЕсли2(B:B,B227,D:D,\", \",1))-LEN(SUBSTITUTE(сцепитьЕсли2(B:B,B227,D:D,\"; \",1),\"k\",)),\" \",сцепитьЕсли2(B:B,B227,D:D,\", \",1))","v":"AntiMW 249 2 k49, k50"}]
["Котов","AntiMW","Kasper","k50","урл10",{"$f":"CONCATENATE(B228,\" \",COUNTIF(B:B,B228),\" \",LEN(сцепитьЕсли2(B:B,B228,D:D,\", \",1))-LEN(SUBSTITUTE(сцепитьЕсли2(B:B,B228,D:D,\"; \",1),\"k\",)),\" \",сцепитьЕсли2(B:B,B228,D:D,\", \",1))","v":"AntiMW 249 2 k49, k50"}]
["Петров","AntiMW","Kasper","k49","урл50",{"$f":"CONCATENATE(B229,\" \",COUNTIF(B:B,B229),\" \",LEN(сцепитьЕсли2(B:B,B229,D:D,\", \",1))-LEN(SUBSTITUTE(сцепитьЕсли2(B:B,B229,D:D,\"; \",1),\"k\",)),\" \",сцепитьЕсли2(B:B,B229,D:D,\", \",1))","v":"AntiMW 249 2 k49, k50"}]
["Иванов","win11","Microsoft","k11","урл1",{"$f":"CONCATENATE(B230,\" \",COUNTIF(B:B,B230),\" \",LEN(сцепитьЕсли2(B:B,B230,D:D,\", \",1))-LEN(SUBSTITUTE(сцепитьЕсли2(B:B,B230,D:D,\"; \",1),\"k\",)),\" \",сцепитьЕсли2(B:B,B230,D:D,\", \",1))","v":"win11 168 2 k11, k12"}]
["Петров","win11","Microsoft","k12","урл2",{"$f":"CONCATENATE(B231,\" \",COUNTIF(B:B,B231),\" \",LEN(сцепитьЕсли2(B:B,B231,D:D,\", \",1))-LEN(SUBSTITUTE(сцепитьЕсли2(B:B,B231,D:D,\"; \",1),\"k\",)),\" \",сцепитьЕсли2(B:B,B231,D:D,\", \",1))","v":"win11 168 2 k11, k12"}]
["Петров","win10","Microsoft","k13","урл1",{"$f":"CONCATENATE(B232,\" \",COUNTIF(B:B,B232),\" \",LEN(сцепитьЕсли2(B:B,B232,D:D,\", \",1))-LEN(SUBSTITUTE(сцепитьЕсли2(B:B,B232,D:D,\"; \",1),\"k\",)),\" \",сцепитьЕсли2(B:B,B232,D:D,\", \",1))","v":"win10 82 1 k13"}]
["Сидоров","AntiMW","Kasper","k49","урл10",{"$f":"CONCATENATE(B233,\" \",COUNTIF(B:B,B233),\" \",LEN(сцепитьЕсли2(B:B,B233,D:D,\", \",1))-LEN(SUBSTITUTE(сцепитьЕсли2(B:B,B233,D:D,\"; \",1),\"k\",)),\" \",сцепитьЕсли2(B:B,B233,D:D,\", \",1))","v":"AntiMW 249 2 k49, k50"}]
["Котов","AntiMW","Kasper","k50","урл10",{"$f":"CONCATENATE(B234,\" \",COUNTIF(B:B,B234),\" \",LEN(сцепитьЕсли2(B:B,B234,D:D,\", \",1))-LEN(SUBSTITUTE(сцепитьЕсли2(B:B,B234,D:D,\"; \",1),\"k\",)),\" \",сцепитьЕсли2(B:B,B234,D:D,\", \",1))","v":"AntiMW 249 2 k49, k50"}]
["Петров","AntiMW","Kasper","k49","урл50",{"$f":"CONCATENATE(B235,\" \",COUNTIF(B:B,B235),\" \",LEN(сцепитьЕсли2(B:B,B235,D:D,\", \",1))-LEN(SUBSTITUTE(сцепитьЕсли2(B:B,B235,D:D,\"; \",1),\"k\",)),\" \",сцепитьЕсли2(B:B,B235,D:D,\", \",1))","v":"AntiMW 249 2 k49, k50"}]
["Иванов","win11","Microsoft","k11","урл1",{"$f":"CONCATENATE(B236,\" \",COUNTIF(B:B,B236),\" \",LEN(сцепитьЕсли2(B:B,B236,D:D,\", \",1))-LEN(SUBSTITUTE(сцепитьЕсли2(B:B,B236,D:D,\"; \",1),\"k\",)),\" \",сцепитьЕсли2(B:B,B236,D:D,\", \",1))","v":"win11 168 2 k11, k12"}]
["Петров","win11","Microsoft","k12","урл2",{"$f":"CONCATENATE(B237,\" \",COUNTIF(B:B,B237),\" \",LEN(сцепитьЕсли2(B:B,B237,D:D,\", \",1))-LEN(SUBSTITUTE(сцепитьЕсли2(B:B,B237,D:D,\"; \",1),\"k\",)),\" \",сцепитьЕсли2(B:B,B237,D:D,\", \",1))","v":"win11 168 2 k11, k12"}]
["Петров","win10","Microsoft","k13","урл1",{"$f":"CONCATENATE(B238,\" \",COUNTIF(B:B,B238),\" \",LEN(сцепитьЕсли2(B:B,B238,D:D,\", \",1))-LEN(SUBSTITUTE(сцепитьЕсли2(B:B,B238,D:D,\"; \",1),\"k\",)),\" \",сцепитьЕсли2(B:B,B238,D:D,\", \",1))","v":"win10 82 1 k13"}]
["Сидоров","AntiMW","Kasper","k49","урл10",{"$f":"CONCATENATE(B239,\" \",COUNTIF(B:B,B239),\" \",LEN(сцепитьЕсли2(B:B,B239,D:D,\", \",1))-LEN(SUBSTITUTE(сцепитьЕсли2(B:B,B239,D:D,\"; \",1),\"k\",)),\" \",сцепитьЕсли2(B:B,B239,D:D,\", \",1))","v":"AntiMW 249 2 k49, k50"}]
["Котов","AntiMW","Kasper","k50","урл10",{"$f":"CONCATENATE(B240,\" \",COUNTIF(B:B,B240),\" \",LEN(сцепитьЕсли2(B:B,B240,D:D,\", \",1))-LEN(SUBSTITUTE(сцепитьЕсли2(B:B,B240,D:D,\"; \",1),\"k\",)),\" \",сцепитьЕсли2(B:B,B240,D:D,\", \",1))","v":"AntiMW 249 2 k49, k50"}]
["Петров","AntiMW","Kasper","k49","урл50",{"$f":"CONCATENATE(B241,\" \",COUNTIF(B:B,B241),\" \",LEN(сцепитьЕсли2(B:B,B241,D:D,\", \",1))-LEN(SUBSTITUTE(сцепитьЕсли2(B:B,B241,D:D,\"; \",1),\"k\",)),\" \",сцепитьЕсли2(B:B,B241,D:D,\", \",1))","v":"AntiMW 249 2 k49, k50"}]
["Иванов","win11","Microsoft","k11","урл1",{"$f":"CONCATENATE(B242,\" \",COUNTIF(B:B,B242),\" \",LEN(сцепитьЕсли2(B:B,B242,D:D,\", \",1))-LEN(SUBSTITUTE(сцепитьЕсли2(B:B,B242,D:D,\"; \",1),\"k\",)),\" \",сцепитьЕсли2(B:B,B242,D:D,\", \",1))","v":"win11 168 2 k11, k12"}]
["Петров","win11","Microsoft","k12","урл2",{"$f":"CONCATENATE(B243,\" \",COUNTIF(B:B,B243),\" \",LEN(сцепитьЕсли2(B:B,B243,D:D,\", \",1))-LEN(SUBSTITUTE(сцепитьЕсли2(B:B,B243,D:D,\"; \",1),\"k\",)),\" \",сцепитьЕсли2(B:B,B243,D:D,\", \",1))","v":"win11 168 2 k11, k12"}]
["Петров","win10","Microsoft","k13","урл1",{"$f":"CONCATENATE(B244,\" \",COUNTIF(B:B,B244),\" \",LEN(сцепитьЕсли2(B:B,B244,D:D,\", \",1))-LEN(SUBSTITUTE(сцепитьЕсли2(B:B,B244,D:D,\"; \",1),\"k\",)),\" \",сцепитьЕсли2(B:B,B244,D:D,\", \",1))","v":"win10 82 1 k13"}]
["Сидоров","AntiMW","Kasper","k49","урл10",{"$f":"CONCATENATE(B245,\" \",COUNTIF(B:B,B245),\" \",LEN(сцепитьЕсли2(B:B,B245,D:D,\", \",1))-LEN(SUBSTITUTE(сцепитьЕсли2(B:B,B245,D:D,\"; \",1),\"k\",)),\" \",сцепитьЕсли2(B:B,B245,D:D,\", \",1))","v":"AntiMW 249 2 k49, k50"}]
["Котов","AntiMW","Kasper","k50","урл10",{"$f":"CONCATENATE(B246,\" \",COUNTIF(B:B,B246),\" \",LEN(сцепитьЕсли2(B:B,B246,D:D,\", \",1))-LEN(SUBSTITUTE(сцепитьЕсли2(B:B,B246,D:D,\"; \",1),\"k\",)),\" \",сцепитьЕсли2(B:B,B246,D:D,\", \",1))","v":"AntiMW 249 2 k49, k50"}]
["Петров","AntiMW","Kasper","k49","урл50",{"$f":"CONCATENATE(B247,\" \",COUNTIF(B:B,B247),\" \",LEN(сцепитьЕсли2(B:B,B247,D:D,\", \",1))-LEN(SUBSTITUTE(сцепитьЕсли2(B:B,B247,D:D,\"; \",1),\"k\",)),\" \",сцепитьЕсли2(B:B,B247,D:D,\", \",1))","v":"AntiMW 249 2 k49, k50"}]
["Иванов","win11","Microsoft","k11","урл1",{"$f":"CONCATENATE(B248,\" \",COUNTIF(B:B,B248),\" \",LEN(сцепитьЕсли2(B:B,B248,D:D,\", \",1))-LEN(SUBSTITUTE(сцепитьЕсли2(B:B,B248,D:D,\"; \",1),\"k\",)),\" \",сцепитьЕсли2(B:B,B248,D:D,\", \",1))","v":"win11 168 2 k11, k12"}]
["Петров","win11","Microsoft","k12","урл2",{"$f":"CONCATENATE(B249,\" \",COUNTIF(B:B,B249),\" \",LEN(сцепитьЕсли2(B:B,B249,D:D,\", \",1))-LEN(SUBSTITUTE(сцепитьЕсли2(B:B,B249,D:D,\"; \",1),\"k\",)),\" \",сцепитьЕсли2(B:B,B249,D:D,\", \",1))","v":"win11 168 2 k11, k12"}]
["Петров","win10","Microsoft","k13","урл1",{"$f":"CONCATENATE(B250,\" \",COUNTIF(B:B,B250),\" \",LEN(сцепитьЕсли2(B:B,B250,D:D,\", \",1))-LEN(SUBSTITUTE(сцепитьЕсли2(B:B,B250,D:D,\"; \",1),\"k\",)),\" \",сцепитьЕсли2(B:B,B250,D:D,\", \",1))","v":"win10 82 1 k13"}]
["Сидоров","AntiMW","Kasper","k49","урл10",{"$f":"CONCATENATE(B251,\" \",COUNTIF(B:B,B251),\" \",LEN(сцепитьЕсли2(B:B,B251,D:D,\", \",1))-LEN(SUBSTITUTE(сцепитьЕсли2(B:B,B251,D:D,\"; \",1),\"k\",)),\" \",сцепитьЕсли2(B:B,B251,D:D,\", \",1))","v":"AntiMW 249 2 k49, k50"}]
["Котов","AntiMW","Kasper","k50","урл10",{"$f":"CONCATENATE(B252,\" \",COUNTIF(B:B,B252),\" \",LEN(сцепитьЕсли2(B:B,B252,D:D,\", \",1))-LEN(SUBSTITUTE(сцепитьЕсли2(B:B,B252,D:D,\"; \",1),\"k\",)),\" \",сцепитьЕсли2(B:B,B252,D:D,\", \",1))","v":"AntiMW 249 2 k49, k50"}]
["Петров","AntiMW","Kasper","k49","урл50",{"$f":"CONCATENATE(B253,\" \",COUNTIF(B:B,B253),\" \",LEN(сцепитьЕсли2(B:B,B253,D:D,\", \",1))-LEN(SUBSTITUTE(сцепитьЕсли2(B:B,B253,D:D,\"; \",1),\"k\",)),\" \",сцепитьЕсли2(B:B,B253,D:D,\", \",1))","v":"AntiMW 249 2 k49, k50"}]
["Иванов","win11","Microsoft","k11","урл1",{"$f":"CONCATENATE(B254,\" \",COUNTIF(B:B,B254),\" \",LEN(сцепитьЕсли2(B:B,B254,D:D,\", \",1))-LEN(SUBSTITUTE(сцепитьЕсли2(B:B,B254,D:D,\"; \",1),\"k\",)),\" \",сцепитьЕсли2(B:B,B254,D:D,\", \",1))","v":"win11 168 2 k11, k12"}]
["Петров","win11","Microsoft","k12","урл2",{"$f":"CONCATENATE(B255,\" \",COUNTIF(B:B,B255),\" \",LEN(сцепитьЕсли2(B:B,B255,D:D,\", \",1))-LEN(SUBSTITUTE(сцепитьЕсли2(B:B,B255,D:D,\"; \",1),\"k\",)),\" \",сцепитьЕсли2(B:B,B255,D:D,\", \",1))","v":"win11 168 2 k11, k12"}]
["Петров","win10","Microsoft","k13","урл1",{"$f":"CONCATENATE(B256,\" \",COUNTIF(B:B,B256),\" \",LEN(сцепитьЕсли2(B:B,B256,D:D,\", \",1))-LEN(SUBSTITUTE(сцепитьЕсли2(B:B,B256,D:D,\"; \",1),\"k\",)),\" \",сцепитьЕсли2(B:B,B256,D:D,\", \",1))","v":"win10 82 1 k13"}]
["Сидоров","AntiMW","Kasper","k49","урл10",{"$f":"CONCATENATE(B257,\" \",COUNTIF(B:B,B257),\" \",LEN(сцепитьЕсли2(B:B,B257,D:D,\", \",1))-LEN(SUBSTITUTE(сцепитьЕсли2(B:B,B257,D:D,\"; \",1),\"k\",)),\" \",сцепитьЕсли2(B:B,B257,D:D,\", \",1))","v":"AntiMW 249 2 k49, k50"}]
["Котов","AntiMW","Kasper","k50","урл10",{"$f":"CONCATENATE(B258,\" \",COUNTIF(B:B,B258),\" \",LEN(сцепитьЕсли2(B:B,B258,D:D,\", \",1))-LEN(SUBSTITUTE(сцепитьЕсли2(B:B,B258,D:D,\"; \",1),\"k\",)),\" \",сцепитьЕсли2(B:B,B258,D:D,\", \",1))","v":"AntiMW 249 2 k49, k50"}]
["Петров","AntiMW","Kasper","k49","урл50",{"$f":"CONCATENATE(B259,\" \",COUNTIF(B:B,B259),\" \",LEN(сцепитьЕсли2(B:B,B259,D:D,\", \",1))-LEN(SUBSTITUTE(сцепитьЕсли2(B:B,B259,D:D,\"; \",1),\"k\",)),\" \",сцепитьЕсли2(B:B,B259,D:D,\", \",1))","v":"AntiMW 249 2 k49, k50"}]
["Иванов","win11","Microsoft","k11","урл1",{"$f":"CONCATENATE(B260,\" \",COUNTIF(B:B,B260),\" \",LEN(сцепитьЕсли2(B:B,B260,D:D,\", \",1))-LEN(SUBSTITUTE(сцепитьЕсли2(B:B,B260,D:D,\"; \",1),\"k\",)),\" \",сцепитьЕсли2(B:B,B260,D:D,\", \",1))","v":"win11 168 2 k11, k12"}]
["Петров","win11","Microsoft","k12","урл2",{"$f":"CONCATENATE(B261,\" \",COUNTIF(B:B,B261),\" \",LEN(сцепитьЕсли2(B:B,B261,D:D,\", \",1))-LEN(SUBSTITUTE(сцепитьЕсли2(B:B,B261,D:D,\"; \",1),\"k\",)),\" \",сцепитьЕсли2(B:B,B261,D:D,\", \",1))","v":"win11 168 2 k11, k12"}]
["Петров","win10","Microsoft","k13","урл1",{"$f":"CONCATENATE(B262,\" \",COUNTIF(B:B,B262),\" \",LEN(сцепитьЕсли2(B:B,B262,D:D,\", \",1))-LEN(SUBSTITUTE(сцепитьЕсли2(B:B,B262,D:D,\"; \",1),\"k\",)),\" \",сцепитьЕсли2(B:B,B262,D:D,\", \",1))","v":"win10 82 1 k13"}]
["Сидоров","AntiMW","Kasper","k49","урл10",{"$f":"CONCATENATE(B263,\" \",COUNTIF(B:B,B263),\" \",LEN(сцепитьЕсли2(B:B,B263,D:D,\", \",1))-LEN(SUBSTITUTE(сцепитьЕсли2(B:B,B263,D:D,\"; \",1),\"k\",)),\" \",сцепитьЕсли2(B:B,B263,D:D,\", \",1))","v":"AntiMW 249 2 k49, k50"}]
["Котов","AntiMW","Kasper","k50","урл10",{"$f":"CONCATENATE(B264,\" \",COUNTIF(B:B,B264),\" \",LEN(сцепитьЕсли2(B:B,B264,D:D,\", \",1))-LEN(SUBSTITUTE(сцепитьЕсли2(B:B,B264,D:D,\"; \",1),\"k\",)),\" \",сцепитьЕсли2(B:B,B264,D:D,\", \",1))","v":"AntiMW 249 2 k49, k50"}]
["Петров","AntiMW","Kasper","k49","урл50",{"$f":"CONCATENATE(B265,\" \",COUNTIF(B:B,B265),\" \",LEN(сцепитьЕсли2(B:B,B265,D:D,\", \",1))-LEN(SUBSTITUTE(сцепитьЕсли2(B:B,B265,D:D,\"; \",1),\"k\",)),\" \",сцепитьЕсли2(B:B,B265,D:D,\", \",1))","v":"AntiMW 249 2 k49, k50"}]
["Иванов","win11","Microsoft","k11","урл1",{"$f":"CONCATENATE(B266,\" \",COUNTIF(B:B,B266),\" \",LEN(сцепитьЕсли2(B:B,B266,D:D,\", \",1))-LEN(SUBSTITUTE(сцепитьЕсли2(B:B,B266,D:D,\"; \",1),\"k\",)),\" \",сцепитьЕсли2(B:B,B266,D:D,\", \",1))","v":"win11 168 2 k11, k12"}]
["Петров","win11","Microsoft","k12","урл2",{"$f":"CONCATENATE(B267,\" \",COUNTIF(B:B,B267),\" \",LEN(сцепитьЕсли2(B:B,B267,D:D,\", \",1))-LEN(SUBSTITUTE(сцепитьЕсли2(B:B,B267,D:D,\"; \",1),\"k\",)),\" \",сцепитьЕсли2(B:B,B267,D:D,\", \",1))","v":"win11 168 2 k11, k12"}]
["Петров","win10","Microsoft","k13","урл1",{"$f":"CONCATENATE(B268,\" \",COUNTIF(B:B,B268),\" \",LEN(сцепитьЕсли2(B:B,B268,D:D,\", \",1))-LEN(SUBSTITUTE(сцепитьЕсли2(B:B,B268,D:D,\"; \",1),\"k\",)),\" \",сцепитьЕсли2(B:B,B268,D:D,\", \",1))","v":"win10 82 1 k13"}]
["Сидоров","AntiMW","Kasper","k49","урл10",{"$f":"CONCATENATE(B269,\" \",COUNTIF(B:B,B269),\" \",LEN(сцепитьЕсли2(B:B,B269,D:D,\", \",1))-LEN(SUBSTITUTE(сцепитьЕсли2(B:B,B269,D:D,\"; \",1),\"k\",)),\" \",сцепитьЕсли2(B:B,B269,D:D,\", \",1))","v":"AntiMW 249 2 k49, k50"}]
["Котов","AntiMW","Kasper","k50","урл10",{"$f":"CONCATENATE(B270,\" \",COUNTIF(B:B,B270),\" \",LEN(сцепитьЕсли2(B:B,B270,D:D,\", \",1))-LEN(SUBSTITUTE(сцепитьЕсли2(B:B,B270,D:D,\"; \",1),\"k\",)),\" \",сцепитьЕсли2(B:B,B270,D:D,\", \",1))","v":"AntiMW 249 2 k49, k50"}]
["Петров","AntiMW","Kasper","k49","урл50",{"$f":"CONCATENATE(B271,\" \",COUNTIF(B:B,B271),\" \",LEN(сцепитьЕсли2(B:B,B271,D:D,\", \",1))-LEN(SUBSTITUTE(сцепитьЕсли2(B:B,B271,D:D,\"; \",1),\"k\",)),\" \",сцепитьЕсли2(B:B,B271,D:D,\", \",1))","v":"AntiMW 249 2 k49, k50"}]
["Иванов","win11","Microsoft","k11","урл1",{"$f":"CONCATENATE(B272,\" \",COUNTIF(B:B,B272),\" \",LEN(сцепитьЕсли2(B:B,B272,D:D,\", \",1))-LEN(SUBSTITUTE(сцепитьЕсли2(B:B,B272,D:D,\"; \",1),\"k\",)),\" \",сцепитьЕсли2(B:B,B272,D:D,\", \",1))","v":"win11 168 2 k11, k12"}]
["Петров","win11","Microsoft","k12","урл2",{"$f":"CONCATENATE(B273,\" \",COUNTIF(B:B,B273),\" \",LEN(сцепитьЕсли2(B:B,B273,D:D,\", \",1))-LEN(SUBSTITUTE(сцепитьЕсли2(B:B,B273,D:D,\"; \",1),\"k\",)),\" \",сцепитьЕсли2(B:B,B273,D:D,\", \",1))","v":"win11 168 2 k11, k12"}]
["Петров","win10","Microsoft","k13","урл1",{"$f":"CONCATENATE(B274,\" \",COUNTIF(B:B,B274),\" \",LEN(сцепитьЕсли2(B:B,B274,D:D,\", \",1))-LEN(SUBSTITUTE(сцепитьЕсли2(B:B,B274,D:D,\"; \",1),\"k\",)),\" \",сцепитьЕсли2(B:B,B274,D:D,\", \",1))","v":"win10 82 1 k13"}]
["Сидоров","AntiMW","Kasper","k49","урл10",{"$f":"CONCATENATE(B275,\" \",COUNTIF(B:B,B275),\" \",LEN(сцепитьЕсли2(B:B,B275,D:D,\", \",1))-LEN(SUBSTITUTE(сцепитьЕсли2(B:B,B275,D:D,\"; \",1),\"k\",)),\" \",сцепитьЕсли2(B:B,B275,D:D,\", \",1))","v":"AntiMW 249 2 k49, k50"}]
["Котов","AntiMW","Kasper","k50","урл10",{"$f":"CONCATENATE(B276,\" \",COUNTIF(B:B,B276),\" \",LEN(сцепитьЕсли2(B:B,B276,D:D,\", \",1))-LEN(SUBSTITUTE(сцепитьЕсли2(B:B,B276,D:D,\"; \",1),\"k\",)),\" \",сцепитьЕсли2(B:B,B276,D:D,\", \",1))","v":"AntiMW 249 2 k49, k50"}]
["Петров","AntiMW","Kasper","k49","урл50",{"$f":"CONCATENATE(B277,\" \",COUNTIF(B:B,B277),\" \",LEN(сцепитьЕсли2(B:B,B277,D:D,\", \",1))-LEN(SUBSTITUTE(сцепитьЕсли2(B:B,B277,D:D,\"; \",1),\"k\",)),\" \",сцепитьЕсли2(B:B,B277,D:D,\", \",1))","v":"AntiMW 249 2 k49, k50"}]
["Иванов","win11","Microsoft","k11","урл1",{"$f":"CONCATENATE(B278,\" \",COUNTIF(B:B,B278),\" \",LEN(сцепитьЕсли2(B:B,B278,D:D,\", \",1))-LEN(SUBSTITUTE(сцепитьЕсли2(B:B,B278,D:D,\"; \",1),\"k\",)),\" \",сцепитьЕсли2(B:B,B278,D:D,\", \",1))","v":"win11 168 2 k11, k12"}]
["Петров","win11","Microsoft","k12","урл2",{"$f":"CONCATENATE(B279,\" \",COUNTIF(B:B,B279),\" \",LEN(сцепитьЕсли2(B:B,B279,D:D,\", \",1))-LEN(SUBSTITUTE(сцепитьЕсли2(B:B,B279,D:D,\"; \",1),\"k\",)),\" \",сцепитьЕсли2(B:B,B279,D:D,\", \",1))","v":"win11 168 2 k11, k12"}]
["Петров","win10","Microsoft","k13","урл1",{"$f":"CONCATENATE(B280,\" \",COUNTIF(B:B,B280),\" \",LEN(сцепитьЕсли2(B:B,B280,D:D,\", \",1))-LEN(SUBSTITUTE(сцепитьЕсли2(B:B,B280,D:D,\"; \",1),\"k\",)),\" \",сцепитьЕсли2(B:B,B280,D:D,\", \",1))","v":"win10 82 1 k13"}]
["Сидоров","AntiMW","Kasper","k49","урл10",{"$f":"CONCATENATE(B281,\" \",COUNTIF(B:B,B281),\" \",LEN(сцепитьЕсли2(B:B,B281,D:D,\", \",1))-LEN(SUBSTITUTE(сцепитьЕсли2(B:B,B281,D:D,\"; \",1),\"k\",)),\" \",сцепитьЕсли2(B:B,B281,D:D,\", \",1))","v":"AntiMW 249 2 k49, k50"}]
["Котов","AntiMW","Kasper","k50","урл10",{"$f":"CONCATENATE(B282,\" \",COUNTIF(B:B,B282),\" \",LEN(сцепитьЕсли2(B:B,B282,D:D,\", \",1))-LEN(SUBSTITUTE(сцепитьЕсли2(B:B,B282,D:D,\"; \",1),\"k\",)),\" \",сцепитьЕсли2(B:B,B282,D:D,\", \",1))","v":"AntiMW 249 2 k49, k50"}]
["Петров","AntiMW","Kasper","k49","урл50",{"$f":"CONCATENATE(B283,\" \",COUNTIF(B:B,B283),\" \",LEN(сцепитьЕсли2(B:B,B283,D:D,\", \",1))-LEN(SUBSTITUTE(сцепитьЕсли2(B:B,B283,D:D,\"; \",1),\"k\",)),\" \",сцепитьЕсли2(B:B,B283,D:D,\", \",1))","v":"AntiMW 249 2 k49, k50"}]
["Иванов","win11","Microsoft","k11","урл1",{"$f":"CONCATENATE(B284,\" \",COUNTIF(B:B,B284),\" \",LEN(сцепитьЕсли2(B:B,B284,D:D,\", \",1))-LEN(SUBSTITUTE(сцепитьЕсли2(B:B,B284,D:D,\"; \",1),\"k\",)),\" \",сцепитьЕсли2(B:B,B284,D:D,\", \",1))","v":"win11 168 2 k11, k12"}]
["Петров","win11","Microsoft","k12","урл2",{"$f":"CONCATENATE(B285,\" \",COUNTIF(B:B,B285),\" \",LEN(сцепитьЕсли2(B:B,B285,D:D,\", \",1))-LEN(SUBSTITUTE(сцепитьЕсли2(B:B,B285,D:D,\"; \",1),\"k\",)),\" \",сцепитьЕсли2(B:B,B285,D:D,\", \",1))","v":"win11 168 2 k11, k12"}]
["Петров","win10","Microsoft","k13","урл1",{"$f":"CONCATENATE(B286,\" \",COUNTIF(B:B,B286),\" \",LEN(сцепитьЕсли2(B:B,B286,D:D,\", \",1))-LEN(SUBSTITUTE(сцепитьЕсли2(B:B,B286,D:D,\"; \",1),\"k\",)),\" \",сцепитьЕсли2(B:B,B286,D:D,\", \",1))","v":"win10 82 1 k13"}]
["Сидоров","AntiMW","Kasper","k49","урл10",{"$f":"CONCATENATE(B287,\" \",COUNTIF(B:B,B287),\" \",LEN(сцепитьЕсли2(B:B,B287,D:D,\", \",1))-LEN(SUBSTITUTE(сцепитьЕсли2(B:B,B287,D:D,\"; \",1),\"k\",)),\" \",сцепитьЕсли2(B:B,B287,D:D,\", \",1))","v":"AntiMW 249 2 k49, k50"}]
["Котов","AntiMW","Kasper","k50","урл10",{"$f":"CONCATENATE(B288,\" \",COUNTIF(B:B,B288),\" \",LEN(сцепитьЕсли2(B:B,B288,D:D,\", \",1))-LEN(SUBSTITUTE(сцепитьЕсли2(B:B,B288,D:D,\"; \",1),\"k\",)),\" \",сцепитьЕсли2(B:B,B288,D:D,\", \",1))","v":"AntiMW 249 2 k49, k50"}]
["Петров","AntiMW","Kasper","k49","урл50",{"$f":"CONCATENATE(B289,\" \",COUNTIF(B:B,B289),\" \",LEN(сцепитьЕсли2(B:B,B289,D:D,\", \",1))-LEN(SUBSTITUTE(сцепитьЕсли2(B:B,B289,D:D,\"; \",1),\"k\",)),\" \",сцепитьЕсли2(B:B,B289,D:D,\", \",1))","v":"AntiMW 249 2 k49, k50"}]
["Иванов","win11","Microsoft","k11","урл1",{"$f":"CONCATENATE(B290,\" \",COUNTIF(B:B,B290),\" \",LEN(сцепитьЕсли2(B:B,B290,D:D,\", \",1))-LEN(SUBSTITUTE(сцепитьЕсли2(B:B,B290,D:D,\"; \",1),\"k\",)),\" \",сцепитьЕсли2(B:B,B290,D:D,\", \",1))","v":"win11 168 2 k11, k12"}]
["Петров","win11","Microsoft","k12","урл2",{"$f":"CONCATENATE(B291,\" \",COUNTIF(B:B,B291),\" \",LEN(сцепитьЕсли2(B:B,B291,D:D,\", \",1))-LEN(SUBSTITUTE(сцепитьЕсли2(B:B,B291,D:D,\"; \",1),\"k\",)),\" \",сцепитьЕсли2(B:B,B291,D:D,\", \",1))","v":"win11 168 2 k11, k12"}]
["Петров","win10","Microsoft","k13","урл1",{"$f":"CONCATENATE(B292,\" \",COUNTIF(B:B,B292),\" \",LEN(сцепитьЕсли2(B:B,B292,D:D,\", \",1))-LEN(SUBSTITUTE(сцепитьЕсли2(B:B,B292,D:D,\"; \",1),\"k\",)),\" \",сцепитьЕсли2(B:B,B292,D:D,\", \",1))","v":"win10 82 1 k13"}]
["Сидоров","AntiMW","Kasper","k49","урл10",{"$f":"CONCATENATE(B293,\" \",COUNTIF(B:B,B293),\" \",LEN(сцепитьЕсли2(B:B,B293,D:D,\", \",1))-LEN(SUBSTITUTE(сцепитьЕсли2(B:B,B293,D:D,\"; \",1),\"k\",)),\" \",сцепитьЕсли2(B:B,B293,D:D,\", \",1))","v":"AntiMW 249 2 k49, k50"}]
["Котов","AntiMW","Kasper","k50","урл10",{"$f":"CONCATENATE(B294,\" \",COUNTIF(B:B,B294),\" \",LEN(сцепитьЕсли2(B:B,B294,D:D,\", \",1))-LEN(SUBSTITUTE(сцепитьЕсли2(B:B,B294,D:D,\"; \",1),\"k\",)),\" \",сцепитьЕсли2(B:B,B294,D:D,\", \",1))","v":"AntiMW 249 2 k49, k50"}]
["Петров","AntiMW","Kasper","k49","урл50",{"$f":"CONCATENATE(B295,\" \",COUNTIF(B:B,B295),\" \",LEN(сцепитьЕсли2(B:B,B295,D:D,\", \",1))-LEN(SUBSTITUTE(сцепитьЕсли2(B:B,B295,D:D,\"; \",1),\"k\",)),\" \",сцепитьЕсли2(B:B,B295,D:D,\", \",1))","v":"AntiMW 249 2 k49, k50"}]
["Иванов","win11","Microsoft","k11","урл1",{"$f":"CONCATENATE(B296,\" \",COUNTIF(B:B,B296),\" \",LEN(сцепитьЕсли2(B:B,B296,D:D,\", \",1))-LEN(SUBSTITUTE(сцепитьЕсли2(B:B,B296,D:D,\"; \",1),\"k\",)),\" \",сцепитьЕсли2(B:B,B296,D:D,\", \",1))","v":"win11 168 2 k11, k12"}]
["Петров","win11","Microsoft","k12","урл2",{"$f":"CONCATENATE(B297,\" \",COUNTIF(B:B,B297),\" \",LEN(сцепитьЕсли2(B:B,B297,D:D,\", \",1))-LEN(SUBSTITUTE(сцепитьЕсли2(B:B,B297,D:D,\"; \",1),\"k\",)),\" \",сцепитьЕсли2(B:B,B297,D:D,\", \",1))","v":"win11 168 2 k11, k12"}]
["Петров","win10","Microsoft","k13","урл1",{"$f":"CONCATENATE(B298,\" \",COUNTIF(B:B,B298),\" \",LEN(сцепитьЕсли2(B:B,B298,D:D,\", \",1))-LEN(SUBSTITUTE(сцепитьЕсли2(B:B,B298,D:D,\"; \",1),\"k\",)),\" \",сцепитьЕсли2(B:B,B298,D:D,\", \",1))","v":"win10 82 1 k13"}]
["Сидоров","AntiMW","Kasper","k49","урл10",{"$f":"CONCATENATE(B299,\" \",COUNTIF(B:B,B299),\" \",LEN(сцепитьЕсли2(B:B,B299,D:D,\", \",1))-LEN(SUBSTITUTE(сцепитьЕсли2(B:B,B299,D:D,\"; \",1),\"k\",)),\" \",сцепитьЕсли2(B:B,B299,D:D,\", \",1))","v":"AntiMW 249 2 k49, k50"}]
["Котов","AntiMW","Kasper","k50","урл10",{"$f":"CONCATENATE(B300,\" \",COUNTIF(B:B,B300),\" \",LEN(сцепитьЕсли2(B:B,B300,D:D,\", \",1))-LEN(SUBSTITUTE(сцепитьЕсли2(B:B,B300,D:D,\"; \",1),\"k\",)),\" \",сцепитьЕсли2(B:B,B300,D:D,\", \",1))","v":"AntiMW 249 2 k49, k50"}]
["Петров","AntiMW","Kasper","k49","урл50",{"$f":"CONCATENATE(B301,\" \",COUNTIF(B:B,B301),\" \",LEN(сцепитьЕсли2(B:B,B301,D:D,\", \",1))-LEN(SUBSTITUTE(сцепитьЕсли2(B:B,B301,D:D,\"; \",1),\"k\",)),\" \",сцепитьЕсли2(B:B,B301,D:D,\", \",1))","v":"AntiMW 249 2 k49, k50"}]
["Иванов","win11","Microsoft","k11","урл1",{"$f":"CONCATENATE(B302,\" \",COUNTIF(B:B,B302),\" \",LEN(сцепитьЕсли2(B:B,B302,D:D,\", \",1))-LEN(SUBSTITUTE(сцепитьЕсли2(B:B,B302,D:D,\"; \",1),\"k\",)),\" \",сцепитьЕсли2(B:B,B302,D:D,\", \",1))","v":"win11 168 2 k11, k12"}]
["Петров","win11","Microsoft","k12","урл2",{"$f":"CONCATENATE(B303,\" \",COUNTIF(B:B,B303),\" \",LEN(сцепитьЕсли2(B:B,B303,D:D,\", \",1))-LEN(SUBSTITUTE(сцепитьЕсли2(B:B,B303,D:D,\"; \",1),\"k\",)),\" \",сцепитьЕсли2(B:B,B303,D:D,\", \",1))","v":"win11 168 2 k11, k12"}]
["Петров","win10","Microsoft","k13","урл1",{"$f":"CONCATENATE(B304,\" \",COUNTIF(B:B,B304),\" \",LEN(сцепитьЕсли2(B:B,B304,D:D,\", \",1))-LEN(SUBSTITUTE(сцепитьЕсли2(B:B,B304,D:D,\"; \",1),\"k\",)),\" \",сцепитьЕсли2(B:B,B304,D:D,\", \",1))","v":"win10 82 1 k13"}]
["Сидоров","AntiMW","Kasper","k49","урл10",{"$f":"CONCATENATE(B305,\" \",COUNTIF(B:B,B305),\" \",LEN(сцепитьЕсли2(B:B,B305,D:D,\", \",1))-LEN(SUBSTITUTE(сцепитьЕсли2(B:B,B305,D:D,\"; \",1),\"k\",)),\" \",сцепитьЕсли2(B:B,B305,D:D,\", \",1))","v":"AntiMW 249 2 k49, k50"}]
["Котов","AntiMW","Kasper","k50","урл10",{"$f":"CONCATENATE(B306,\" \",COUNTIF(B:B,B306),\" \",LEN(сцепитьЕсли2(B:B,B306,D:D,\", \",1))-LEN(SUBSTITUTE(сцепитьЕсли2(B:B,B306,D:D,\"; \",1),\"k\",)),\" \",сцепитьЕсли2(B:B,B306,D:D,\", \",1))","v":"AntiMW 249 2 k49, k50"}]
["Петров","AntiMW","Kasper","k49","урл50",{"$f":"CONCATENATE(B307,\" \",COUNTIF(B:B,B307),\" \",LEN(сцепитьЕсли2(B:B,B307,D:D,\", \",1))-LEN(SUBSTITUTE(сцепитьЕсли2(B:B,B307,D:D,\"; \",1),\"k\",)),\" \",сцепитьЕсли2(B:B,B307,D:D,\", \",1))","v":"AntiMW 249 2 k49, k50"}]
["Иванов","win11","Microsoft","k11","урл1",{"$f":"CONCATENATE(B308,\" \",COUNTIF(B:B,B308),\" \",LEN(сцепитьЕсли2(B:B,B308,D:D,\", \",1))-LEN(SUBSTITUTE(сцепитьЕсли2(B:B,B308,D:D,\"; \",1),\"k\",)),\" \",сцепитьЕсли2(B:B,B308,D:D,\", \",1))","v":"win11 168 2 k11, k12"}]
["Петров","win11","Microsoft","k12","урл2",{"$f":"CONCATENATE(B309,\" \",COUNTIF(B:B,B309),\" \",LEN(сцепитьЕсли2(B:B,B309,D:D,\", \",1))-LEN(SUBSTITUTE(сцепитьЕсли2(B:B,B309,D:D,\"; \",1),\"k\",)),\" \",сцепитьЕсли2(B:B,B309,D:D,\", \",1))","v":"win11 168 2 k11, k12"}]
["Петров","win10","Microsoft","k13","урл1",{"$f":"CONCATENATE(B310,\" \",COUNTIF(B:B,B310),\" \",LEN(сцепитьЕсли2(B:B,B310,D:D,\", \",1))-LEN(SUBSTITUTE(сцепитьЕсли2(B:B,B310,D:D,\"; \",1),\"k\",)),\" \",сцепитьЕсли2(B:B,B310,D:D,\", \",1))","v":"win10 82 1 k13"}]
["Сидоров","AntiMW","Kasper","k49","урл10",{"$f":"CONCATENATE(B311,\" \",COUNTIF(B:B,B311),\" \",LEN(сцепитьЕсли2(B:B,B311,D:D,\", \",1))-LEN(SUBSTITUTE(сцепитьЕсли2(B:B,B311,D:D,\"; \",1),\"k\",)),\" \",сцепитьЕсли2(B:B,B311,D:D,\", \",1))","v":"AntiMW 249 2 k49, k50"}]
["Котов","AntiMW","Kasper","k50","урл10",{"$f":"CONCATENATE(B312,\" \",COUNTIF(B:B,B312),\" \",LEN(сцепитьЕсли2(B:B,B312,D:D,\", \",1))-LEN(SUBSTITUTE(сцепитьЕсли2(B:B,B312,D:D,\"; \",1),\"k\",)),\" \",сцепитьЕсли2(B:B,B312,D:D,\", \",1))","v":"AntiMW 249 2 k49, k50"}]
["Петров","AntiMW","Kasper","k49","урл50",{"$f":"CONCATENATE(B313,\" \",COUNTIF(B:B,B313),\" \",LEN(сцепитьЕсли2(B:B,B313,D:D,\", \",1))-LEN(SUBSTITUTE(сцепитьЕсли2(B:B,B313,D:D,\"; \",1),\"k\",)),\" \",сцепитьЕсли2(B:B,B313,D:D,\", \",1))","v":"AntiMW 249 2 k49, k50"}]
["Иванов","win11","Microsoft","k11","урл1",{"$f":"CONCATENATE(B314,\" \",COUNTIF(B:B,B314),\" \",LEN(сцепитьЕсли2(B:B,B314,D:D,\", \",1))-LEN(SUBSTITUTE(сцепитьЕсли2(B:B,B314,D:D,\"; \",1),\"k\",)),\" \",сцепитьЕсли2(B:B,B314,D:D,\", \",1))","v":"win11 168 2 k11, k12"}]
["Петров","win11","Microsoft","k12","урл2",{"$f":"CONCATENATE(B315,\" \",COUNTIF(B:B,B315),\" \",LEN(сцепитьЕсли2(B:B,B315,D:D,\", \",1))-LEN(SUBSTITUTE(сцепитьЕсли2(B:B,B315,D:D,\"; \",1),\"k\",)),\" \",сцепитьЕсли2(B:B,B315,D:D,\", \",1))","v":"win11 168 2 k11, k12"}]
["Петров","win10","Microsoft","k13","урл1",{"$f":"CONCATENATE(B316,\" \",COUNTIF(B:B,B316),\" \",LEN(сцепитьЕсли2(B:B,B316,D:D,\", \",1))-LEN(SUBSTITUTE(сцепитьЕсли2(B:B,B316,D:D,\"; \",1),\"k\",)),\" \",сцепитьЕсли2(B:B,B316,D:D,\", \",1))","v":"win10 82 1 k13"}]
["Сидоров","AntiMW","Kasper","k49","урл10",{"$f":"CONCATENATE(B317,\" \",COUNTIF(B:B,B317),\" \",LEN(сцепитьЕсли2(B:B,B317,D:D,\", \",1))-LEN(SUBSTITUTE(сцепитьЕсли2(B:B,B317,D:D,\"; \",1),\"k\",)),\" \",сцепитьЕсли2(B:B,B317,D:D,\", \",1))","v":"AntiMW 249 2 k49, k50"}]
["Котов","AntiMW","Kasper","k50","урл10",{"$f":"CONCATENATE(B318,\" \",COUNTIF(B:B,B318),\" \",LEN(сцепитьЕсли2(B:B,B318,D:D,\", \",1))-LEN(SUBSTITUTE(сцепитьЕсли2(B:B,B318,D:D,\"; \",1),\"k\",)),\" \",сцепитьЕсли2(B:B,B318,D:D,\", \",1))","v":"AntiMW 249 2 k49, k50"}]
["Петров","AntiMW","Kasper","k49","урл50",{"$f":"CONCATENATE(B319,\" \",COUNTIF(B:B,B319),\" \",LEN(сцепитьЕсли2(B:B,B319,D:D,\", \",1))-LEN(SUBSTITUTE(сцепитьЕсли2(B:B,B319,D:D,\"; \",1),\"k\",)),\" \",сцепитьЕсли2(B:B,B319,D:D,\", \",1))","v":"AntiMW 249 2 k49, k50"}]
["Иванов","win11","Microsoft","k11","урл1",{"$f":"CONCATENATE(B320,\" \",COUNTIF(B:B,B320),\" \",LEN(сцепитьЕсли2(B:B,B320,D:D,\", \",1))-LEN(SUBSTITUTE(сцепитьЕсли2(B:B,B320,D:D,\"; \",1),\"k\",)),\" \",сцепитьЕсли2(B:B,B320,D:D,\", \",1))","v":"win11 168 2 k11, k12"}]
["Петров","win11","Microsoft","k12","урл2",{"$f":"CONCATENATE(B321,\" \",COUNTIF(B:B,B321),\" \",LEN(сцепитьЕсли2(B:B,B321,D:D,\", \",1))-LEN(SUBSTITUTE(сцепитьЕсли2(B:B,B321,D:D,\"; \",1),\"k\",)),\" \",сцепитьЕсли2(B:B,B321,D:D,\", \",1))","v":"win11 168 2 k11, k12"}]
["Петров","win10","Microsoft","k13","урл1",{"$f":"CONCATENATE(B322,\" \",COUNTIF(B:B,B322),\" \",LEN(сцепитьЕсли2(B:B,B322,D:D,\", \",1))-LEN(SUBSTITUTE(сцепитьЕсли2(B:B,B322,D:D,\"; \",1),\"k\",)),\" \",сцепитьЕсли2(B:B,B322,D:D,\", \",1))","v":"win10 82 1 k13"}]
["Сидоров","AntiMW","Kasper","k49","урл10",{"$f":"CONCATENATE(B323,\" \",COUNTIF(B:B,B323),\" \",LEN(сцепитьЕсли2(B:B,B323,D:D,\", \",1))-LEN(SUBSTITUTE(сцепитьЕсли2(B:B,B323,D:D,\"; \",1),\"k\",)),\" \",сцепитьЕсли2(B:B,B323,D:D,\", \",1))","v":"AntiMW 249 2 k49, k50"}]
["Котов","AntiMW","Kasper","k50","урл10",{"$f":"CONCATENATE(B324,\" \",COUNTIF(B:B,B324),\" \",LEN(сцепитьЕсли2(B:B,B324,D:D,\", \",1))-LEN(SUBSTITUTE(сцепитьЕсли2(B:B,B324,D:D,\"; \",1),\"k\",)),\" \",сцепитьЕсли2(B:B,B324,D:D,\", \",1))","v":"AntiMW 249 2 k49, k50"}]
["Петров","AntiMW","Kasper","k49","урл50",{"$f":"CONCATENATE(B325,\" \",COUNTIF(B:B,B325),\" \",LEN(сцепитьЕсли2(B:B,B325,D:D,\", \",1))-LEN(SUBSTITUTE(сцепитьЕсли2(B:B,B325,D:D,\"; \",1),\"k\",)),\" \",сцепитьЕсли2(B:B,B325,D:D,\", \",1))","v":"AntiMW 249 2 k49, k50"}]
["Иванов","win11","Microsoft","k11","урл1",{"$f":"CONCATENATE(B326,\" \",COUNTIF(B:B,B326),\" \",LEN(сцепитьЕсли2(B:B,B326,D:D,\", \",1))-LEN(SUBSTITUTE(сцепитьЕсли2(B:B,B326,D:D,\"; \",1),\"k\",)),\" \",сцепитьЕсли2(B:B,B326,D:D,\", \",1))","v":"win11 168 2 k11, k12"}]
["Петров","win11","Microsoft","k12","урл2",{"$f":"CONCATENATE(B327,\" \",COUNTIF(B:B,B327),\" \",LEN(сцепитьЕсли2(B:B,B327,D:D,\", \",1))-LEN(SUBSTITUTE(сцепитьЕсли2(B:B,B327,D:D,\"; \",1),\"k\",)),\" \",сцепитьЕсли2(B:B,B327,D:D,\", \",1))","v":"win11 168 2 k11, k12"}]
["Петров","win10","Microsoft","k13","урл1",{"$f":"CONCATENATE(B328,\" \",COUNTIF(B:B,B328),\" \",LEN(сцепитьЕсли2(B:B,B328,D:D,\", \",1))-LEN(SUBSTITUTE(сцепитьЕсли2(B:B,B328,D:D,\"; \",1),\"k\",)),\" \",сцепитьЕсли2(B:B,B328,D:D,\", \",1))","v":"win10 82 1 k13"}]
["Сидоров","AntiMW","Kasper","k49","урл10",{"$f":"CONCATENATE(B329,\" \",COUNTIF(B:B,B329),\" \",LEN(сцепитьЕсли2(B:B,B329,D:D,\", \",1))-LEN(SUBSTITUTE(сцепитьЕсли2(B:B,B329,D:D,\"; \",1),\"k\",)),\" \",сцепитьЕсли2(B:B,B329,D:D,\", \",1))","v":"AntiMW 249 2 k49, k50"}]
["Котов","AntiMW","Kasper","k50","урл10",{"$f":"CONCATENATE(B330,\" \",COUNTIF(B:B,B330),\" \",LEN(сцепитьЕсли2(B:B,B330,D:D,\", \",1))-LEN(SUBSTITUTE(сцепитьЕсли2(B:B,B330,D:D,\"; \",1),\"k\",)),\" \",сцепитьЕсли2(B:B,B330,D:D,\", \",1))","v":"AntiMW 249 2 k49, k50"}]
["Петров","AntiMW","Kasper","k49","урл50",{"$f":"CONCATENATE(B331,\" \",COUNTIF(B:B,B331),\" \",LEN(сцепитьЕсли2(B:B,B331,D:D,\", \",1))-LEN(SUBSTITUTE(сцепитьЕсли2(B:B,B331,D:D,\"; \",1),\"k\",)),\" \",сцепитьЕсли2(B:B,B331,D:D,\", \",1))","v":"AntiMW 249 2 k49, k50"}]
["Иванов","win11","Microsoft","k11","урл1",{"$f":"CONCATENATE(B332,\" \",COUNTIF(B:B,B332),\" \",LEN(сцепитьЕсли2(B:B,B332,D:D,\", \",1))-LEN(SUBSTITUTE(сцепитьЕсли2(B:B,B332,D:D,\"; \",1),\"k\",)),\" \",сцепитьЕсли2(B:B,B332,D:D,\", \",1))","v":"win11 168 2 k11, k12"}]
["Петров","win11","Microsoft","k12","урл2",{"$f":"CONCATENATE(B333,\" \",COUNTIF(B:B,B333),\" \",LEN(сцепитьЕсли2(B:B,B333,D:D,\", \",1))-LEN(SUBSTITUTE(сцепитьЕсли2(B:B,B333,D:D,\"; \",1),\"k\",)),\" \",сцепитьЕсли2(B:B,B333,D:D,\", \",1))","v":"win11 168 2 k11, k12"}]
["Петров","win10","Microsoft","k13","урл1",{"$f":"CONCATENATE(B334,\" \",COUNTIF(B:B,B334),\" \",LEN(сцепитьЕсли2(B:B,B334,D:D,\", \",1))-LEN(SUBSTITUTE(сцепитьЕсли2(B:B,B334,D:D,\"; \",1),\"k\",)),\" \",сцепитьЕсли2(B:B,B334,D:D,\", \",1))","v":"win10 82 1 k13"}]
["Сидоров","AntiMW","Kasper","k49","урл10",{"$f":"CONCATENATE(B335,\" \",COUNTIF(B:B,B335),\" \",LEN(сцепитьЕсли2(B:B,B335,D:D,\", \",1))-LEN(SUBSTITUTE(сцепитьЕсли2(B:B,B335,D:D,\"; \",1),\"k\",)),\" \",сцепитьЕсли2(B:B,B335,D:D,\", \",1))","v":"AntiMW 249 2 k49, k50"}]
["Котов","AntiMW","Kasper","k50","урл10",{"$f":"CONCATENATE(B336,\" \",COUNTIF(B:B,B336),\" \",LEN(сцепитьЕсли2(B:B,B336,D:D,\", \",1))-LEN(SUBSTITUTE(сцепитьЕсли2(B:B,B336,D:D,\"; \",1),\"k\",)),\" \",сцепитьЕсли2(B:B,B336,D:D,\", \",1))","v":"AntiMW 249 2 k49, k50"}]
["Петров","AntiMW","Kasper","k49","урл50",{"$f":"CONCATENATE(B337,\" \",COUNTIF(B:B,B337),\" \",LEN(сцепитьЕсли2(B:B,B337,D:D,\", \",1))-LEN(SUBSTITUTE(сцепитьЕсли2(B:B,B337,D:D,\"; \",1),\"k\",)),\" \",сцепитьЕсли2(B:B,B337,D:D,\", \",1))","v":"AntiMW 249 2 k49, k50"}]
["Иванов","win11","Microsoft","k11","урл1",{"$f":"CONCATENATE(B338,\" \",COUNTIF(B:B,B338),\" \",LEN(сцепитьЕсли2(B:B,B338,D:D,\", \",1))-LEN(SUBSTITUTE(сцепитьЕсли2(B:B,B338,D:D,\"; \",1),\"k\",)),\" \",сцепитьЕсли2(B:B,B338,D:D,\", \",1))","v":"win11 168 2 k11, k12"}]
["Петров","win11","Microsoft","k12","урл2",{"$f":"CONCATENATE(B339,\" \",COUNTIF(B:B,B339),\" \",LEN(сцепитьЕсли2(B:B,B339,D:D,\", \",1))-LEN(SUBSTITUTE(сцепитьЕсли2(B:B,B339,D:D,\"; \",1),\"k\",)),\" \",сцепитьЕсли2(B:B,B339,D:D,\", \",1))","v":"win11 168 2 k11, k12"}]
["Петров","win10","Microsoft","k13","урл1",{"$f":"CONCATENATE(B340,\" \",COUNTIF(B:B,B340),\" \",LEN(сцепитьЕсли2(B:B,B340,D:D,\", \",1))-LEN(SUBSTITUTE(сцепитьЕсли2(B:B,B340,D:D,\"; \",1),\"k\",)),\" \",сцепитьЕсли2(B:B,B340,D:D,\", \",1))","v":"win10 82 1 k13"}]
["Сидоров","AntiMW","Kasper","k49","урл10",{"$f":"CONCATENATE(B341,\" \",COUNTIF(B:B,B341),\" \",LEN(сцепитьЕсли2(B:B,B341,D:D,\", \",1))-LEN(SUBSTITUTE(сцепитьЕсли2(B:B,B341,D:D,\"; \",1),\"k\",)),\" \",сцепитьЕсли2(B:B,B341,D:D,\", \",1))","v":"AntiMW 249 2 k49, k50"}]
["Котов","AntiMW","Kasper","k50","урл10",{"$f":"CONCATENATE(B342,\" \",COUNTIF(B:B,B342),\" \",LEN(сцепитьЕсли2(B:B,B342,D:D,\", \",1))-LEN(SUBSTITUTE(сцепитьЕсли2(B:B,B342,D:D,\"; \",1),\"k\",)),\" \",сцепитьЕсли2(B:B,B342,D:D,\", \",1))","v":"AntiMW 249 2 k49, k50"}]
["Петров","AntiMW","Kasper","k49","урл50",{"$f":"CONCATENATE(B343,\" \",COUNTIF(B:B,B343),\" \",LEN(сцепитьЕсли2(B:B,B343,D:D,\", \",1))-LEN(SUBSTITUTE(сцепитьЕсли2(B:B,B343,D:D,\"; \",1),\"k\",)),\" \",сцепитьЕсли2(B:B,B343,D:D,\", \",1))","v":"AntiMW 249 2 k49, k50"}]
["Иванов","win11","Microsoft","k11","урл1",{"$f":"CONCATENATE(B344,\" \",COUNTIF(B:B,B344),\" \",LEN(сцепитьЕсли2(B:B,B344,D:D,\", \",1))-LEN(SUBSTITUTE(сцепитьЕсли2(B:B,B344,D:D,\"; \",1),\"k\",)),\" \",сцепитьЕсли2(B:B,B344,D:D,\", \",1))","v":"win11 168 2 k11, k12"}]
["Петров","win11","Microsoft","k12","урл2",{"$f":"CONCATENATE(B345,\" \",COUNTIF(B:B,B345),\" \",LEN(сцепитьЕсли2(B:B,B345,D:D,\", \",1))-LEN(SUBSTITUTE(сцепитьЕсли2(B:B,B345,D:D,\"; \",1),\"k\",)),\" \",сцепитьЕсли2(B:B,B345,D:D,\", \",1))","v":"win11 168 2 k11, k12"}]
["Петров","win10","Microsoft","k13","урл1",{"$f":"CONCATENATE(B346,\" \",COUNTIF(B:B,B346),\" \",LEN(сцепитьЕсли2(B:B,B346,D:D,\", \",1))-LEN(SUBSTITUTE(сцепитьЕсли2(B:B,B346,D:D,\"; \",1),\"k\",)),\" \",сцепитьЕсли2(B:B,B346,D:D,\", \",1))","v":"win10 82 1 k13"}]
["Сидоров","AntiMW","Kasper","k49","урл10",{"$f":"CONCATENATE(B347,\" \",COUNTIF(B:B,B347),\" \",LEN(сцепитьЕсли2(B:B,B347,D:D,\", \",1))-LEN(SUBSTITUTE(сцепитьЕсли2(B:B,B347,D:D,\"; \",1),\"k\",)),\" \",сцепитьЕсли2(B:B,B347,D:D,\", \",1))","v":"AntiMW 249 2 k49, k50"}]
["Котов","AntiMW","Kasper","k50","урл10",{"$f":"CONCATENATE(B348,\" \",COUNTIF(B:B,B348),\" \",LEN(сцепитьЕсли2(B:B,B348,D:D,\", \",1))-LEN(SUBSTITUTE(сцепитьЕсли2(B:B,B348,D:D,\"; \",1),\"k\",)),\" \",сцепитьЕсли2(B:B,B348,D:D,\", \",1))","v":"AntiMW 249 2 k49, k50"}]
["Петров","AntiMW","Kasper","k49","урл50",{"$f":"CONCATENATE(B349,\" \",COUNTIF(B:B,B349),\" \",LEN(сцепитьЕсли2(B:B,B349,D:D,\", \",1))-LEN(SUBSTITUTE(сцепитьЕсли2(B:B,B349,D:D,\"; \",1),\"k\",)),\" \",сцепитьЕсли2(B:B,B349,D:D,\", \",1))","v":"AntiMW 249 2 k49, k50"}]
["Иванов","win11","Microsoft","k11","урл1",{"$f":"CONCATENATE(B350,\" \",COUNTIF(B:B,B350),\" \",LEN(сцепитьЕсли2(B:B,B350,D:D,\", \",1))-LEN(SUBSTITUTE(сцепитьЕсли2(B:B,B350,D:D,\"; \",1),\"k\",)),\" \",сцепитьЕсли2(B:B,B350,D:D,\", \",1))","v":"win11 168 2 k11, k12"}]
["Петров","win11","Microsoft","k12","урл2",{"$f":"CONCATENATE(B351,\" \",COUNTIF(B:B,B351),\" \",LEN(сцепитьЕсли2(B:B,B351,D:D,\", \",1))-LEN(SUBSTITUTE(сцепитьЕсли2(B:B,B351,D:D,\"; \",1),\"k\",)),\" \",сцепитьЕсли2(B:B,B351,D:D,\", \",1))","v":"win11 168 2 k11, k12"}]
["Петров","win10","Microsoft","k13","урл1",{"$f":"CONCATENATE(B352,\" \",COUNTIF(B:B,B352),\" \",LEN(сцепитьЕсли2(B:B,B352,D:D,\", \",1))-LEN(SUBSTITUTE(сцепитьЕсли2(B:B,B352,D:D,\"; \",1),\"k\",)),\" \",сцепитьЕсли2(B:B,B352,D:D,\", \",1))","v":"win10 82 1 k13"}]
["Сидоров","AntiMW","Kasper","k49","урл10",{"$f":"CONCATENATE(B353,\" \",COUNTIF(B:B,B353),\" \",LEN(сцепитьЕсли2(B:B,B353,D:D,\", \",1))-LEN(SUBSTITUTE(сцепитьЕсли2(B:B,B353,D:D,\"; \",1),\"k\",)),\" \",сцепитьЕсли2(B:B,B353,D:D,\", \",1))","v":"AntiMW 249 2 k49, k50"}]
["Котов","AntiMW","Kasper","k50","урл10",{"$f":"CONCATENATE(B354,\" \",COUNTIF(B:B,B354),\" \",LEN(сцепитьЕсли2(B:B,B354,D:D,\", \",1))-LEN(SUBSTITUTE(сцепитьЕсли2(B:B,B354,D:D,\"; \",1),\"k\",)),\" \",сцепитьЕсли2(B:B,B354,D:D,\", \",1))","v":"AntiMW 249 2 k49, k50"}]
["Петров","AntiMW","Kasper","k49","урл50",{"$f":"CONCATENATE(B355,\" \",COUNTIF(B:B,B355),\" \",LEN(сцепитьЕсли2(B:B,B355,D:D,\", \",1))-LEN(SUBSTITUTE(сцепитьЕсли2(B:B,B355,D:D,\"; \",1),\"k\",)),\" \",сцепитьЕсли2(B:B,B355,D:D,\", \",1))","v":"AntiMW 249 2 k49, k50"}]
["Иванов","win11","Microsoft","k11","урл1",{"$f":"CONCATENATE(B356,\" \",COUNTIF(B:B,B356),\" \",LEN(сцепитьЕсли2(B:B,B356,D:D,\", \",1))-LEN(SUBSTITUTE(сцепитьЕсли2(B:B,B356,D:D,\"; \",1),\"k\",)),\" \",сцепитьЕсли2(B:B,B356,D:D,\", \",1))","v":"win11 168 2 k11, k12"}]
["Петров","win11","Microsoft","k12","урл2",{"$f":"CONCATENATE(B357,\" \",COUNTIF(B:B,B357),\" \",LEN(сцепитьЕсли2(B:B,B357,D:D,\", \",1))-LEN(SUBSTITUTE(сцепитьЕсли2(B:B,B357,D:D,\"; \",1),\"k\",)),\" \",сцепитьЕсли2(B:B,B357,D:D,\", \",1))","v":"win11 168 2 k11, k12"}]
["Петров","win10","Microsoft","k13","урл1",{"$f":"CONCATENATE(B358,\" \",COUNTIF(B:B,B358),\" \",LEN(сцепитьЕсли2(B:B,B358,D:D,\", \",1))-LEN(SUBSTITUTE(сцепитьЕсли2(B:B,B358,D:D,\"; \",1),\"k\",)),\" \",сцепитьЕсли2(B:B,B358,D:D,\", \",1))","v":"win10 82 1 k13"}]
["Сидоров","AntiMW","Kasper","k49","урл10",{"$f":"CONCATENATE(B359,\" \",COUNTIF(B:B,B359),\" \",LEN(сцепитьЕсли2(B:B,B359,D:D,\", \",1))-LEN(SUBSTITUTE(сцепитьЕсли2(B:B,B359,D:D,\"; \",1),\"k\",)),\" \",сцепитьЕсли2(B:B,B359,D:D,\", \",1))","v":"AntiMW 249 2 k49, k50"}]
["Котов","AntiMW","Kasper","k50","урл10",{"$f":"CONCATENATE(B360,\" \",COUNTIF(B:B,B360),\" \",LEN(сцепитьЕсли2(B:B,B360,D:D,\", \",1))-LEN(SUBSTITUTE(сцепитьЕсли2(B:B,B360,D:D,\"; \",1),\"k\",)),\" \",сцепитьЕсли2(B:B,B360,D:D,\", \",1))","v":"AntiMW 249 2 k49, k50"}]
["Петров","AntiMW","Kasper","k49","урл50",{"$f":"CONCATENATE(B361,\" \",COUNTIF(B:B,B361),\" \",LEN(сцепитьЕсли2(B:B,B361,D:D,\", \",1))-LEN(SUBSTITUTE(сцепитьЕсли2(B:B,B361,D:D,\"; \",1),\"k\",)),\" \",сцепитьЕсли2(B:B,B361,D:D,\", \",1))","v":"AntiMW 249 2 k49, k50"}]
["Иванов","win11","Microsoft","k11","урл1",{"$f":"CONCATENATE(B362,\" \",COUNTIF(B:B,B362),\" \",LEN(сцепитьЕсли2(B:B,B362,D:D,\", \",1))-LEN(SUBSTITUTE(сцепитьЕсли2(B:B,B362,D:D,\"; \",1),\"k\",)),\" \",сцепитьЕсли2(B:B,B362,D:D,\", \",1))","v":"win11 168 2 k11, k12"}]
["Петров","win11","Microsoft","k12","урл2",{"$f":"CONCATENATE(B363,\" \",COUNTIF(B:B,B363),\" \",LEN(сцепитьЕсли2(B:B,B363,D:D,\", \",1))-LEN(SUBSTITUTE(сцепитьЕсли2(B:B,B363,D:D,\"; \",1),\"k\",)),\" \",сцепитьЕсли2(B:B,B363,D:D,\", \",1))","v":"win11 168 2 k11, k12"}]
["Петров","win10","Microsoft","k13","урл1",{"$f":"CONCATENATE(B364,\" \",COUNTIF(B:B,B364),\" \",LEN(сцепитьЕсли2(B:B,B364,D:D,\", \",1))-LEN(SUBSTITUTE(сцепитьЕсли2(B:B,B364,D:D,\"; \",1),\"k\",)),\" \",сцепитьЕсли2(B:B,B364,D:D,\", \",1))","v":"win10 82 1 k13"}]
["Сидоров","AntiMW","Kasper","k49","урл10",{"$f":"CONCATENATE(B365,\" \",COUNTIF(B:B,B365),\" \",LEN(сцепитьЕсли2(B:B,B365,D:D,\", \",1))-LEN(SUBSTITUTE(сцепитьЕсли2(B:B,B365,D:D,\"; \",1),\"k\",)),\" \",сцепитьЕсли2(B:B,B365,D:D,\", \",1))","v":"AntiMW 249 2 k49, k50"}]
["Котов","AntiMW","Kasper","k50","урл10",{"$f":"CONCATENATE(B366,\" \",COUNTIF(B:B,B366),\" \",LEN(сцепитьЕсли2(B:B,B366,D:D,\", \",1))-LEN(SUBSTITUTE(сцепитьЕсли2(B:B,B366,D:D,\"; \",1),\"k\",)),\" \",сцепитьЕсли2(B:B,B366,D:D,\", \",1))","v":"AntiMW 249 2 k49, k50"}]
["Петров","AntiMW","Kasper","k49","урл50",{"$f":"CONCATENATE(B367,\" \",COUNTIF(B:B,B367),\" \",LEN(сцепитьЕсли2(B:B,B367,D:D,\", \",1))-LEN(SUBSTITUTE(сцепитьЕсли2(B:B,B367,D:D,\"; \",1),\"k\",)),\" \",сцепитьЕсли2(B:B,B367,D:D,\", \",1))","v":"AntiMW 249 2 k49, k50"}]
["Иванов","win11","Microsoft","k11","урл1",{"$f":"CONCATENATE(B368,\" \",COUNTIF(B:B,B368),\" \",LEN(сцепитьЕсли2(B:B,B368,D:D,\", \",1))-LEN(SUBSTITUTE(сцепитьЕсли2(B:B,B368,D:D,\"; \",1),\"k\",)),\" \",сцепитьЕсли2(B:B,B368,D:D,\", \",1))","v":"win11 168 2 k11, k12"}]
["Петров","win11","Microsoft","k12","урл2",{"$f":"CONCATENATE(B369,\" \",COUNTIF(B:B,B369),\" \",LEN(сцепитьЕсли2(B:B,B369,D:D,\", \",1))-LEN(SUBSTITUTE(сцепитьЕсли2(B:B,B369,D:D,\"; \",1),\"k\",)),\" \",сцепитьЕсли2(B:B,B369,D:D,\", \",1))","v":"win11 168 2 k11, k12"}]
["Петров","win10","Microsoft","k13","урл1",{"$f":"CONCATENATE(B370,\" \",COUNTIF(B:B,B370),\" \",LEN(сцепитьЕсли2(B:B,B370,D:D,\", \",1))-LEN(SUBSTITUTE(сцепитьЕсли2(B:B,B370,D:D,\"; \",1),\"k\",)),\" \",сцепитьЕсли2(B:B,B370,D:D,\", \",1))","v":"win10 82 1 k13"}]
["Сидоров","AntiMW","Kasper","k49","урл10",{"$f":"CONCATENATE(B371,\" \",COUNTIF(B:B,B371),\" \",LEN(сцепитьЕсли2(B:B,B371,D:D,\", \",1))-LEN(SUBSTITUTE(сцепитьЕсли2(B:B,B371,D:D,\"; \",1),\"k\",)),\" \",сцепитьЕсли2(B:B,B371,D:D,\", \",1))","v":"AntiMW 249 2 k49, k50"}]
["Котов","AntiMW","Kasper","k50","урл10",{"$f":"CONCATENATE(B372,\" \",COUNTIF(B:B,B372),\" \",LEN(сцепитьЕсли2(B:B,B372,D:D,\", \",1))-LEN(SUBSTITUTE(сцепитьЕсли2(B:B,B372,D:D,\"; \",1),\"k\",)),\" \",сцепитьЕсли2(B:B,B372,D:D,\", \",1))","v":"AntiMW 249 2 k49, k50"}]
["Петров","AntiMW","Kasper","k49","урл50",{"$f":"CONCATENATE(B373,\" \",COUNTIF(B:B,B373),\" \",LEN(сцепитьЕсли2(B:B,B373,D:D,\", \",1))-LEN(SUBSTITUTE(сцепитьЕсли2(B:B,B373,D:D,\"; \",1),\"k\",)),\" \",сцепитьЕсли2(B:B,B373,D:D,\", \",1))","v":"AntiMW 249 2 k49, k50"}]
["Иванов","win11","Microsoft","k11","урл1",{"$f":"CONCATENATE(B374,\" \",COUNTIF(B:B,B374),\" \",LEN(сцепитьЕсли2(B:B,B374,D:D,\", \",1))-LEN(SUBSTITUTE(сцепитьЕсли2(B:B,B374,D:D,\"; \",1),\"k\",)),\" \",сцепитьЕсли2(B:B,B374,D:D,\", \",1))","v":"win11 168 2 k11, k12"}]
["Петров","win11","Microsoft","k12","урл2",{"$f":"CONCATENATE(B375,\" \",COUNTIF(B:B,B375),\" \",LEN(сцепитьЕсли2(B:B,B375,D:D,\", \",1))-LEN(SUBSTITUTE(сцепитьЕсли2(B:B,B375,D:D,\"; \",1),\"k\",)),\" \",сцепитьЕсли2(B:B,B375,D:D,\", \",1))","v":"win11 168 2 k11, k12"}]
["Петров","win10","Microsoft","k13","урл1",{"$f":"CONCATENATE(B376,\" \",COUNTIF(B:B,B376),\" \",LEN(сцепитьЕсли2(B:B,B376,D:D,\", \",1))-LEN(SUBSTITUTE(сцепитьЕсли2(B:B,B376,D:D,\"; \",1),\"k\",)),\" \",сцепитьЕсли2(B:B,B376,D:D,\", \",1))","v":"win10 82 1 k13"}]
["Сидоров","AntiMW","Kasper","k49","урл10",{"$f":"CONCATENATE(B377,\" \",COUNTIF(B:B,B377),\" \",LEN(сцепитьЕсли2(B:B,B377,D:D,\", \",1))-LEN(SUBSTITUTE(сцепитьЕсли2(B:B,B377,D:D,\"; \",1),\"k\",)),\" \",сцепитьЕсли2(B:B,B377,D:D,\", \",1))","v":"AntiMW 249 2 k49, k50"}]
["Котов","AntiMW","Kasper","k50","урл10",{"$f":"CONCATENATE(B378,\" \",COUNTIF(B:B,B378),\" \",LEN(сцепитьЕсли2(B:B,B378,D:D,\", \",1))-LEN(SUBSTITUTE(сцепитьЕсли2(B:B,B378,D:D,\"; \",1),\"k\",)),\" \",сцепитьЕсли2(B:B,B378,D:D,\", \",1))","v":"AntiMW 249 2 k49, k50"}]
["Петров","AntiMW","Kasper","k49","урл50",{"$f":"CONCATENATE(B379,\" \",COUNTIF(B:B,B379),\" \",LEN(сцепитьЕсли2(B:B,B379,D:D,\", \",1))-LEN(SUBSTITUTE(сцепитьЕсли2(B:B,B379,D:D,\"; \",1),\"k\",)),\" \",сцепитьЕсли2(B:B,B379,D:D,\", \",1))","v":"AntiMW 249 2 k49, k50"}]
["Иванов","win11","Microsoft","k11","урл1",{"$f":"CONCATENATE(B380,\" \",COUNTIF(B:B,B380),\" \",LEN(сцепитьЕсли2(B:B,B380,D:D,\", \",1))-LEN(SUBSTITUTE(сцепитьЕсли2(B:B,B380,D:D,\"; \",1),\"k\",)),\" \",сцепитьЕсли2(B:B,B380,D:D,\", \",1))","v":"win11 168 2 k11, k12"}]
["Петров","win11","Microsoft","k12","урл2",{"$f":"CONCATENATE(B381,\" \",COUNTIF(B:B,B381),\" \",LEN(сцепитьЕсли2(B:B,B381,D:D,\", \",1))-LEN(SUBSTITUTE(сцепитьЕсли2(B:B,B381,D:D,\"; \",1),\"k\",)),\" \",сцепитьЕсли2(B:B,B381,D:D,\", \",1))","v":"win11 168 2 k11, k12"}]
["Петров","win10","Microsoft","k13","урл1",{"$f":"CONCATENATE(B382,\" \",COUNTIF(B:B,B382),\" \",LEN(сцепитьЕсли2(B:B,B382,D:D,\", \",1))-LEN(SUBSTITUTE(сцепитьЕсли2(B:B,B382,D:D,\"; \",1),\"k\",)),\" \",сцепитьЕсли2(B:B,B382,D:D,\", \",1))","v":"win10 82 1 k13"}]
["Сидоров","AntiMW","Kasper","k49","урл10",{"$f":"CONCATENATE(B383,\" \",COUNTIF(B:B,B383),\" \",LEN(сцепитьЕсли2(B:B,B383,D:D,\", \",1))-LEN(SUBSTITUTE(сцепитьЕсли2(B:B,B383,D:D,\"; \",1),\"k\",)),\" \",сцепитьЕсли2(B:B,B383,D:D,\", \",1))","v":"AntiMW 249 2 k49, k50"}]
["Котов","AntiMW","Kasper","k50","урл10",{"$f":"CONCATENATE(B384,\" \",COUNTIF(B:B,B384),\" \",LEN(сцепитьЕсли2(B:B,B384,D:D,\", \",1))-LEN(SUBSTITUTE(сцепитьЕсли2(B:B,B384,D:D,\"; \",1),\"k\",)),\" \",сцепитьЕсли2(B:B,B384,D:D,\", \",1))","v":"AntiMW 249 2 k49, k50"}]
["Петров","AntiMW","Kasper","k49","урл50",{"$f":"CONCATENATE(B385,\" \",COUNTIF(B:B,B385),\" \",LEN(сцепитьЕсли2(B:B,B385,D:D,\", \",1))-LEN(SUBSTITUTE(сцепитьЕсли2(B:B,B385,D:D,\"; \",1),\"k\",)),\" \",сцепитьЕсли2(B:B,B385,D:D,\", \",1))","v":"AntiMW 249 2 k49, k50"}]
["Иванов","win11","Microsoft","k11","урл1",{"$f":"CONCATENATE(B386,\" \",COUNTIF(B:B,B386),\" \",LEN(сцепитьЕсли2(B:B,B386,D:D,\", \",1))-LEN(SUBSTITUTE(сцепитьЕсли2(B:B,B386,D:D,\"; \",1),\"k\",)),\" \",сцепитьЕсли2(B:B,B386,D:D,\", \",1))","v":"win11 168 2 k11, k12"}]
["Петров","win11","Microsoft","k12","урл2",{"$f":"CONCATENATE(B387,\" \",COUNTIF(B:B,B387),\" \",LEN(сцепитьЕсли2(B:B,B387,D:D,\", \",1))-LEN(SUBSTITUTE(сцепитьЕсли2(B:B,B387,D:D,\"; \",1),\"k\",)),\" \",сцепитьЕсли2(B:B,B387,D:D,\", \",1))","v":"win11 168 2 k11, k12"}]
["Петров","win10","Microsoft","k13","урл1",{"$f":"CONCATENATE(B388,\" \",COUNTIF(B:B,B388),\" \",LEN(сцепитьЕсли2(B:B,B388,D:D,\", \",1))-LEN(SUBSTITUTE(сцепитьЕсли2(B:B,B388,D:D,\"; \",1),\"k\",)),\" \",сцепитьЕсли2(B:B,B388,D:D,\", \",1))","v":"win10 82 1 k13"}]
["Сидоров","AntiMW","Kasper","k49","урл10",{"$f":"CONCATENATE(B389,\" \",COUNTIF(B:B,B389),\" \",LEN(сцепитьЕсли2(B:B,B389,D:D,\", \",1))-LEN(SUBSTITUTE(сцепитьЕсли2(B:B,B389,D:D,\"; \",1),\"k\",)),\" \",сцепитьЕсли2(B:B,B389,D:D,\", \",1))","v":"AntiMW 249 2 k49, k50"}]
["Котов","AntiMW","Kasper","k50","урл10",{"$f":"CONCATENATE(B390,\" \",COUNTIF(B:B,B390),\" \",LEN(сцепитьЕсли2(B:B,B390,D:D,\", \",1))-LEN(SUBSTITUTE(сцепитьЕсли2(B:B,B390,D:D,\"; \",1),\"k\",)),\" \",сцепитьЕсли2(B:B,B390,D:D,\", \",1))","v":"AntiMW 249 2 k49, k50"}]
["Петров","AntiMW","Kasper","k49","урл50",{"$f":"CONCATENATE(B391,\" \",COUNTIF(B:B,B391),\" \",LEN(сцепитьЕсли2(B:B,B391,D:D,\", \",1))-LEN(SUBSTITUTE(сцепитьЕсли2(B:B,B391,D:D,\"; \",1),\"k\",)),\" \",сцепитьЕсли2(B:B,B391,D:D,\", \",1))","v":"AntiMW 249 2 k49, k50"}]
["Иванов","win11","Microsoft","k11","урл1",{"$f":"CONCATENATE(B392,\" \",COUNTIF(B:B,B392),\" \",LEN(сцепитьЕсли2(B:B,B392,D:D,\", \",1))-LEN(SUBSTITUTE(сцепитьЕсли2(B:B,B392,D:D,\"; \",1),\"k\",)),\" \",сцепитьЕсли2(B:B,B392,D:D,\", \",1))","v":"win11 168 2 k11, k12"}]
["Петров","win11","Microsoft","k12","урл2",{"$f":"CONCATENATE(B393,\" \",COUNTIF(B:B,B393),\" \",LEN(сцепитьЕсли2(B:B,B393,D:D,\", \",1))-LEN(SUBSTITUTE(сцепитьЕсли2(B:B,B393,D:D,\"; \",1),\"k\",)),\" \",сцепитьЕсли2(B:B,B393,D:D,\", \",1))","v":"win11 168 2 k11, k12"}]
["Петров","win10","Microsoft","k13","урл1",{"$f":"CONCATENATE(B394,\" \",COUNTIF(B:B,B394),\" \",LEN(сцепитьЕсли2(B:B,B394,D:D,\", \",1))-LEN(SUBSTITUTE(сцепитьЕсли2(B:B,B394,D:D,\"; \",1),\"k\",)),\" \",сцепитьЕсли2(B:B,B394,D:D,\", \",1))","v":"win10 82 1 k13"}]
["Сидоров","AntiMW","Kasper","k49","урл10",{"$f":"CONCATENATE(B395,\" \",COUNTIF(B:B,B395),\" \",LEN(сцепитьЕсли2(B:B,B395,D:D,\", \",1))-LEN(SUBSTITUTE(сцепитьЕсли2(B:B,B395,D:D,\"; \",1),\"k\",)),\" \",сцепитьЕсли2(B:B,B395,D:D,\", \",1))","v":"AntiMW 249 2 k49, k50"}]
["Котов","AntiMW","Kasper","k50","урл10",{"$f":"CONCATENATE(B396,\" \",COUNTIF(B:B,B396),\" \",LEN(сцепитьЕсли2(B:B,B396,D:D,\", \",1))-LEN(SUBSTITUTE(сцепитьЕсли2(B:B,B396,D:D,\"; \",1),\"k\",)),\" \",сцепитьЕсли2(B:B,B396,D:D,\", \",1))","v":"AntiMW 249 2 k49, k50"}]
["Петров","AntiMW","Kasper","k49","урл50",{"$f":"CONCATENATE(B397,\" \",COUNTIF(B:B,B397),\" \",LEN(сцепитьЕсли2(B:B,B397,D:D,\", \",1))-LEN(SUBSTITUTE(сцепитьЕсли2(B:B,B397,D:D,\"; \",1),\"k\",)),\" \",сцепитьЕсли2(B:B,B397,D:D,\", \",1))","v":"AntiMW 249 2 k49, k50"}]
["Иванов","win11","Microsoft","k11","урл1",{"$f":"CONCATENATE(B398,\" \",COUNTIF(B:B,B398),\" \",LEN(сцепитьЕсли2(B:B,B398,D:D,\", \",1))-LEN(SUBSTITUTE(сцепитьЕсли2(B:B,B398,D:D,\"; \",1),\"k\",)),\" \",сцепитьЕсли2(B:B,B398,D:D,\", \",1))","v":"win11 168 2 k11, k12"}]
["Петров","win11","Microsoft","k12","урл2",{"$f":"CONCATENATE(B399,\" \",COUNTIF(B:B,B399),\" \",LEN(сцепитьЕсли2(B:B,B399,D:D,\", \",1))-LEN(SUBSTITUTE(сцепитьЕсли2(B:B,B399,D:D,\"; \",1),\"k\",)),\" \",сцепитьЕсли2(B:B,B399,D:D,\", \",1))","v":"win11 168 2 k11, k12"}]
["Петров","win10","Microsoft","k13","урл1",{"$f":"CONCATENATE(B400,\" \",COUNTIF(B:B,B400),\" \",LEN(сцепитьЕсли2(B:B,B400,D:D,\", \",1))-LEN(SUBSTITUTE(сцепитьЕсли2(B:B,B400,D:D,\"; \",1),\"k\",)),\" \",сцепитьЕсли2(B:B,B400,D:D,\", \",1))","v":"win10 82 1 k13"}]
["Сидоров","AntiMW","Kasper","k49","урл10",{"$f":"CONCATENATE(B401,\" \",COUNTIF(B:B,B401),\" \",LEN(сцепитьЕсли2(B:B,B401,D:D,\", \",1))-LEN(SUBSTITUTE(сцепитьЕсли2(B:B,B401,D:D,\"; \",1),\"k\",)),\" \",сцепитьЕсли2(B:B,B401,D:D,\", \",1))","v":"AntiMW 249 2 k49, k50"}]
["Котов","AntiMW","Kasper","k50","урл10",{"$f":"CONCATENATE(B402,\" \",COUNTIF(B:B,B402),\" \",LEN(сцепитьЕсли2(B:B,B402,D:D,\", \",1))-LEN(SUBSTITUTE(сцепитьЕсли2(B:B,B402,D:D,\"; \",1),\"k\",)),\" \",сцепитьЕсли2(B:B,B402,D:D,\", \",1))","v":"AntiMW 249 2 k49, k50"}]
["Петров","AntiMW","Kasper","k49","урл50",{"$f":"CONCATENATE(B403,\" \",COUNTIF(B:B,B403),\" \",LEN(сцепитьЕсли2(B:B,B403,D:D,\", \",1))-LEN(SUBSTITUTE(сцепитьЕсли2(B:B,B403,D:D,\"; \",1),\"k\",)),\" \",сцепитьЕсли2(B:B,B403,D:D,\", \",1))","v":"AntiMW 249 2 k49, k50"}]
["Иванов","win11","Microsoft","k11","урл1",{"$f":"CONCATENATE(B404,\" \",COUNTIF(B:B,B404),\" \",LEN(сцепитьЕсли2(B:B,B404,D:D,\", \",1))-LEN(SUBSTITUTE(сцепитьЕсли2(B:B,B404,D:D,\"; \",1),\"k\",)),\" \",сцепитьЕсли2(B:B,B404,D:D,\", \",1))","v":"win11 168 2 k11, k12"}]
["Петров","win11","Microsoft","k12","урл2",{"$f":"CONCATENATE(B405,\" \",COUNTIF(B:B,B405),\" \",LEN(сцепитьЕсли2(B:B,B405,D:D,\", \",1))-LEN(SUBSTITUTE(сцепитьЕсли2(B:B,B405,D:D,\"; \",1),\"k\",)),\" \",сцепитьЕсли2(B:B,B405,D:D,\", \",1))","v":"win11 168 2 k11, k12"}]
["Петров","win10","Microsoft","k13","урл1",{"$f":"CONCATENATE(B406,\" \",COUNTIF(B:B,B406),\" \",LEN(сцепитьЕсли2(B:B,B406,D:D,\", \",1))-LEN(SUBSTITUTE(сцепитьЕсли2(B:B,B406,D:D,\"; \",1),\"k\",)),\" \",сцепитьЕсли2(B:B,B406,D:D,\", \",1))","v":"win10 82 1 k13"}]
["Сидоров","AntiMW","Kasper","k49","урл10",{"$f":"CONCATENATE(B407,\" \",COUNTIF(B:B,B407),\" \",LEN(сцепитьЕсли2(B:B,B407,D:D,\", \",1))-LEN(SUBSTITUTE(сцепитьЕсли2(B:B,B407,D:D,\"; \",1),\"k\",)),\" \",сцепитьЕсли2(B:B,B407,D:D,\", \",1))","v":"AntiMW 249 2 k49, k50"}]
["Котов","AntiMW","Kasper","k50","урл10",{"$f":"CONCATENATE(B408,\" \",COUNTIF(B:B,B408),\" \",LEN(сцепитьЕсли2(B:B,B408,D:D,\", \",1))-LEN(SUBSTITUTE(сцепитьЕсли2(B:B,B408,D:D,\"; \",1),\"k\",)),\" \",сцепитьЕсли2(B:B,B408,D:D,\", \",1))","v":"AntiMW 249 2 k49, k50"}]
["Петров","AntiMW","Kasper","k49","урл50",{"$f":"CONCATENATE(B409,\" \",COUNTIF(B:B,B409),\" \",LEN(сцепитьЕсли2(B:B,B409,D:D,\", \",1))-LEN(SUBSTITUTE(сцепитьЕсли2(B:B,B409,D:D,\"; \",1),\"k\",)),\" \",сцепитьЕсли2(B:B,B409,D:D,\", \",1))","v":"AntiMW 249 2 k49, k50"}]
["Иванов","win11","Microsoft","k11","урл1",{"$f":"CONCATENATE(B410,\" \",COUNTIF(B:B,B410),\" \",LEN(сцепитьЕсли2(B:B,B410,D:D,\", \",1))-LEN(SUBSTITUTE(сцепитьЕсли2(B:B,B410,D:D,\"; \",1),\"k\",)),\" \",сцепитьЕсли2(B:B,B410,D:D,\", \",1))","v":"win11 168 2 k11, k12"}]
["Петров","win11","Microsoft","k12","урл2",{"$f":"CONCATENATE(B411,\" \",COUNTIF(B:B,B411),\" \",LEN(сцепитьЕсли2(B:B,B411,D:D,\", \",1))-LEN(SUBSTITUTE(сцепитьЕсли2(B:B,B411,D:D,\"; \",1),\"k\",)),\" \",сцепитьЕсли2(B:B,B411,D:D,\", \",1))","v":"win11 168 2 k11, k12"}]
["Петров","win10","Microsoft","k13","урл1",{"$f":"CONCATENATE(B412,\" \",COUNTIF(B:B,B412),\" \",LEN(сцепитьЕсли2(B:B,B412,D:D,\", \",1))-LEN(SUBSTITUTE(сцепитьЕсли2(B:B,B412,D:D,\"; \",1),\"k\",)),\" \",сцепитьЕсли2(B:B,B412,D:D,\", \",1))","v":"win10 82 1 k13"}]
["Сидоров","AntiMW","Kasper","k49","урл10",{"$f":"CONCATENATE(B413,\" \",COUNTIF(B:B,B413),\" \",LEN(сцепитьЕсли2(B:B,B413,D:D,\", \",1))-LEN(SUBSTITUTE(сцепитьЕсли2(B:B,B413,D:D,\"; \",1),\"k\",)),\" \",сцепитьЕсли2(B:B,B413,D:D,\", \",1))","v":"AntiMW 249 2 k49, k50"}]
["Котов","AntiMW","Kasper","k50","урл10",{"$f":"CONCATENATE(B414,\" \",COUNTIF(B:B,B414),\" \",LEN(сцепитьЕсли2(B:B,B414,D:D,\", \",1))-LEN(SUBSTITUTE(сцепитьЕсли2(B:B,B414,D:D,\"; \",1),\"k\",)),\" \",сцепитьЕсли2(B:B,B414,D:D,\", \",1))","v":"AntiMW 249 2 k49, k50"}]
["Петров","AntiMW","Kasper","k49","урл50",{"$f":"CONCATENATE(B415,\" \",COUNTIF(B:B,B415),\" \",LEN(сцепитьЕсли2(B:B,B415,D:D,\", \",1))-LEN(SUBSTITUTE(сцепитьЕсли2(B:B,B415,D:D,\"; \",1),\"k\",)),\" \",сцепитьЕсли2(B:B,B415,D:D,\", \",1))","v":"AntiMW 249 2 k49, k50"}]
["Иванов","win11","Microsoft","k11","урл1",{"$f":"CONCATENATE(B416,\" \",COUNTIF(B:B,B416),\" \",LEN(сцепитьЕсли2(B:B,B416,D:D,\", \",1))-LEN(SUBSTITUTE(сцепитьЕсли2(B:B,B416,D:D,\"; \",1),\"k\",)),\" \",сцепитьЕсли2(B:B,B416,D:D,\", \",1))","v":"win11 168 2 k11, k12"}]
["Петров","win11","Microsoft","k12","урл2",{"$f":"CONCATENATE(B417,\" \",COUNTIF(B:B,B417),\" \",LEN(сцепитьЕсли2(B:B,B417,D:D,\", \",1))-LEN(SUBSTITUTE(сцепитьЕсли2(B:B,B417,D:D,\"; \",1),\"k\",)),\" \",сцепитьЕсли2(B:B,B417,D:D,\", \",1))","v":"win11 168 2 k11, k12"}]
["Петров","win10","Microsoft","k13","урл1",{"$f":"CONCATENATE(B418,\" \",COUNTIF(B:B,B418),\" \",LEN(сцепитьЕсли2(B:B,B418,D:D,\", \",1))-LEN(SUBSTITUTE(сцепитьЕсли2(B:B,B418,D:D,\"; \",1),\"k\",)),\" \",сцепитьЕсли2(B:B,B418,D:D,\", \",1))","v":"win10 82 1 k13"}]
["Сидоров","AntiMW","Kasper","k49","урл10",{"$f":"CONCATENATE(B419,\" \",COUNTIF(B:B,B419),\" \",LEN(сцепитьЕсли2(B:B,B419,D:D,\", \",1))-LEN(SUBSTITUTE(сцепитьЕсли2(B:B,B419,D:D,\"; \",1),\"k\",)),\" \",сцепитьЕсли2(B:B,B419,D:D,\", \",1))","v":"AntiMW 249 2 k49, k50"}]
["Котов","AntiMW","Kasper","k50","урл10",{"$f":"CONCATENATE(B420,\" \",COUNTIF(B:B,B420),\" \",LEN(сцепитьЕсли2(B:B,B420,D:D,\", \",1))-LEN(SUBSTITUTE(сцепитьЕсли2(B:B,B420,D:D,\"; \",1),\"k\",)),\" \",сцепитьЕсли2(B:B,B420,D:D,\", \",1))","v":"AntiMW 249 2 k49, k50"}]
["Петров","AntiMW","Kasper","k49","урл50",{"$f":"CONCATENATE(B421,\" \",COUNTIF(B:B,B421),\" \",LEN(сцепитьЕсли2(B:B,B421,D:D,\", \",1))-LEN(SUBSTITUTE(сцепитьЕсли2(B:B,B421,D:D,\"; \",1),\"k\",)),\" \",сцепитьЕсли2(B:B,B421,D:D,\", \",1))","v":"AntiMW 249 2 k49, k50"}]
["Иванов","win11","Microsoft","k11","урл1",{"$f":"CONCATENATE(B422,\" \",COUNTIF(B:B,B422),\" \",LEN(сцепитьЕсли2(B:B,B422,D:D,\", \",1))-LEN(SUBSTITUTE(сцепитьЕсли2(B:B,B422,D:D,\"; \",1),\"k\",)),\" \",сцепитьЕсли2(B:B,B422,D:D,\", \",1))","v":"win11 168 2 k11, k12"}]
["Петров","win11","Microsoft","k12","урл2",{"$f":"CONCATENATE(B423,\" \",COUNTIF(B:B,B423),\" \",LEN(сцепитьЕсли2(B:B,B423,D:D,\", \",1))-LEN(SUBSTITUTE(сцепитьЕсли2(B:B,B423,D:D,\"; \",1),\"k\",)),\" \",сцепитьЕсли2(B:B,B423,D:D,\", \",1))","v":"win11 168 2 k11, k12"}]
["Петров","win10","Microsoft","k13","урл1",{"$f":"CONCATENATE(B424,\" \",COUNTIF(B:B,B424),\" \",LEN(сцепитьЕсли2(B:B,B424,D:D,\", \",1))-LEN(SUBSTITUTE(сцепитьЕсли2(B:B,B424,D:D,\"; \",1),\"k\",)),\" \",сцепитьЕсли2(B:B,B424,D:D,\", \",1))","v":"win10 82 1 k13"}]
["Сидоров","AntiMW","Kasper","k49","урл10",{"$f":"CONCATENATE(B425,\" \",COUNTIF(B:B,B425),\" \",LEN(сцепитьЕсли2(B:B,B425,D:D,\", \",1))-LEN(SUBSTITUTE(сцепитьЕсли2(B:B,B425,D:D,\"; \",1),\"k\",)),\" \",сцепитьЕсли2(B:B,B425,D:D,\", \",1))","v":"AntiMW 249 2 k49, k50"}]
["Котов","AntiMW","Kasper","k50","урл10",{"$f":"CONCATENATE(B426,\" \",COUNTIF(B:B,B426),\" \",LEN(сцепитьЕсли2(B:B,B426,D:D,\", \",1))-LEN(SUBSTITUTE(сцепитьЕсли2(B:B,B426,D:D,\"; \",1),\"k\",)),\" \",сцепитьЕсли2(B:B,B426,D:D,\", \",1))","v":"AntiMW 249 2 k49, k50"}]
["Петров","AntiMW","Kasper","k49","урл50",{"$f":"CONCATENATE(B427,\" \",COUNTIF(B:B,B427),\" \",LEN(сцепитьЕсли2(B:B,B427,D:D,\", \",1))-LEN(SUBSTITUTE(сцепитьЕсли2(B:B,B427,D:D,\"; \",1),\"k\",)),\" \",сцепитьЕсли2(B:B,B427,D:D,\", \",1))","v":"AntiMW 249 2 k49, k50"}]
["Иванов","win11","Microsoft","k11","урл1",{"$f":"CONCATENATE(B428,\" \",COUNTIF(B:B,B428),\" \",LEN(сцепитьЕсли2(B:B,B428,D:D,\", \",1))-LEN(SUBSTITUTE(сцепитьЕсли2(B:B,B428,D:D,\"; \",1),\"k\",)),\" \",сцепитьЕсли2(B:B,B428,D:D,\", \",1))","v":"win11 168 2 k11, k12"}]
["Петров","win11","Microsoft","k12","урл2",{"$f":"CONCATENATE(B429,\" \",COUNTIF(B:B,B429),\" \",LEN(сцепитьЕсли2(B:B,B429,D:D,\", \",1))-LEN(SUBSTITUTE(сцепитьЕсли2(B:B,B429,D:D,\"; \",1),\"k\",)),\" \",сцепитьЕсли2(B:B,B429,D:D,\", \",1))","v":"win11 168 2 k11, k12"}]
["Петров","win10","Microsoft","k13","урл1",{"$f":"CONCATENATE(B430,\" \",COUNTIF(B:B,B430),\" \",LEN(сцепитьЕсли2(B:B,B430,D:D,\", \",1))-LEN(SUBSTITUTE(сцепитьЕсли2(B:B,B430,D:D,\"; \",1),\"k\",)),\" \",сцепитьЕсли2(B:B,B430,D:D,\", \",1))","v":"win10 82 1 k13"}]
["Сидоров","AntiMW","Kasper","k49","урл10",{"$f":"CONCATENATE(B431,\" \",COUNTIF(B:B,B431),\" \",LEN(сцепитьЕсли2(B:B,B431,D:D,\", \",1))-LEN(SUBSTITUTE(сцепитьЕсли2(B:B,B431,D:D,\"; \",1),\"k\",)),\" \",сцепитьЕсли2(B:B,B431,D:D,\", \",1))","v":"AntiMW 249 2 k49, k50"}]
["Котов","AntiMW","Kasper","k50","урл10",{"$f":"CONCATENATE(B432,\" \",COUNTIF(B:B,B432),\" \",LEN(сцепитьЕсли2(B:B,B432,D:D,\", \",1))-LEN(SUBSTITUTE(сцепитьЕсли2(B:B,B432,D:D,\"; \",1),\"k\",)),\" \",сцепитьЕсли2(B:B,B432,D:D,\", \",1))","v":"AntiMW 249 2 k49, k50"}]
["Петров","AntiMW","Kasper","k49","урл50",{"$f":"CONCATENATE(B433,\" \",COUNTIF(B:B,B433),\" \",LEN(сцепитьЕсли2(B:B,B433,D:D,\", \",1))-LEN(SUBSTITUTE(сцепитьЕсли2(B:B,B433,D:D,\"; \",1),\"k\",)),\" \",сцепитьЕсли2(B:B,B433,D:D,\", \",1))","v":"AntiMW 249 2 k49, k50"}]
["Иванов","win11","Microsoft","k11","урл1",{"$f":"CONCATENATE(B434,\" \",COUNTIF(B:B,B434),\" \",LEN(сцепитьЕсли2(B:B,B434,D:D,\", \",1))-LEN(SUBSTITUTE(сцепитьЕсли2(B:B,B434,D:D,\"; \",1),\"k\",)),\" \",сцепитьЕсли2(B:B,B434,D:D,\", \",1))","v":"win11 168 2 k11, k12"}]
["Петров","win11","Microsoft","k12","урл2",{"$f":"CONCATENATE(B435,\" \",COUNTIF(B:B,B435),\" \",LEN(сцепитьЕсли2(B:B,B435,D:D,\", \",1))-LEN(SUBSTITUTE(сцепитьЕсли2(B:B,B435,D:D,\"; \",1),\"k\",)),\" \",сцепитьЕсли2(B:B,B435,D:D,\", \",1))","v":"win11 168 2 k11, k12"}]
["Петров","win10","Microsoft","k13","урл1",{"$f":"CONCATENATE(B436,\" \",COUNTIF(B:B,B436),\" \",LEN(сцепитьЕсли2(B:B,B436,D:D,\", \",1))-LEN(SUBSTITUTE(сцепитьЕсли2(B:B,B436,D:D,\"; \",1),\"k\",)),\" \",сцепитьЕсли2(B:B,B436,D:D,\", \",1))","v":"win10 82 1 k13"}]
["Сидоров","AntiMW","Kasper","k49","урл10",{"$f":"CONCATENATE(B437,\" \",COUNTIF(B:B,B437),\" \",LEN(сцепитьЕсли2(B:B,B437,D:D,\", \",1))-LEN(SUBSTITUTE(сцепитьЕсли2(B:B,B437,D:D,\"; \",1),\"k\",)),\" \",сцепитьЕсли2(B:B,B437,D:D,\", \",1))","v":"AntiMW 249 2 k49, k50"}]
["Котов","AntiMW","Kasper","k50","урл10",{"$f":"CONCATENATE(B438,\" \",COUNTIF(B:B,B438),\" \",LEN(сцепитьЕсли2(B:B,B438,D:D,\", \",1))-LEN(SUBSTITUTE(сцепитьЕсли2(B:B,B438,D:D,\"; \",1),\"k\",)),\" \",сцепитьЕсли2(B:B,B438,D:D,\", \",1))","v":"AntiMW 249 2 k49, k50"}]
["Петров","AntiMW","Kasper","k49","урл50",{"$f":"CONCATENATE(B439,\" \",COUNTIF(B:B,B439),\" \",LEN(сцепитьЕсли2(B:B,B439,D:D,\", \",1))-LEN(SUBSTITUTE(сцепитьЕсли2(B:B,B439,D:D,\"; \",1),\"k\",)),\" \",сцепитьЕсли2(B:B,B439,D:D,\", \",1))","v":"AntiMW 249 2 k49, k50"}]
["Иванов","win11","Microsoft","k11","урл1",{"$f":"CONCATENATE(B440,\" \",COUNTIF(B:B,B440),\" \",LEN(сцепитьЕсли2(B:B,B440,D:D,\", \",1))-LEN(SUBSTITUTE(сцепитьЕсли2(B:B,B440,D:D,\"; \",1),\"k\",)),\" \",сцепитьЕсли2(B:B,B440,D:D,\", \",1))","v":"win11 168 2 k11, k12"}]
["Петров","win11","Microsoft","k12","урл2",{"$f":"CONCATENATE(B441,\" \",COUNTIF(B:B,B441),\" \",LEN(сцепитьЕсли2(B:B,B441,D:D,\", \",1))-LEN(SUBSTITUTE(сцепитьЕсли2(B:B,B441,D:D,\"; \",1),\"k\",)),\" \",сцепитьЕсли2(B:B,B441,D:D,\", \",1))","v":"win11 168 2 k11, k12"}]
["Петров","win10","Microsoft","k13","урл1",{"$f":"CONCATENATE(B442,\" \",COUNTIF(B:B,B442),\" \",LEN(сцепитьЕсли2(B:B,B442,D:D,\", \",1))-LEN(SUBSTITUTE(сцепитьЕсли2(B:B,B442,D:D,\"; \",1),\"k\",)),\" \",сцепитьЕсли2(B:B,B442,D:D,\", \",1))","v":"win10 82 1 k13"}]
["Сидоров","AntiMW","Kasper","k49","урл10",{"$f":"CONCATENATE(B443,\" \",COUNTIF(B:B,B443),\" \",LEN(сцепитьЕсли2(B:B,B443,D:D,\", \",1))-LEN(SUBSTITUTE(сцепитьЕсли2(B:B,B443,D:D,\"; \",1),\"k\",)),\" \",сцепитьЕсли2(B:B,B443,D:D,\", \",1))","v":"AntiMW 249 2 k49, k50"}]
["Котов","AntiMW","Kasper","k50","урл10",{"$f":"CONCATENATE(B444,\" \",COUNTIF(B:B,B444),\" \",LEN(сцепитьЕсли2(B:B,B444,D:D,\", \",1))-LEN(SUBSTITUTE(сцепитьЕсли2(B:B,B444,D:D,\"; \",1),\"k\",)),\" \",сцепитьЕсли2(B:B,B444,D:D,\", \",1))","v":"AntiMW 249 2 k49, k50"}]
["Петров","AntiMW","Kasper","k49","урл50",{"$f":"CONCATENATE(B445,\" \",COUNTIF(B:B,B445),\" \",LEN(сцепитьЕсли2(B:B,B445,D:D,\", \",1))-LEN(SUBSTITUTE(сцепитьЕсли2(B:B,B445,D:D,\"; \",1),\"k\",)),\" \",сцепитьЕсли2(B:B,B445,D:D,\", \",1))","v":"AntiMW 249 2 k49, k50"}]
["Иванов","win11","Microsoft","k11","урл1",{"$f":"CONCATENATE(B446,\" \",COUNTIF(B:B,B446),\" \",LEN(сцепитьЕсли2(B:B,B446,D:D,\", \",1))-LEN(SUBSTITUTE(сцепитьЕсли2(B:B,B446,D:D,\"; \",1),\"k\",)),\" \",сцепитьЕсли2(B:B,B446,D:D,\", \",1))","v":"win11 168 2 k11, k12"}]
["Петров","win11","Microsoft","k12","урл2",{"$f":"CONCATENATE(B447,\" \",COUNTIF(B:B,B447),\" \",LEN(сцепитьЕсли2(B:B,B447,D:D,\", \",1))-LEN(SUBSTITUTE(сцепитьЕсли2(B:B,B447,D:D,\"; \",1),\"k\",)),\" \",сцепитьЕсли2(B:B,B447,D:D,\", \",1))","v":"win11 168 2 k11, k12"}]
["Петров","win10","Microsoft","k13","урл1",{"$f":"CONCATENATE(B448,\" \",COUNTIF(B:B,B448),\" \",LEN(сцепитьЕсли2(B:B,B448,D:D,\", \",1))-LEN(SUBSTITUTE(сцепитьЕсли2(B:B,B448,D:D,\"; \",1),\"k\",)),\" \",сцепитьЕсли2(B:B,B448,D:D,\", \",1))","v":"win10 82 1 k13"}]
["Сидоров","AntiMW","Kasper","k49","урл10",{"$f":"CONCATENATE(B449,\" \",COUNTIF(B:B,B449),\" \",LEN(сцепитьЕсли2(B:B,B449,D:D,\", \",1))-LEN(SUBSTITUTE(сцепитьЕсли2(B:B,B449,D:D,\"; \",1),\"k\",)),\" \",сцепитьЕсли2(B:B,B449,D:D,\", \",1))","v":"AntiMW 249 2 k49, k50"}]
["Котов","AntiMW","Kasper","k50","урл10",{"$f":"CONCATENATE(B450,\" \",COUNTIF(B:B,B450),\" \",LEN(сцепитьЕсли2(B:B,B450,D:D,\", \",1))-LEN(SUBSTITUTE(сцепитьЕсли2(B:B,B450,D:D,\"; \",1),\"k\",)),\" \",сцепитьЕсли2(B:B,B450,D:D,\", \",1))","v":"AntiMW 249 2 k49, k50"}]
["Петров","AntiMW","Kasper","k49","урл50",{"$f":"CONCATENATE(B451,\" \",COUNTIF(B:B,B451),\" \",LEN(сцепитьЕсли2(B:B,B451,D:D,\", \",1))-LEN(SUBSTITUTE(сцепитьЕсли2(B:B,B451,D:D,\"; \",1),\"k\",)),\" \",сцепитьЕсли2(B:B,B451,D:D,\", \",1))","v":"AntiMW 249 2 k49, k50"}]
["Иванов","win11","Microsoft","k11","урл1",{"$f":"CONCATENATE(B452,\" \",COUNTIF(B:B,B452),\" \",LEN(сцепитьЕсли2(B:B,B452,D:D,\", \",1))-LEN(SUBSTITUTE(сцепитьЕсли2(B:B,B452,D:D,\"; \",1),\"k\",)),\" \",сцепитьЕсли2(B:B,B452,D:D,\", \",1))","v":"win11 168 2 k11, k12"}]
["Петров","win11","Microsoft","k12","урл2",{"$f":"CONCATENATE(B453,\" \",COUNTIF(B:B,B453),\" \",LEN(сцепитьЕсли2(B:B,B453,D:D,\", \",1))-LEN(SUBSTITUTE(сцепитьЕсли2(B:B,B453,D:D,\"; \",1),\"k\",)),\" \",сцепитьЕсли2(B:B,B453,D:D,\", \",1))","v":"win11 168 2 k11, k12"}]
["Петров","win10","Microsoft","k13","урл1",{"$f":"CONCATENATE(B454,\" \",COUNTIF(B:B,B454),\" \",LEN(сцепитьЕсли2(B:B,B454,D:D,\", \",1))-LEN(SUBSTITUTE(сцепитьЕсли2(B:B,B454,D:D,\"; \",1),\"k\",)),\" \",сцепитьЕсли2(B:B,B454,D:D,\", \",1))","v":"win10 82 1 k13"}]
["Сидоров","AntiMW","Kasper","k49","урл10",{"$f":"CONCATENATE(B455,\" \",COUNTIF(B:B,B455),\" \",LEN(сцепитьЕсли2(B:B,B455,D:D,\", \",1))-LEN(SUBSTITUTE(сцепитьЕсли2(B:B,B455,D:D,\"; \",1),\"k\",)),\" \",сцепитьЕсли2(B:B,B455,D:D,\", \",1))","v":"AntiMW 249 2 k49, k50"}]
["Котов","AntiMW","Kasper","k50","урл10",{"$f":"CONCATENATE(B456,\" \",COUNTIF(B:B,B456),\" \",LEN(сцепитьЕсли2(B:B,B456,D:D,\", \",1))-LEN(SUBSTITUTE(сцепитьЕсли2(B:B,B456,D:D,\"; \",1),\"k\",)),\" \",сцепитьЕсли2(B:B,B456,D:D,\", \",1))","v":"AntiMW 249 2 k49, k50"}]
["Петров","AntiMW","Kasper","k49","урл50",{"$f":"CONCATENATE(B457,\" \",COUNTIF(B:B,B457),\" \",LEN(сцепитьЕсли2(B:B,B457,D:D,\", \",1))-LEN(SUBSTITUTE(сцепитьЕсли2(B:B,B457,D:D,\"; \",1),\"k\",)),\" \",сцепитьЕсли2(B:B,B457,D:D,\", \",1))","v":"AntiMW 249 2 k49, k50"}]
["Иванов","win11","Microsoft","k11","урл1",{"$f":"CONCATENATE(B458,\" \",COUNTIF(B:B,B458),\" \",LEN(сцепитьЕсли2(B:B,B458,D:D,\", \",1))-LEN(SUBSTITUTE(сцепитьЕсли2(B:B,B458,D:D,\"; \",1),\"k\",)),\" \",сцепитьЕсли2(B:B,B458,D:D,\", \",1))","v":"win11 168 2 k11, k12"}]
["Петров","win11","Microsoft","k12","урл2",{"$f":"CONCATENATE(B459,\" \",COUNTIF(B:B,B459),\" \",LEN(сцепитьЕсли2(B:B,B459,D:D,\", \",1))-LEN(SUBSTITUTE(сцепитьЕсли2(B:B,B459,D:D,\"; \",1),\"k\",)),\" \",сцепитьЕсли2(B:B,B459,D:D,\", \",1))","v":"win11 168 2 k11, k12"}]
["Петров","win10","Microsoft","k13","урл1",{"$f":"CONCATENATE(B460,\" \",COUNTIF(B:B,B460),\" \",LEN(сцепитьЕсли2(B:B,B460,D:D,\", \",1))-LEN(SUBSTITUTE(сцепитьЕсли2(B:B,B460,D:D,\"; \",1),\"k\",)),\" \",сцепитьЕсли2(B:B,B460,D:D,\", \",1))","v":"win10 82 1 k13"}]
["Сидоров","AntiMW","Kasper","k49","урл10",{"$f":"CONCATENATE(B461,\" \",COUNTIF(B:B,B461),\" \",LEN(сцепитьЕсли2(B:B,B461,D:D,\", \",1))-LEN(SUBSTITUTE(сцепитьЕсли2(B:B,B461,D:D,\"; \",1),\"k\",)),\" \",сцепитьЕсли2(B:B,B461,D:D,\", \",1))","v":"AntiMW 249 2 k49, k50"}]
["Котов","AntiMW","Kasper","k50","урл10",{"$f":"CONCATENATE(B462,\" \",COUNTIF(B:B,B462),\" \",LEN(сцепитьЕсли2(B:B,B462,D:D,\", \",1))-LEN(SUBSTITUTE(сцепитьЕсли2(B:B,B462,D:D,\"; \",1),\"k\",)),\" \",сцепитьЕсли2(B:B,B462,D:D,\", \",1))","v":"AntiMW 249 2 k49, k50"}]
["Петров","AntiMW","Kasper","k49","урл50",{"$f":"CONCATENATE(B463,\" \",COUNTIF(B:B,B463),\" \",LEN(сцепитьЕсли2(B:B,B463,D:D,\", \",1))-LEN(SUBSTITUTE(сцепитьЕсли2(B:B,B463,D:D,\"; \",1),\"k\",)),\" \",сцепитьЕсли2(B:B,B463,D:D,\", \",1))","v":"AntiMW 249 2 k49, k50"}]
["Иванов","win11","Microsoft","k11","урл1",{"$f":"CONCATENATE(B464,\" \",COUNTIF(B:B,B464),\" \",LEN(сцепитьЕсли2(B:B,B464,D:D,\", \",1))-LEN(SUBSTITUTE(сцепитьЕсли2(B:B,B464,D:D,\"; \",1),\"k\",)),\" \",сцепитьЕсли2(B:B,B464,D:D,\", \",1))","v":"win11 168 2 k11, k12"}]
["Петров","win11","Microsoft","k12","урл2",{"$f":"CONCATENATE(B465,\" \",COUNTIF(B:B,B465),\" \",LEN(сцепитьЕсли2(B:B,B465,D:D,\", \",1))-LEN(SUBSTITUTE(сцепитьЕсли2(B:B,B465,D:D,\"; \",1),\"k\",)),\" \",сцепитьЕсли2(B:B,B465,D:D,\", \",1))","v":"win11 168 2 k11, k12"}]
["Петров","win10","Microsoft","k13","урл1",{"$f":"CONCATENATE(B466,\" \",COUNTIF(B:B,B466),\" \",LEN(сцепитьЕсли2(B:B,B466,D:D,\", \",1))-LEN(SUBSTITUTE(сцепитьЕсли2(B:B,B466,D:D,\"; \",1),\"k\",)),\" \",сцепитьЕсли2(B:B,B466,D:D,\", \",1))","v":"win10 82 1 k13"}]
["Сидоров","AntiMW","Kasper","k49","урл10",{"$f":"CONCATENATE(B467,\" \",COUNTIF(B:B,B467),\" \",LEN(сцепитьЕсли2(B:B,B467,D:D,\", \",1))-LEN(SUBSTITUTE(сцепитьЕсли2(B:B,B467,D:D,\"; \",1),\"k\",)),\" \",сцепитьЕсли2(B:B,B467,D:D,\", \",1))","v":"AntiMW 249 2 k49, k50"}]
["Котов","AntiMW","Kasper","k50","урл10",{"$f":"CONCATENATE(B468,\" \",COUNTIF(B:B,B468),\" \",LEN(сцепитьЕсли2(B:B,B468,D:D,\", \",1))-LEN(SUBSTITUTE(сцепитьЕсли2(B:B,B468,D:D,\"; \",1),\"k\",)),\" \",сцепитьЕсли2(B:B,B468,D:D,\", \",1))","v":"AntiMW 249 2 k49, k50"}]
["Петров","AntiMW","Kasper","k49","урл50",{"$f":"CONCATENATE(B469,\" \",COUNTIF(B:B,B469),\" \",LEN(сцепитьЕсли2(B:B,B469,D:D,\", \",1))-LEN(SUBSTITUTE(сцепитьЕсли2(B:B,B469,D:D,\"; \",1),\"k\",)),\" \",сцепитьЕсли2(B:B,B469,D:D,\", \",1))","v":"AntiMW 249 2 k49, k50"}]
["Иванов","win11","Microsoft","k11","урл1",{"$f":"CONCATENATE(B470,\" \",COUNTIF(B:B,B470),\" \",LEN(сцепитьЕсли2(B:B,B470,D:D,\", \",1))-LEN(SUBSTITUTE(сцепитьЕсли2(B:B,B470,D:D,\"; \",1),\"k\",)),\" \",сцепитьЕсли2(B:B,B470,D:D,\", \",1))","v":"win11 168 2 k11, k12"}]
["Петров","win11","Microsoft","k12","урл2",{"$f":"CONCATENATE(B471,\" \",COUNTIF(B:B,B471),\" \",LEN(сцепитьЕсли2(B:B,B471,D:D,\", \",1))-LEN(SUBSTITUTE(сцепитьЕсли2(B:B,B471,D:D,\"; \",1),\"k\",)),\" \",сцепитьЕсли2(B:B,B471,D:D,\", \",1))","v":"win11 168 2 k11, k12"}]
["Петров","win10","Microsoft","k13","урл1",{"$f":"CONCATENATE(B472,\" \",COUNTIF(B:B,B472),\" \",LEN(сцепитьЕсли2(B:B,B472,D:D,\", \",1))-LEN(SUBSTITUTE(сцепитьЕсли2(B:B,B472,D:D,\"; \",1),\"k\",)),\" \",сцепитьЕсли2(B:B,B472,D:D,\", \",1))","v":"win10 82 1 k13"}]
["Сидоров","AntiMW","Kasper","k49","урл10",{"$f":"CONCATENATE(B473,\" \",COUNTIF(B:B,B473),\" \",LEN(сцепитьЕсли2(B:B,B473,D:D,\", \",1))-LEN(SUBSTITUTE(сцепитьЕсли2(B:B,B473,D:D,\"; \",1),\"k\",)),\" \",сцепитьЕсли2(B:B,B473,D:D,\", \",1))","v":"AntiMW 249 2 k49, k50"}]
["Котов","AntiMW","Kasper","k50","урл10",{"$f":"CONCATENATE(B474,\" \",COUNTIF(B:B,B474),\" \",LEN(сцепитьЕсли2(B:B,B474,D:D,\", \",1))-LEN(SUBSTITUTE(сцепитьЕсли2(B:B,B474,D:D,\"; \",1),\"k\",)),\" \",сцепитьЕсли2(B:B,B474,D:D,\", \",1))","v":"AntiMW 249 2 k49, k50"}]
["Петров","AntiMW","Kasper","k49","урл50",{"$f":"CONCATENATE(B475,\" \",COUNTIF(B:B,B475),\" \",LEN(сцепитьЕсли2(B:B,B475,D:D,\", \",1))-LEN(SUBSTITUTE(сцепитьЕсли2(B:B,B475,D:D,\"; \",1),\"k\",)),\" \",сцепитьЕсли2(B:B,B475,D:D,\", \",1))","v":"AntiMW 249 2 k49, k50"}]
["Иванов","win11","Microsoft","k11","урл1",{"$f":"CONCATENATE(B476,\" \",COUNTIF(B:B,B476),\" \",LEN(сцепитьЕсли2(B:B,B476,D:D,\", \",1))-LEN(SUBSTITUTE(сцепитьЕсли2(B:B,B476,D:D,\"; \",1),\"k\",)),\" \",сцепитьЕсли2(B:B,B476,D:D,\", \",1))","v":"win11 168 2 k11, k12"}]
["Петров","win11","Microsoft","k12","урл2",{"$f":"CONCATENATE(B477,\" \",COUNTIF(B:B,B477),\" \",LEN(сцепитьЕсли2(B:B,B477,D:D,\", \",1))-LEN(SUBSTITUTE(сцепитьЕсли2(B:B,B477,D:D,\"; \",1),\"k\",)),\" \",сцепитьЕсли2(B:B,B477,D:D,\", \",1))","v":"win11 168 2 k11, k12"}]
["Петров","win10","Microsoft","k13","урл1",{"$f":"CONCATENATE(B478,\" \",COUNTIF(B:B,B478),\" \",LEN(сцепитьЕсли2(B:B,B478,D:D,\", \",1))-LEN(SUBSTITUTE(сцепитьЕсли2(B:B,B478,D:D,\"; \",1),\"k\",)),\" \",сцепитьЕсли2(B:B,B478,D:D,\", \",1))","v":"win10 82 1 k13"}]
["Сидоров","AntiMW","Kasper","k49","урл10",{"$f":"CONCATENATE(B479,\" \",COUNTIF(B:B,B479),\" \",LEN(сцепитьЕсли2(B:B,B479,D:D,\", \",1))-LEN(SUBSTITUTE(сцепитьЕсли2(B:B,B479,D:D,\"; \",1),\"k\",)),\" \",сцепитьЕсли2(B:B,B479,D:D,\", \",1))","v":"AntiMW 249 2 k49, k50"}]
["Котов","AntiMW","Kasper","k50","урл10",{"$f":"CONCATENATE(B480,\" \",COUNTIF(B:B,B480),\" \",LEN(сцепитьЕсли2(B:B,B480,D:D,\", \",1))-LEN(SUBSTITUTE(сцепитьЕсли2(B:B,B480,D:D,\"; \",1),\"k\",)),\" \",сцепитьЕсли2(B:B,B480,D:D,\", \",1))","v":"AntiMW 249 2 k49, k50"}]
["Петров","AntiMW","Kasper","k49","урл50",{"$f":"CONCATENATE(B481,\" \",COUNTIF(B:B,B481),\" \",LEN(сцепитьЕсли2(B:B,B481,D:D,\", \",1))-LEN(SUBSTITUTE(сцепитьЕсли2(B:B,B481,D:D,\"; \",1),\"k\",)),\" \",сцепитьЕсли2(B:B,B481,D:D,\", \",1))","v":"AntiMW 249 2 k49, k50"}]
["Иванов","win11","Microsoft","k11","урл1",{"$f":"CONCATENATE(B482,\" \",COUNTIF(B:B,B482),\" \",LEN(сцепитьЕсли2(B:B,B482,D:D,\", \",1))-LEN(SUBSTITUTE(сцепитьЕсли2(B:B,B482,D:D,\"; \",1),\"k\",)),\" \",сцепитьЕсли2(B:B,B482,D:D,\", \",1))","v":"win11 168 2 k11, k12"}]
["Петров","win11","Microsoft","k12","урл2",{"$f":"CONCATENATE(B483,\" \",COUNTIF(B:B,B483),\" \",LEN(сцепитьЕсли2(B:B,B483,D:D,\", \",1))-LEN(SUBSTITUTE(сцепитьЕсли2(B:B,B483,D:D,\"; \",1),\"k\",)),\" \",сцепитьЕсли2(B:B,B483,D:D,\", \",1))","v":"win11 168 2 k11, k12"}]
["Петров","win10","Microsoft","k13","урл1",{"$f":"CONCATENATE(B484,\" \",COUNTIF(B:B,B484),\" \",LEN(сцепитьЕсли2(B:B,B484,D:D,\", \",1))-LEN(SUBSTITUTE(сцепитьЕсли2(B:B,B484,D:D,\"; \",1),\"k\",)),\" \",сцепитьЕсли2(B:B,B484,D:D,\", \",1))","v":"win10 82 1 k13"}]
["Сидоров","AntiMW","Kasper","k49","урл10",{"$f":"CONCATENATE(B485,\" \",COUNTIF(B:B,B485),\" \",LEN(сцепитьЕсли2(B:B,B485,D:D,\", \",1))-LEN(SUBSTITUTE(сцепитьЕсли2(B:B,B485,D:D,\"; \",1),\"k\",)),\" \",сцепитьЕсли2(B:B,B485,D:D,\", \",1))","v":"AntiMW 249 2 k49, k50"}]
["Котов","AntiMW","Kasper","k50","урл10",{"$f":"CONCATENATE(B486,\" \",COUNTIF(B:B,B486),\" \",LEN(сцепитьЕсли2(B:B,B486,D:D,\", \",1))-LEN(SUBSTITUTE(сцепитьЕсли2(B:B,B486,D:D,\"; \",1),\"k\",)),\" \",сцепитьЕсли2(B:B,B486,D:D,\", \",1))","v":"AntiMW 249 2 k49, k50"}]
["Петров","AntiMW","Kasper","k49","урл50",{"$f":"CONCATENATE(B487,\" \",COUNTIF(B:B,B487),\" \",LEN(сцепитьЕсли2(B:B,B487,D:D,\", \",1))-LEN(SUBSTITUTE(сцепитьЕсли2(B:B,B487,D:D,\"; \",1),\"k\",)),\" \",сцепитьЕсли2(B:B,B487,D:D,\", \",1))","v":"AntiMW 249 2 k49, k50"}]
["Иванов","win11","Microsoft","k11","урл1",{"$f":"CONCATENATE(B488,\" \",COUNTIF(B:B,B488),\" \",LEN(сцепитьЕсли2(B:B,B488,D:D,\", \",1))-LEN(SUBSTITUTE(сцепитьЕсли2(B:B,B488,D:D,\"; \",1),\"k\",)),\" \",сцепитьЕсли2(B:B,B488,D:D,\", \",1))","v":"win11 168 2 k11, k12"}]
["Петров","win11","Microsoft","k12","урл2",{"$f":"CONCATENATE(B489,\" \",COUNTIF(B:B,B489),\" \",LEN(сцепитьЕсли2(B:B,B489,D:D,\", \",1))-LEN(SUBSTITUTE(сцепитьЕсли2(B:B,B489,D:D,\"; \",1),\"k\",)),\" \",сцепитьЕсли2(B:B,B489,D:D,\", \",1))","v":"win11 168 2 k11, k12"}]
["Петров","win10","Microsoft","k13","урл1",{"$f":"CONCATENATE(B490,\" \",COUNTIF(B:B,B490),\" \",LEN(сцепитьЕсли2(B:B,B490,D:D,\", \",1))-LEN(SUBSTITUTE(сцепитьЕсли2(B:B,B490,D:D,\"; \",1),\"k\",)),\" \",сцепитьЕсли2(B:B,B490,D:D,\", \",1))","v":"win10 82 1 k13"}]
["Сидоров","AntiMW","Kasper","k49","урл10",{"$f":"CONCATENATE(B491,\" \",COUNTIF(B:B,B491),\" \",LEN(сцепитьЕсли2(B:B,B491,D:D,\", \",1))-LEN(SUBSTITUTE(сцепитьЕсли2(B:B,B491,D:D,\"; \",1),\"k\",)),\" \",сцепитьЕсли2(B:B,B491,D:D,\", \",1))","v":"AntiMW 249 2 k49, k50"}]
["Котов","AntiMW","Kasper","k50","урл10",{"$f":"CONCATENATE(B492,\" \",COUNTIF(B:B,B492),\" \",LEN(сцепитьЕсли2(B:B,B492,D:D,\", \",1))-LEN(SUBSTITUTE(сцепитьЕсли2(B:B,B492,D:D,\"; \",1),\"k\",)),\" \",сцепитьЕсли2(B:B,B492,D:D,\", \",1))","v":"AntiMW 249 2 k49, k50"}]
["Петров","AntiMW","Kasper","k49","урл50",{"$f":"CONCATENATE(B493,\" \",COUNTIF(B:B,B493),\" \",LEN(сцепитьЕсли2(B:B,B493,D:D,\", \",1))-LEN(SUBSTITUTE(сцепитьЕсли2(B:B,B493,D:D,\"; \",1),\"k\",)),\" \",сцепитьЕсли2(B:B,B493,D:D,\", \",1))","v":"AntiMW 249 2 k49, k50"}]
["Иванов","win11","Microsoft","k11","урл1",{"$f":"CONCATENATE(B494,\" \",COUNTIF(B:B,B494),\" \",LEN(сцепитьЕсли2(B:B,B494,D:D,\", \",1))-LEN(SUBSTITUTE(сцепитьЕсли2(B:B,B494,D:D,\"; \",1),\"k\",)),\" \",сцепитьЕсли2(B:B,B494,D:D,\", \",1))","v":"win11 168 2 k11, k12"}]
["Петров","win11","Microsoft","k12","урл2",{"$f":"CONCATENATE(B495,\" \",COUNTIF(B:B,B495),\" \",LEN(сцепитьЕсли2(B:B,B495,D:D,\", \",1))-LEN(SUBSTITUTE(сцепитьЕсли2(B:B,B495,D:D,\"; \",1),\"k\",)),\" \",сцепитьЕсли2(B:B,B495,D:D,\", \",1))","v":"win11 168 2 k11, k12"}]
["Петров","win10","Microsoft","k13","урл1",{"$f":"CONCATENATE(B496,\" \",COUNTIF(B:B,B496),\" \",LEN(сцепитьЕсли2(B:B,B496,D:D,\", \",1))-LEN(SUBSTITUTE(сцепитьЕсли2(B:B,B496,D:D,\"; \",1),\"k\",)),\" \",сцепитьЕсли2(B:B,B496,D:D,\", \",1))","v":"win10 82 1 k13"}]
["Сидоров","AntiMW","Kasper","k49","урл10",{"$f":"CONCATENATE(B497,\" \",COUNTIF(B:B,B497),\" \",LEN(сцепитьЕсли2(B:B,B497,D:D,\", \",1))-LEN(SUBSTITUTE(сцепитьЕсли2(B:B,B497,D:D,\"; \",1),\"k\",)),\" \",сцепитьЕсли2(B:B,B497,D:D,\", \",1))","v":"AntiMW 249 2 k49, k50"}]
["Котов","AntiMW","Kasper","k50","урл10",{"$f":"CONCATENATE(B498,\" \",COUNTIF(B:B,B498),\" \",LEN(сцепитьЕсли2(B:B,B498,D:D,\", \",1))-LEN(SUBSTITUTE(сцепитьЕсли2(B:B,B498,D:D,\"; \",1),\"k\",)),\" \",сцепитьЕсли2(B:B,B498,D:D,\", \",1))","v":"AntiMW 249 2 k49, k50"}]
["Петров","AntiMW","Kasper","k49","урл50",{"$f":"CONCATENATE(B499,\" \",COUNTIF(B:B,B499),\" \",LEN(сцепитьЕсли2(B:B,B499,D:D,\", \",1))-LEN(SUBSTITUTE(сцепитьЕсли2(B:B,B499,D:D,\"; \",1),\"k\",)),\" \",сцепитьЕсли2(B:B,B499,D:D,\", \",1))","v":"AntiMW 249 2 k49, k50"}]
["Иванов","win11","Microsoft","k11","урл1",{"$f":"CONCATENATE(B500,\" \",COUNTIF(B:B,B500),\" \",LEN(сцепитьЕсли2(B:B,B500,D:D,\", \",1))-LEN(SUBSTITUTE(сцепитьЕсли2(B:B,B500,D:D,\"; \",1),\"k\",)),\" \",сцепитьЕсли2(B:B,B500,D:D,\", \",1))","v":"win11 168 2 k11, k12"}]
["Петров","win11","Microsoft","k12","урл2",{"$f":"CONCATENATE(B501,\" \",COUNTIF(B:B,B501),\" \",LEN(сцепитьЕсли2(B:B,B501,D:D,\", \",1))-LEN(SUBSTITUTE(сцепитьЕсли2(B:B,B501,D:D,\"; \",1),\"k\",)),\" \",сцепитьЕсли2(B:B,B501,D:D,\", \",1))","v":"win11 168 2 k11, k12"}]