{"text_format":"1","workbook":"xlsx","n_sheets":2,"sheets":["Лист1","Лист2"],"not_rendered":{"charts":0,"images":0,"macros":1,"external_links":0,"defined_names":0,"comments":0,"pivot_tables":0},"unopened":[],"bounds":{"document_bytes":16777216,"sheet_cells":100000,"rows_first":2000,"rows_last":500,"rows_between":2000,"halvings":0,"cell_chars":16384,"cell_head_chars":4096},"cells_cut":0,"cells_raw":0,"read":"whole","date_system":"1900"}

{"sheet":"Лист1","index":0,"n_rows":20,"n_cols":2,"rows_kept":20,"cut":false,"hidden":false,"merged":[]}
["номер протокола",33]
["дата протокола","2023-11-30"]
["дата заседания","2023-11-30"]
["место проведения","г. Москва, ул. Московская здание 3"]
["председатель вк","Иванов И.И."]
["секретарь вк","Петрова Н.Н."]
["член вк 1","Сидоров 1"]
["член вк 2","Сидоров 2"]
["член вк 3","Сидоров 3"]
["член вк 4","Сидоров 4"]
["член вк 5","Сидоров 5"]
["фио пациента","Матвеев И.И."]
["дата рождения пациента",1]
["месяц рождения пациента","января"]
["год рождения пациента",1976]
["мкб 10","ОРВИ"]
["мнн","Метамизол натрия"]
["за",5]
["против","нет"]
["воздержался","нет"]

{"sheet":"Лист2","index":1,"n_rows":223,"n_cols":29,"rows_kept":223,"cut":false,"hidden":false,"merged":[]}
[]
["номер протокола","дата протокола","дата заседания","место проведения","председатель вк","секретарь вк","член вк 1","член вк 2","член вк 3","член вк 4","член вк 5","фио пациента","дата рождения пациента","месяц рождения пациента","год рождения пациента","мкб 10","мнн","за","против","воздержался","повтор МНН","повтор МНН 2",{"$f":"E2","v":"председатель вк"},{"$f":"F2","v":"секретарь вк"},"член вк 1","член вк 2","член вк 3","член вк 4","член вк 5"]
["&SN1001","&SN1002","&SN1003","&SN1004","&SN1005","&SN1006","&SN1007","&SN1008","&SN1009","&SN1010","&SN1011","&SN1012","&SN1013","&SN1014","&SN1015","&SN1016","&SN1017","&SN1018","&SN1019","&SN1020","&SN1021","&SN1022","&SN1023","&SN1024","&SN1025","&SN1026","&SN1027","&SN1028","&SN1029"]
[33,"2023-11-30","2023-11-30","г. Москва, ул. Московская здание 3","Иванов И.И.","Петрова Н.Н.","Сидоров 1","Сидоров 2","Сидоров 3","Сидоров 4","Сидоров 5","Матвеев И.И.",1,"января",1976,"ОРВИ",{"$f":"VLOOKUP(Q$2,Лист1!$A$1:$B$20,2,FALSE)","v":"Метамизол натрия"},"да",{"$f":"VLOOKUP(S$2,Лист1!$A$1:$B$20,2,FALSE)","v":"нет"},{"$f":"VLOOKUP(T$2,Лист1!$A$1:$B$20,2,FALSE)","v":"нет"},{"$f":"Q4","v":"Метамизол натрия"},{"$f":"Q4","v":"Метамизол натрия"},{"$f":"E4","v":"Иванов И.И."},{"$f":"F4","v":"Петрова Н.Н."},{"$f":"G4","v":"Сидоров 1"},{"$f":"H4","v":"Сидоров 2"},{"$f":"I4","v":"Сидоров 3"},{"$f":"J4","v":"Сидоров 4"},{"$f":"K4","v":"Сидоров 5"}]
[34,"2023-11-30","2023-11-30","г. Москва, ул. Московская здание 3","Иванов И.И.","Петрова Н.Н.","Сидоров 1","Сидоров 2","Сидоров 3","Сидоров 4","Сидоров 5","оарворор",1,"января",1976,"ОРВИ",{"$f":"VLOOKUP(Q$2,Лист1!$A$1:$B$20,2,FALSE)","v":"Метамизол натрия"},"да",{"$f":"VLOOKUP(S$2,Лист1!$A$1:$B$20,2,FALSE)","v":"нет"},{"$f":"VLOOKUP(T$2,Лист1!$A$1:$B$20,2,FALSE)","v":"нет"},{"$f":"Q5","v":"Метамизол натрия"},{"$f":"Q5","v":"Метамизол натрия"},{"$f":"E5","v":"Иванов И.И."},{"$f":"F5","v":"Петрова Н.Н."},{"$f":"G5","v":"Сидоров 1"},{"$f":"H5","v":"Сидоров 2"},{"$f":"I5","v":"Сидоров 3"},{"$f":"J5","v":"Сидоров 4"},{"$f":"K5","v":"Сидоров 5"}]
[35,"2023-11-30","2023-11-30","г. Москва, ул. Московская здание 3","Иванов И.И.","Петрова Н.Н.","Сидоров 1","Сидоров 2","Сидоров 3","Сидоров 4","Сидоров 5","аорвоарво",1,"января",1976,"ОРВИ",{"$f":"VLOOKUP(Q$2,Лист1!$A$1:$B$20,2,FALSE)","v":"Метамизол натрия"},"да",{"$f":"VLOOKUP(S$2,Лист1!$A$1:$B$20,2,FALSE)","v":"нет"},{"$f":"VLOOKUP(T$2,Лист1!$A$1:$B$20,2,FALSE)","v":"нет"},{"$f":"Q6","v":"Метамизол натрия"},{"$f":"Q6","v":"Метамизол натрия"},{"$f":"E6","v":"Иванов И.И."},{"$f":"F6","v":"Петрова Н.Н."},{"$f":"G6","v":"Сидоров 1"},{"$f":"H6","v":"Сидоров 2"},{"$f":"I6","v":"Сидоров 3"},{"$f":"J6","v":"Сидоров 4"},{"$f":"K6","v":"Сидоров 5"}]
[36,"2023-11-30","2023-11-30","г. Москва, ул. Московская здание 4","Иванов И.И.","Петрова Н.Н.","Сидоров 1","Сидоров 2","Сидоров 3","Сидоров 4","Сидоров 5","аорвоарво",2,"января",1977,"ОРВИ",{"$f":"VLOOKUP(Q$2,Лист1!$A$1:$B$20,2,FALSE)","v":"Метамизол натрия"},"да",{"$f":"VLOOKUP(S$2,Лист1!$A$1:$B$20,2,FALSE)","v":"нет"},{"$f":"VLOOKUP(T$2,Лист1!$A$1:$B$20,2,FALSE)","v":"нет"},"Метамизол натрия","Метамизол натрия","Иванов И.И.","Петрова Н.Н.","Сидоров 1","Сидоров 2","Сидоров 3","Сидоров 4","Сидоров 5"]
[37,"2023-11-30","2023-11-30","г. Москва, ул. Московская здание 5","Иванов И.И.","Петрова Н.Н.","Сидоров 1","Сидоров 2","Сидоров 3","Сидоров 4","Сидоров 5","аорвоарво",3,"января",1978,"ОРВИ",{"$f":"VLOOKUP(Q$2,Лист1!$A$1:$B$20,2,FALSE)","v":"Метамизол натрия"},"да",{"$f":"VLOOKUP(S$2,Лист1!$A$1:$B$20,2,FALSE)","v":"нет"},{"$f":"VLOOKUP(T$2,Лист1!$A$1:$B$20,2,FALSE)","v":"нет"},"Метамизол натрия","Метамизол натрия","Иванов И.И.","Петрова Н.Н.","Сидоров 1","Сидоров 2","Сидоров 3","Сидоров 4","Сидоров 5"]
[38,"2023-11-30","2023-11-30","г. Москва, ул. Московская здание 6","Иванов И.И.","Петрова Н.Н.","Сидоров 1","Сидоров 2","Сидоров 3","Сидоров 4","Сидоров 5","аорвоарво",4,"января",1979,"ОРВИ",{"$f":"VLOOKUP(Q$2,Лист1!$A$1:$B$20,2,FALSE)","v":"Метамизол натрия"},"да",{"$f":"VLOOKUP(S$2,Лист1!$A$1:$B$20,2,FALSE)","v":"нет"},{"$f":"VLOOKUP(T$2,Лист1!$A$1:$B$20,2,FALSE)","v":"нет"},"Метамизол натрия","Метамизол натрия","Иванов И.И.","Петрова Н.Н.","Сидоров 1","Сидоров 2","Сидоров 3","Сидоров 4","Сидоров 5"]
[39,"2023-11-30","2023-11-30","г. Москва, ул. Московская здание 7","Иванов И.И.","Петрова Н.Н.","Сидоров 1","Сидоров 2","Сидоров 3","Сидоров 4","Сидоров 5","аорвоарво",5,"января",1980,"ОРВИ",{"$f":"VLOOKUP(Q$2,Лист1!$A$1:$B$20,2,FALSE)","v":"Метамизол натрия"},"да",{"$f":"VLOOKUP(S$2,Лист1!$A$1:$B$20,2,FALSE)","v":"нет"},{"$f":"VLOOKUP(T$2,Лист1!$A$1:$B$20,2,FALSE)","v":"нет"},"Метамизол натрия","Метамизол натрия","Иванов И.И.","Петрова Н.Н.","Сидоров 1","Сидоров 2","Сидоров 3","Сидоров 4","Сидоров 5"]
[40,"2023-11-30","2023-11-30","г. Москва, ул. Московская здание 8","Иванов И.И.","Петрова Н.Н.","Сидоров 1","Сидоров 2","Сидоров 3","Сидоров 4","Сидоров 5","аорвоарво",6,"января",1981,"ОРВИ",{"$f":"VLOOKUP(Q$2,Лист1!$A$1:$B$20,2,FALSE)","v":"Метамизол натрия"},"да",{"$f":"VLOOKUP(S$2,Лист1!$A$1:$B$20,2,FALSE)","v":"нет"},{"$f":"VLOOKUP(T$2,Лист1!$A$1:$B$20,2,FALSE)","v":"нет"},"Метамизол натрия","Метамизол натрия","Иванов И.И.","Петрова Н.Н.","Сидоров 1","Сидоров 2","Сидоров 3","Сидоров 4","Сидоров 5"]
[41,"2023-11-30","2023-11-30","г. Москва, ул. Московская здание 9","Иванов И.И.","Петрова Н.Н.","Сидоров 1","Сидоров 2","Сидоров 3","Сидоров 4","Сидоров 5","аорвоарво",7,"января",1982,"ОРВИ",{"$f":"VLOOKUP(Q$2,Лист1!$A$1:$B$20,2,FALSE)","v":"Метамизол натрия"},"да",{"$f":"VLOOKUP(S$2,Лист1!$A$1:$B$20,2,FALSE)","v":"нет"},{"$f":"VLOOKUP(T$2,Лист1!$A$1:$B$20,2,FALSE)","v":"нет"},"Метамизол натрия","Метамизол натрия","Иванов И.И.","Петрова Н.Н.","Сидоров 1","Сидоров 2","Сидоров 3","Сидоров 4","Сидоров 5"]
[42,"2023-11-30","2023-11-30","г. Москва, ул. Московская здание 10","Иванов И.И.","Петрова Н.Н.","Сидоров 1","Сидоров 2","Сидоров 3","Сидоров 4","Сидоров 5","аорвоарво",8,"января",1983,"ОРВИ",{"$f":"VLOOKUP(Q$2,Лист1!$A$1:$B$20,2,FALSE)","v":"Метамизол натрия"},"да",{"$f":"VLOOKUP(S$2,Лист1!$A$1:$B$20,2,FALSE)","v":"нет"},{"$f":"VLOOKUP(T$2,Лист1!$A$1:$B$20,2,FALSE)","v":"нет"},"Метамизол натрия","Метамизол натрия","Иванов И.И.","Петрова Н.Н.","Сидоров 1","Сидоров 2","Сидоров 3","Сидоров 4","Сидоров 5"]
[43,"2023-11-30","2023-11-30","г. Москва, ул. Московская здание 11","Иванов И.И.","Петрова Н.Н.","Сидоров 1","Сидоров 2","Сидоров 3","Сидоров 4","Сидоров 5","аорвоарво",9,"января",1984,"ОРВИ",{"$f":"VLOOKUP(Q$2,Лист1!$A$1:$B$20,2,FALSE)","v":"Метамизол натрия"},"да",{"$f":"VLOOKUP(S$2,Лист1!$A$1:$B$20,2,FALSE)","v":"нет"},{"$f":"VLOOKUP(T$2,Лист1!$A$1:$B$20,2,FALSE)","v":"нет"},"Метамизол натрия","Метамизол натрия","Иванов И.И.","Петрова Н.Н.","Сидоров 1","Сидоров 2","Сидоров 3","Сидоров 4","Сидоров 5"]
[44,"2023-11-30","2023-11-30","г. Москва, ул. Московская здание 12","Иванов И.И.","Петрова Н.Н.","Сидоров 1","Сидоров 2","Сидоров 3","Сидоров 4","Сидоров 5","аорвоарво",10,"января",1985,"ОРВИ",{"$f":"VLOOKUP(Q$2,Лист1!$A$1:$B$20,2,FALSE)","v":"Метамизол натрия"},"да",{"$f":"VLOOKUP(S$2,Лист1!$A$1:$B$20,2,FALSE)","v":"нет"},{"$f":"VLOOKUP(T$2,Лист1!$A$1:$B$20,2,FALSE)","v":"нет"},"Метамизол натрия","Метамизол натрия","Иванов И.И.","Петрова Н.Н.","Сидоров 1","Сидоров 2","Сидоров 3","Сидоров 4","Сидоров 5"]
[45,"2023-11-30","2023-11-30","г. Москва, ул. Московская здание 13","Иванов И.И.","Петрова Н.Н.","Сидоров 1","Сидоров 2","Сидоров 3","Сидоров 4","Сидоров 5","аорвоарво",11,"января",1986,"ОРВИ",{"$f":"VLOOKUP(Q$2,Лист1!$A$1:$B$20,2,FALSE)","v":"Метамизол натрия"},"да",{"$f":"VLOOKUP(S$2,Лист1!$A$1:$B$20,2,FALSE)","v":"нет"},{"$f":"VLOOKUP(T$2,Лист1!$A$1:$B$20,2,FALSE)","v":"нет"},"Метамизол натрия","Метамизол натрия","Иванов И.И.","Петрова Н.Н.","Сидоров 1","Сидоров 2","Сидоров 3","Сидоров 4","Сидоров 5"]
[46,"2023-11-30","2023-11-30","г. Москва, ул. Московская здание 14","Иванов И.И.","Петрова Н.Н.","Сидоров 1","Сидоров 2","Сидоров 3","Сидоров 4","Сидоров 5","аорвоарво",12,"января",1987,"ОРВИ",{"$f":"VLOOKUP(Q$2,Лист1!$A$1:$B$20,2,FALSE)","v":"Метамизол натрия"},"да",{"$f":"VLOOKUP(S$2,Лист1!$A$1:$B$20,2,FALSE)","v":"нет"},{"$f":"VLOOKUP(T$2,Лист1!$A$1:$B$20,2,FALSE)","v":"нет"},"Метамизол натрия","Метамизол натрия","Иванов И.И.","Петрова Н.Н.","Сидоров 1","Сидоров 2","Сидоров 3","Сидоров 4","Сидоров 5"]
[47,"2023-11-30","2023-11-30","г. Москва, ул. Московская здание 15","Иванов И.И.","Петрова Н.Н.","Сидоров 1","Сидоров 2","Сидоров 3","Сидоров 4","Сидоров 5","аорвоарво",13,"января",1988,"ОРВИ",{"$f":"VLOOKUP(Q$2,Лист1!$A$1:$B$20,2,FALSE)","v":"Метамизол натрия"},"да",{"$f":"VLOOKUP(S$2,Лист1!$A$1:$B$20,2,FALSE)","v":"нет"},{"$f":"VLOOKUP(T$2,Лист1!$A$1:$B$20,2,FALSE)","v":"нет"},"Метамизол натрия","Метамизол натрия","Иванов И.И.","Петрова Н.Н.","Сидоров 1","Сидоров 2","Сидоров 3","Сидоров 4","Сидоров 5"]
[48,"2023-11-30","2023-11-30","г. Москва, ул. Московская здание 16","Иванов И.И.","Петрова Н.Н.","Сидоров 1","Сидоров 2","Сидоров 3","Сидоров 4","Сидоров 5","аорвоарво",14,"января",1989,"ОРВИ",{"$f":"VLOOKUP(Q$2,Лист1!$A$1:$B$20,2,FALSE)","v":"Метамизол натрия"},"да",{"$f":"VLOOKUP(S$2,Лист1!$A$1:$B$20,2,FALSE)","v":"нет"},{"$f":"VLOOKUP(T$2,Лист1!$A$1:$B$20,2,FALSE)","v":"нет"},"Метамизол натрия","Метамизол натрия","Иванов И.И.","Петрова Н.Н.","Сидоров 1","Сидоров 2","Сидоров 3","Сидоров 4","Сидоров 5"]
[49,"2023-11-30","2023-11-30","г. Москва, ул. Московская здание 17","Иванов И.И.","Петрова Н.Н.","Сидоров 1","Сидоров 2","Сидоров 3","Сидоров 4","Сидоров 5","аорвоарво",15,"января",1990,"ОРВИ",{"$f":"VLOOKUP(Q$2,Лист1!$A$1:$B$20,2,FALSE)","v":"Метамизол натрия"},"да",{"$f":"VLOOKUP(S$2,Лист1!$A$1:$B$20,2,FALSE)","v":"нет"},{"$f":"VLOOKUP(T$2,Лист1!$A$1:$B$20,2,FALSE)","v":"нет"},"Метамизол натрия","Метамизол натрия","Иванов И.И.","Петрова Н.Н.","Сидоров 1","Сидоров 2","Сидоров 3","Сидоров 4","Сидоров 5"]
[null,null,null,null,null,null,null,null,null,null,null,null,null,null,null,null,null,null,null,null,0,0,0,0,0,0,0,0,0]
[null,null,null,null,null,null,null,null,null,null,null,null,null,null,null,null,null,null,null,null,0,0,0,0,0,0,0,0,0]
[null,null,null,null,null,null,null,null,null,null,null,null,null,null,null,null,null,null,null,null,0,0,0,0,0,0,0,0,0]
[null,null,null,null,null,null,null,null,null,null,null,null,null,null,null,null,null,null,null,null,0,0,0,0,0,0,0,0,0]
[null,null,null,null,null,null,null,null,null,null,null,null,null,null,null,null,null,null,null,null,0,0,0,0,0,0,0,0,0]
[null,null,null,null,null,null,null,null,null,null,null,null,null,null,null,null,null,null,null,null,0,0,0,0,0,0,0,0,0]
[null,null,null,null,null,null,null,null,null,null,null,null,null,null,null,null,null,null,null,null,0,0,0,0,0,0,0,0,0]
[null,null,null,null,null,null,null,null,null,null,null,null,null,null,null,null,null,null,null,null,0,0,0,0,0,0,0,0,0]
[null,null,null,null,null,null,null,null,null,null,null,null,null,null,null,null,null,null,null,null,0,0,0,0,0,0,0,0,0]
[null,null,null,null,null,null,null,null,null,null,null,null,null,null,null,null,null,null,null,null,0,0,0,0,0,0,0,0,0]
[null,null,null,null,null,null,null,null,null,null,null,null,null,null,null,null,null,null,null,null,0,0,0,0,0,0,0,0,0]
[null,null,null,null,null,null,null,null,null,null,null,null,null,null,null,null,null,null,null,null,0,0,0,0,0,0,0,0,0]
[null,null,null,null,null,null,null,null,null,null,null,null,null,null,null,null,null,null,null,null,0,0,0,0,0,0,0,0,0]
[null,null,null,null,null,null,null,null,null,null,null,null,null,null,null,null,null,null,null,null,0,0,0,0,0,0,0,0,0]
[null,null,null,null,null,null,null,null,null,null,null,null,null,null,null,null,null,null,null,null,0,0,0,0,0,0,0,0,0]
[null,null,null,null,null,null,null,null,null,null,null,null,null,null,null,null,null,null,null,null,0,0,0,0,0,0,0,0,0]
[null,null,null,null,null,null,null,null,null,null,null,null,null,null,null,null,null,null,null,null,0,0,0,0,0,0,0,0,0]
[null,null,null,null,null,null,null,null,null,null,null,null,null,null,null,null,null,null,null,null,0,0,0,0,0,0,0,0,0]
[null,null,null,null,null,null,null,null,null,null,null,null,null,null,null,null,null,null,null,null,0,0,0,0,0,0,0,0,0]
[null,null,null,null,null,null,null,null,null,null,null,null,null,null,null,null,null,null,null,null,0,0,0,0,0,0,0,0,0]
[null,null,null,null,null,null,null,null,null,null,null,null,null,null,null,null,null,null,null,null,0,0,0,0,0,0,0,0,0]
[null,null,null,null,null,null,null,null,null,null,null,null,null,null,null,null,null,null,null,null,0,0,0,0,0,0,0,0,0]
[null,null,null,null,null,null,null,null,null,null,null,null,null,null,null,null,null,null,null,null,0,0,0,0,0,0,0,0,0]
[null,null,null,null,null,null,null,null,null,null,null,null,null,null,null,null,null,null,null,null,0,0,0,0,0,0,0,0,0]
[null,null,null,null,null,null,null,null,null,null,null,null,null,null,null,null,null,null,null,null,0,0,0,0,0,0,0,0,0]
[null,null,null,null,null,null,null,null,null,null,null,null,null,null,null,null,null,null,null,null,0,0,0,0,0,0,0,0,0]
[null,null,null,null,null,null,null,null,null,null,null,null,null,null,null,null,null,null,null,null,0,0,0,0,0,0,0,0,0]
[null,null,null,null,null,null,null,null,null,null,null,null,null,null,null,null,null,null,null,null,0,0,0,0,0,0,0,0,0]
[null,null,null,null,null,null,null,null,null,null,null,null,null,null,null,null,null,null,null,null,0,0,0,0,0,0,0,0,0]
[null,null,null,null,null,null,null,null,null,null,null,null,null,null,null,null,null,null,null,null,0,0,0,0,0,0,0,0,0]
[null,null,null,null,null,null,null,null,null,null,null,null,null,null,null,null,null,null,null,null,0,0,0,0,0,0,0,0,0]
[null,null,null,null,null,null,null,null,null,null,null,null,null,null,null,null,null,null,null,null,0,0,0,0,0,0,0,0,0]
[null,null,null,null,null,null,null,null,null,null,null,null,null,null,null,null,null,null,null,null,0,0,0,0,0,0,0,0,0]
[null,null,null,null,null,null,null,null,null,null,null,null,null,null,null,null,null,null,null,null,0,0,0,0,0,0,0,0,0]
[null,null,null,null,null,null,null,null,null,null,null,null,null,null,null,null,null,null,null,null,0,0,0,0,0,0,0,0,0]
[null,null,null,null,null,null,null,null,null,null,null,null,null,null,null,null,null,null,null,null,0,0,0,0,0,0,0,0,0]
[null,null,null,null,null,null,null,null,null,null,null,null,null,null,null,null,null,null,null,null,0,0,0,0,0,0,0,0,0]
[null,null,null,null,null,null,null,null,null,null,null,null,null,null,null,null,null,null,null,null,0,0,0,0,0,0,0,0,0]
[null,null,null,null,null,null,null,null,null,null,null,null,null,null,null,null,null,null,null,null,0,0,0,0,0,0,0,0,0]
[null,null,null,null,null,null,null,null,null,null,null,null,null,null,null,null,null,null,null,null,0,0,0,0,0,0,0,0,0]
[null,null,null,null,null,null,null,null,null,null,null,null,null,null,null,null,null,null,null,null,0,0,0,0,0,0,0,0,0]
[null,null,null,null,null,null,null,null,null,null,null,null,null,null,null,null,null,null,null,null,0,0,0,0,0,0,0,0,0]
[null,null,null,null,null,null,null,null,null,null,null,null,null,null,null,null,null,null,null,null,0,0,0,0,0,0,0,0,0]
[null,null,null,null,null,null,null,null,null,null,null,null,null,null,null,null,null,null,null,null,0,0,0,0,0,0,0,0,0]
[null,null,null,null,null,null,null,null,null,null,null,null,null,null,null,null,null,null,null,null,0,0,0,0,0,0,0,0,0]
[null,null,null,null,null,null,null,null,null,null,null,null,null,null,null,null,null,null,null,null,0,0,0,0,0,0,0,0,0]
[null,null,null,null,null,null,null,null,null,null,null,null,null,null,null,null,null,null,null,null,0,0,0,0,0,0,0,0,0]
[null,null,null,null,null,null,null,null,null,null,null,null,null,null,null,null,null,null,null,null,0,0,0,0,0,0,0,0,0]
[null,null,null,null,null,null,null,null,null,null,null,null,null,null,null,null,null,null,null,null,0,0,0,0,0,0,0,0,0]
[null,null,null,null,null,null,null,null,null,null,null,null,null,null,null,null,null,null,null,null,{"$f":"Q70","v":0},{"$f":"Q70","v":0},{"$f":"E70","v":0},{"$f":"F70","v":0},{"$f":"G70","v":0},{"$f":"H70","v":0},{"$f":"I70","v":0},{"$f":"J70","v":0},{"$f":"K70","v":0}]
[null,null,null,null,null,null,null,null,null,null,null,null,null,null,null,null,null,null,null,null,0,0,0,0,0,0,0,0,0]
[null,null,null,null,null,null,null,null,null,null,null,null,null,null,null,null,null,null,null,null,0,0,0,0,0,0,0,0,0]
[null,null,null,null,null,null,null,null,null,null,null,null,null,null,null,null,null,null,null,null,0,0,0,0,0,0,0,0,0]
[null,null,null,null,null,null,null,null,null,null,null,null,null,null,null,null,null,null,null,null,0,0,0,0,0,0,0,0,0]
[null,null,null,null,null,null,null,null,null,null,null,null,null,null,null,null,null,null,null,null,0,0,0,0,0,0,0,0,0]
[null,null,null,null,null,null,null,null,null,null,null,null,null,null,null,null,null,null,null,null,0,0,0,0,0,0,0,0,0]
[null,null,null,null,null,null,null,null,null,null,null,null,null,null,null,null,null,null,null,null,0,0,0,0,0,0,0,0,0]
[null,null,null,null,null,null,null,null,null,null,null,null,null,null,null,null,null,null,null,null,0,0,0,0,0,0,0,0,0]
[null,null,null,null,null,null,null,null,null,null,null,null,null,null,null,null,null,null,null,null,0,0,0,0,0,0,0,0,0]
[null,null,null,null,null,null,null,null,null,null,null,null,null,null,null,null,null,null,null,null,0,0,0,0,0,0,0,0,0]
[null,null,null,null,null,null,null,null,null,null,null,null,null,null,null,null,null,null,null,null,0,0,0,0,0,0,0,0,0]
[null,null,null,null,null,null,null,null,null,null,null,null,null,null,null,null,null,null,null,null,0,0,0,0,0,0,0,0,0]
[null,null,null,null,null,null,null,null,null,null,null,null,null,null,null,null,null,null,null,null,0,0,0,0,0,0,0,0,0]
[null,null,null,null,null,null,null,null,null,null,null,null,null,null,null,null,null,null,null,null,0,0,0,0,0,0,0,0,0]
[null,null,null,null,null,null,null,null,null,null,null,null,null,null,null,null,null,null,null,null,0,0,0,0,0,0,0,0,0]
[null,null,null,null,null,null,null,null,null,null,null,null,null,null,null,null,null,null,null,null,0,0,0,0,0,0,0,0,0]
[null,null,null,null,null,null,null,null,null,null,null,null,null,null,null,null,null,null,null,null,0,0,0,0,0,0,0,0,0]
[null,null,null,null,null,null,null,null,null,null,null,null,null,null,null,null,null,null,null,null,0,0,0,0,0,0,0,0,0]
[null,null,null,null,null,null,null,null,null,null,null,null,null,null,null,null,null,null,null,null,0,0,0,0,0,0,0,0,0]
[null,null,null,null,null,null,null,null,null,null,null,null,null,null,null,null,null,null,null,null,0,0,0,0,0,0,0,0,0]
[null,null,null,null,null,null,null,null,null,null,null,null,null,null,null,null,null,null,null,null,0,0,0,0,0,0,0,0,0]
[null,null,null,null,null,null,null,null,null,null,null,null,null,null,null,null,null,null,null,null,0,0,0,0,0,0,0,0,0]
[null,null,null,null,null,null,null,null,null,null,null,null,null,null,null,null,null,null,null,null,0,0,0,0,0,0,0,0,0]
[null,null,null,null,null,null,null,null,null,null,null,null,null,null,null,null,null,null,null,null,0,0,0,0,0,0,0,0,0]
[null,null,null,null,null,null,null,null,null,null,null,null,null,null,null,null,null,null,null,null,0,0,0,0,0,0,0,0,0]
[null,null,null,null,null,null,null,null,null,null,null,null,null,null,null,null,null,null,null,null,0,0,0,0,0,0,0,0,0]
[null,null,null,null,null,null,null,null,null,null,null,null,null,null,null,null,null,null,null,null,0,0,0,0,0,0,0,0,0]
[null,null,null,null,null,null,null,null,null,null,null,null,null,null,null,null,null,null,null,null,0,0,0,0,0,0,0,0,0]
[null,null,null,null,null,null,null,null,null,null,null,null,null,null,null,null,null,null,null,null,0,0,0,0,0,0,0,0,0]
[null,null,null,null,null,null,null,null,null,null,null,null,null,null,null,null,null,null,null,null,0,0,0,0,0,0,0,0,0]
[null,null,null,null,null,null,null,null,null,null,null,null,null,null,null,null,null,null,null,null,0,0,0,0,0,0,0,0,0]
[null,null,null,null,null,null,null,null,null,null,null,null,null,null,null,null,null,null,null,null,0,0,0,0,0,0,0,0,0]
[null,null,null,null,null,null,null,null,null,null,null,null,null,null,null,null,null,null,null,null,0,0,0,0,0,0,0,0,0]
[null,null,null,null,null,null,null,null,null,null,null,null,null,null,null,null,null,null,null,null,0,0,0,0,0,0,0,0,0]
[null,null,null,null,null,null,null,null,null,null,null,null,null,null,null,null,null,null,null,null,0,0,0,0,0,0,0,0,0]
[null,null,null,null,null,null,null,null,null,null,null,null,null,null,null,null,null,null,null,null,0,0,0,0,0,0,0,0,0]
[null,null,null,null,null,null,null,null,null,null,null,null,null,null,null,null,null,null,null,null,0,0,0,0,0,0,0,0,0]
[null,null,null,null,null,null,null,null,null,null,null,null,null,null,null,null,null,null,null,null,0,0,0,0,0,0,0,0,0]
[null,null,null,null,null,null,null,null,null,null,null,null,null,null,null,null,null,null,null,null,0,0,0,0,0,0,0,0,0]
[null,null,null,null,null,null,null,null,null,null,null,null,null,null,null,null,null,null,null,null,0,0,0,0,0,0,0,0,0]
[null,null,null,null,null,null,null,null,null,null,null,null,null,null,null,null,null,null,null,null,0,0,0,0,0,0,0,0,0]
[null,null,null,null,null,null,null,null,null,null,null,null,null,null,null,null,null,null,null,null,0,0,0,0,0,0,0,0,0]
[null,null,null,null,null,null,null,null,null,null,null,null,null,null,null,null,null,null,null,null,0,0,0,0,0,0,0,0,0]
[null,null,null,null,null,null,null,null,null,null,null,null,null,null,null,null,null,null,null,null,0,0,0,0,0,0,0,0,0]
[null,null,null,null,null,null,null,null,null,null,null,null,null,null,null,null,null,null,null,null,0,0,0,0,0,0,0,0,0]
[null,null,null,null,null,null,null,null,null,null,null,null,null,null,null,null,null,null,null,null,0,0,0,0,0,0,0,0,0]
[null,null,null,null,null,null,null,null,null,null,null,null,null,null,null,null,null,null,null,null,0,0,0,0,0,0,0,0,0]
[null,null,null,null,null,null,null,null,null,null,null,null,null,null,null,null,null,null,null,null,0,0,0,0,0,0,0,0,0]
[null,null,null,null,null,null,null,null,null,null,null,null,null,null,null,null,null,null,null,null,0,0,0,0,0,0,0,0,0]
[null,null,null,null,null,null,null,null,null,null,null,null,null,null,null,null,null,null,null,null,0,0,0,0,0,0,0,0,0]
{"$rows_left_out":103}