{"text_format":"1","workbook":"xlsx","n_sheets":6,"sheets":["птм","Список рабочих","аванс","1","Январь","Табель-расчёт"],"not_rendered":{"charts":0,"images":1,"macros":1,"external_links":1,"defined_names":2,"comments":1,"pivot_tables":0},"unopened":[],"bounds":{"document_bytes":16777216,"sheet_cells":100000,"rows_first":2000,"rows_last":500,"rows_between":2000,"halvings":0,"cell_chars":16384,"cell_head_chars":4096},"cells_cut":0,"cells_raw":0,"read":"whole","date_system":"1900"}

{"sheet":"птм","index":0,"n_rows":101,"n_cols":6,"rows_kept":101,"cut":false,"hidden":false,"merged":[[51,0,52,0],[51,1,52,1],[51,2,52,2],[0,5,1,5],[0,0,1,0],[0,1,1,1],[0,2,1,2]]}
["№","Ф. И. О.","разряд","Таб.","раб.","ПТМ"]
[null,null,null,"номер","место"]
[1,{"$f":"IF(D3=0,\" \",VLOOKUP(D3,'Список рабочих'!A$1:B$162,2,0))","v":"Абрамов Е. В."},{"$f":"IF(D3=0,\" \",VLOOKUP(D3,'Список рабочих'!A$1:C$202,3,0))","v":3},"08278","эл.мон","2020-05-01"]
[{"$f":"SUM(A3+1)","v":2},{"$f":"IF(D4=0,\" \",VLOOKUP(D4,'Список рабочих'!A$1:B$162,2,0))","v":"Бойков А. А."},{"$f":"IF(D4=0,\" \",VLOOKUP(D4,'Список рабочих'!A$1:C$202,3,0))","v":5},"08009","эл.мон","2020-05-01"]
[{"$f":"SUM(A4+1)","v":3},{"$f":"IF(D5=0,\" \",VLOOKUP(D5,'Список рабочих'!A$1:B$162,2,0))","v":"Буторина Т. М."},{"$f":"IF(D5=0,\" \",VLOOKUP(D5,'Список рабочих'!A$1:C$202,3,0))","v":4},"08130","эл.мон","2020-12-01"]
[4,{"$f":"IF(D6=0,\" \",VLOOKUP(D6,'Список рабочих'!A$1:B$162,2,0))","v":"Васильев А. Ю."},{"$f":"IF(D6=0,\" \",VLOOKUP(D6,'Список рабочих'!A$1:C$202,3,0))","v":5},"08235","рег.","2020-05-01"]
{"$rows_left_out":96}
{"sheet":"Список рабочих","index":1,"n_rows":170,"n_cols":3,"rows_kept":170,"cut":false,"hidden":false,"merged":[]}
["08251","Волков Я. В.",3]
["08258","Варшуков А.В.",3]
["08322","Федосеев А.А.",4]
["08182","Андрусенко А. В.",3]
["08348","Тихонов П.Н.",4]
["08212","Бажков А. А.",6]
{"$rows_left_out":165}
{"sheet":"аванс","index":2,"n_rows":50,"n_cols":13,"rows_kept":50,"cut":false,"hidden":false,"merged":[[2,8,3,8],[2,9,3,9],[2,10,3,10],[2,11,3,11],[2,0,3,0],[2,1,3,1],[2,3,3,3],[2,2,3,2]]}
["Аванс  июль 2022 г.",null,null,null,null,null,null,null,"Аванс  июль 2022 г."]
[]
["№","Ф.И.О.","таб. №","сумма",null,null,null,null,"№","Ф.И.О.","таб. №","сумма"]
[]
["1",{"$f":"IF(C5=0,\" \",VLOOKUP(C5,'Список рабочих'!A$1:B$162,2,0))","v":"Абрамов Е. В."},"08278",15000,15000,null,null,null,"47",{"$f":"IF(K5=0,\" \",VLOOKUP(K5,'Список рабочих'!A$1:B$162,2,0))","v":"Петрунин А. Н."},"08132",0,15000]
["2",{"$f":"IF(C6=0,\" \",VLOOKUP(C6,'Список рабочих'!A$1:B$162,2,0))","v":"Алексеев П. А."},"08334",20000,20000,null,null,null,"48",{"$f":"IF(K6=0,\" \",VLOOKUP(K6,'Список рабочих'!A$1:B$162,2,0))","v":"Приходько А. А."},"08218",0,20000]
{"$rows_left_out":45}
{"sheet":"1","index":3,"n_rows":368,"n_cols":37,"rows_kept":368,"cut":false,"hidden":false,"merged":[[159,0,159,36],[162,0,163,1],[162,4,162,34],[207,0,207,34],[2,0,2,36],[4,0,5,1],[4,4,4,34],[49,0,49,34],[154,0,154,34],[106,0,106,36],[109,0,110,1],[109,4,109,34],[52,0,53,1],[52,4,52,34],[97,0,97,34],[214,0,214,36],[217,0,218,1],[217,4,217,34],[262,0,262,34],[271,0,271,36],[367,0,367,34],[274,0,275,1],[274,4,274,34],[319,0,319,34],[322,0,323,1],[322,4,322,34]]}
[]
[]
["Табель учета рабочего времени по филиалу \"САПФИР\" АО \"ЭРА\" на заказе 12700 зав. №522 за август 2019 г.."]
[]
["Ф. И. О.",null,"Таб.","раб.","отработанное время. АВГУСТ",null,null,null,null,null,null,null,null,null,null,null,null,null,null,null,null,null,null,null,null,null,null,null,null,null,null,null,null,null,null,"Итого","Итого"]
[null,null,"номер","место",1,2,3,4,5,6,7,8,9,10,11,12,13,14,15,16,17,18,19,20,21,22,23,24,25,26,27,28,29,30,31,"часы","Дни"]
{"$rows_left_out":363}
{"sheet":"Январь","index":4,"n_rows":216,"n_cols":52,"rows_kept":216,"cut":false,"hidden":false,"merged":[[193,0,193,39],[195,0,195,39],[197,0,198,0],[197,1,198,1],[197,2,198,2],[197,4,197,34],[140,0,141,0],[140,1,141,1],[140,2,141,2],[140,4,140,34],[182,0,183,0],[182,1,183,1],[182,2,183,2],[182,4,182,34],[1,47,1,51],[3,47,4,47],[3,48,4,48],[3,49,4,49],[102,0,102,34],[0,0,1,0],[0,1,1,1],[0,2,1,2],[0,4,0,34],[51,0,51,34],[52,0,53,0],[52,1,53,1],[52,2,53,2],[52,4,52,34]]}
["№","Ф. И. О.","разряд","Таб.","отработанное время. Январь 2024",null,null,null,null,null,null,null,null,null,null,null,null,null,null,null,null,null,null,null,null,null,null,null,null,null,null,null,null,null,null,null,"вых.",null,"Итого","итого"]
[null,null,null,"номер",1,2,3,4,5,6,7,8,9,10,11,12,13,14,15,16,17,18,19,20,21,22,23,24,25,26,27,28,29,30,31,"часы","Дни","Молоко","часы","дни",null,null,null,null,null,null,null,"Заказ 526"]
[1,{"$f":"IF(D3=0,\" \",VLOOKUP(D3,'Список рабочих'!A$1:B$240,2,0))","v":"Байдин А. А."},{"$f":"IF(D3=0,\" \",VLOOKUP(D3,'Список рабочих'!A$1:C$202,3,0))","v":3},"006167",null,null,null,null,null,null,null,null,7.2,7.2,7.2,7.2,null,null,7.2,null,null,null,null,null,null,null,null,null,null,null,null,null,null,null,null,{"$f":"SUM(M3:P3,S3:W3,Z3:AD3,AG3:AI3)","v":36},{"$f":"SUM(E3:L3,Q3:R3,X3:Y3,AE3:AF3)","v":0},{"$f":"COUNT(M3:P3,S3:W3,Z3:AD3,AG3:AI3)","v":5},{"$f":"SUM(AK3,AJ3)","v":36},{"$f":"COUNT(E3:AI3)","v":5}]
[{"$f":"SUM(A3+1)","v":2},{"$f":"IF(D4=0,\" \",VLOOKUP(D4,'Список рабочих'!A$1:B$240,2,0))","v":"Бойков А. А."},{"$f":"IF(D4=0,\" \",VLOOKUP(D4,'Список рабочих'!A$1:C$202,3,0))","v":5},"08009",null,null,null,null,null,null,null,null,null,null,null,null,null,null,null,null,null,null,null,null,null,null,null,null,null,null,null,null,null,null,null,{"$f":"SUM(M4:P4,S4:W4,Z4:AD4,AG4:AI4)","v":0},{"$f":"SUM(E4:L4,Q4:R4,X4:Y4,AE4:AF4)","v":0},{"$f":"COUNT(M4:P4,S4:W4,Z4:AD4,AG4:AI4)","v":0},{"$f":"SUM(AK4,AJ4)","v":0},{"$f":"COUNT(E4:AI4)","v":0},null,null,null,null,null,null,null,"№","Ф. И. О.","разряд","Таб.","раб."]
[{"$f":"SUM(A4+1)","v":3},{"$f":"IF(D5=0,\" \",VLOOKUP(D5,'Список рабочих'!A$1:B$240,2,0))","v":"Вараксин П. А."},{"$f":"IF(D5=0,\" \",VLOOKUP(D5,'Список рабочих'!A$1:C$202,3,0))","v":4},"08271",null,null,null,null,null,null,null,null,7.2,7.2,7.2,7.2,null,null,null,null,null,null,null,null,null,null,null,null,null,null,null,null,null,null,null,{"$f":"SUM(M5:P5,S5:W5,Z5:AD5,AG5:AI5)","v":28.8},0,4,28.8,4,null,null,null,null,null,null,null,null,null,null,"номер","место"]
[4,{"$f":"IF(D6=0,\" \",VLOOKUP(D6,'Список рабочих'!A$1:B$240,2,0))","v":"Васильев А. Ю."},{"$f":"IF(D6=0,\" \",VLOOKUP(D6,'Список рабочих'!A$1:C$202,3,0))","v":5},"08235",null,null,null,null,null,null,null,null,null,null,null,null,null,null,null,null,null,null,null,null,null,null,null,null,null,null,null,null,null,null,null,0,0,0,0,0,null,null,null,null,null,null,null,1,{"$f":"IF(AY6=0,\" \",VLOOKUP(AY6,'Список рабочих'!A$1:B$162,2,0))","v":"Вараксин П. А."},{"$f":"IF(AY6=0,\" \",VLOOKUP(AY6,'Список рабочих'!A$1:C$202,3,0))","v":4},"08271","включение"]
{"$rows_left_out":211}
{"sheet":"Табель-расчёт","index":5,"n_rows":41,"n_cols":88,"rows_kept":41,"cut":false,"hidden":false,"merged":[[17,51,17,54],[75,47,76,61],[75,62,77,68],[75,69,76,79],[77,8,77,18],[77,25,77,38],[77,47,77,61],[77,69,77,79],[74,64,74,65],[74,66,74,67],[74,68,74,69],[74,70,74,75],[74,76,74,79],[72,64,72,65],[72,66,72,67],[72,68,72,69],[72,70,72,75],[72,76,72,79],[73,51,73,54],[73,55,73,56],[71,70,71,75],[72,0,72,12],[72,45,72,48],[72,49,72,50],[75,0,77,7],[75,8,76,18],[75,19,77,24],[75,25,76,38],[75,39,77,46],[73,70,73,75],[73,76,73,79],[74,0,74,12],[74,45,74,48],[74,49,74,50],[74,51,74,54],[74,55,74,56],[74,57,74,58],[74,59,74,60],[74,61,74,63],[73,57,73,58],[73,59,73,60],[73,61,73,63],[73,64,73,65],[73,66,73,67],[73,68,73,69],[73,0,73,12],[73,45,73,48],[73,49,73,50],[72,51,72,54],[72,55,72,56],[72,57,72,58],[72,59,72,60],[72,61,72,63],[71,57,71,58],[71,59,71,60],[71,61,71,63],[70,64,70,65],[70,66,70,67],[70,68,70,69],[70,70,70,75],[70,76,70,79],[71,0,71,12],[71,45,71,48],[71,49,71,50],[71,51,71,54],[71,55,71,56],[71,76,71,79],[71,64,71,65],[71,66,71,67],[71,68,71,69],[70,0,70,12],[70,45,70,48],[70,49,70,50],[70,51,70,54],[70,55,70,56],[70,57,70,58],[70,59,70,60],[70,61,70,63],[69,57,69,58],[69,59,69,60],[69,61,69,63],[68,64,68,65],[68,66,68,67],[68,68,68,69],[68,70,68,75],[68,76,68,79],[69,0,69,12],[69,45,69,48],[69,49,69,50],[69,51,69,54],[69,55,69,56],[69,70,69,75],[69,76,69,79],[69,64,69,65],[69,66,69,67],[69,68,69,69],[68,0,68,12],[68,45,68,48],[68,49,68,50],[68,51,68,54],[68,55,68,56],[68,57,68,58],[68,59,68,60],[68,61,68,63],[67,57,67,58],[67,59,67,60],[67,61,67,63],[66,70,66,75],[66,76,66,79],[67,0,67,12],[67,45,67,48],[67,49,67,50],[67,51,67,54],[67,55,67,56],[67,70,67,75],[67,76,67,79],[67,64,67,65],[67,66,67,67],[67,68,67,69],[65,0,65,12],[65,45,65,48],[65,49,65,50],[65,51,65,54],[65,55,65,56],[65,70,65,75],[65,76,65,79],[66,0,66,12],[66,45,66,48],[66,49,66,50],[66,51,66,54],[66,55,66,56],[66,57,66,58],[66,59,66,60],[66,61,66,63],[65,57,65,58],[65,59,65,60],[65,61,65,63],[65,64,65,65],[65,66,65,67],[65,68,65,69],[66,64,66,65],[66,66,66,67],[66,68,66,69],[62,76,62,77],[62,78,62,79],[63,76,63,79],[64,45,64,48],[64,49,64,50],[64,51,64,54],[64,55,64,56],[64,57,64,58],[64,61,64,63],[64,64,64,65],[64,66,64,67],[64,68,64,69],[64,70,64,75],[64,76,64,79],[62,0,64,13],[62,14,63,48],[62,49,63,58],[62,59,64,60],[62,61,63,63],[62,64,63,65],[62,66,63,69],[62,70,63,72],[62,73,63,75],[60,76,60,79],[61,0,61,17],[61,18,61,38],[61,61,61,64],[61,65,61,67],[61,68,61,71],[61,72,61,75],[61,76,61,79],[60,39,61,46],[60,52,61,60],[59,52,59,54],[59,55,59,56],[59,57,59,58],[59,59,59,60],[59,61,59,64],[59,65,59,67],[60,61,60,64],[60,65,60,67],[58,52,58,54],[58,55,58,56],[58,57,58,58],[58,59,58,60],[58,61,58,75],[60,68,60,71],[60,72,60,75],[58,76,58,79],[56,25,56,38],[56,47,56,61],[56,69,56,79],[57,0,57,79],[58,0,59,38],[58,39,59,40],[58,41,59,42],[58,43,59,44],[58,45,59,46],[58,47,61,51],[59,68,59,71],[59,72,59,75],[59,76,59,79],[60,0,60,13],[60,14,60,19],[60,20,60,22],[60,23,60,24],[60,25,60,38],[54,0,56,7],[54,8,55,18],[54,19,56,24],[54,25,55,38],[54,39,56,46],[54,47,55,61],[54,62,56,68],[54,69,55,79],[56,8,56,18],[52,66,52,67],[52,68,52,69],[52,70,52,75],[52,76,52,79],[53,0,53,12],[53,45,53,48],[53,49,53,50],[53,51,53,54],[53,55,53,56],[53,57,53,58],[53,76,53,79],[53,59,53,60],[53,61,53,63],[53,64,53,65],[53,66,53,67],[53,68,53,69],[53,70,53,75],[52,0,52,12],[52,45,52,48],[52,49,52,50],[52,51,52,54],[52,55,52,56],[52,57,52,58],[52,59,52,60],[52,61,52,63],[52,64,52,65],[50,66,50,67],[50,68,50,69],[50,70,50,75],[50,76,50,79],[51,0,51,12],[51,45,51,48],[51,49,51,50],[51,51,51,54],[51,55,51,56],[51,57,51,58],[51,76,51,79],[51,59,51,60],[51,61,51,63],[51,64,51,65],[51,66,51,67],[51,68,51,69],[51,70,51,75],[50,0,50,12],[50,45,50,48],[50,49,50,50],[50,51,50,54],[50,55,50,56],[50,57,50,58],[50,59,50,60],[50,61,50,63],[50,64,50,65],[48,66,48,67],[48,68,48,69],[48,70,48,75],[48,76,48,79],[49,0,49,12],[49,45,49,48],[49,49,49,50],[49,51,49,54],[49,55,49,56],[49,57,49,58],[49,76,49,79],[49,59,49,60],[49,61,49,63],[49,64,49,65],[49,66,49,67],[49,68,49,69],[49,70,49,75],[48,0,48,12],[48,45,48,48],[48,49,48,50],[48,51,48,54],[48,55,48,56],[48,57,48,58],[48,59,48,60],[48,61,48,63],[48,64,48,65],[46,66,46,67],[46,68,46,69],[46,70,46,75],[46,76,46,79],[47,0,47,12],[47,45,47,48],[47,49,47,50],[47,51,47,54],[47,55,47,56],[47,57,47,58],[47,76,47,79],[47,59,47,60],[47,61,47,63],[47,64,47,65],[47,66,47,67],[47,68,47,69],[47,70,47,75],[46,0,46,12],[46,45,46,48],[46,49,46,50],[46,51,46,54],[46,55,46,56],[46,57,46,58],[46,59,46,60],[46,61,46,63],[46,64,46,65],[44,66,44,67],[44,68,44,69],[44,70,44,75],[44,76,44,79],[45,0,45,12],[45,45,45,48],[45,49,45,50],[45,51,45,54],[45,55,45,56],[45,57,45,58],[45,76,45,79],[45,59,45,60],[45,61,45,63],[45,64,45,65],[45,66,45,67],[45,68,45,69],[45,70,45,75],[44,0,44,12],[44,45,44,48],[44,49,44,50],[44,51,44,54],[44,55,44,56],[44,57,44,58],[44,59,44,60],[44,61,44,63],[44,64,44,65],[39,68,39,71],[41,66,42,69],[41,70,42,72],[41,73,42,75],[41,76,41,77],[41,78,41,79],[42,76,42,79],[41,0,43,13],[41,14,42,48],[41,49,42,58],[41,59,43,60],[41,61,42,63],[41,64,42,65],[43,45,43,48],[43,49,43,50],[43,51,43,54],[43,55,43,56],[43,76,43,79],[43,57,43,58],[43,61,43,63],[43,64,43,65],[43,66,43,67],[43,68,43,69],[43,70,43,75],[37,52,37,54],[37,55,37,56],[37,57,37,58],[37,59,37,60],[37,61,37,75],[39,72,39,75],[39,76,39,79],[40,0,40,17],[40,18,40,38],[40,61,40,64],[40,65,40,67],[40,68,40,71],[40,72,40,75],[40,76,40,79],[39,0,39,13],[39,14,39,19],[39,20,39,22],[39,23,39,24],[39,25,39,38],[39,39,40,46],[37,47,40,51],[39,52,40,60],[39,61,39,64],[39,65,39,67],[38,52,38,54],[38,55,38,56],[38,57,38,58],[38,59,38,60],[38,61,38,64],[38,65,38,67],[38,68,38,71],[38,72,38,75],[38,76,38,79],[35,50,35,60],[35,71,35,79],[36,0,36,79],[37,0,38,38],[37,39,38,40],[37,41,38,42],[37,43,38,44],[37,45,38,46],[32,76,32,79],[33,50,33,56],[33,60,33,62],[33,71,33,79],[34,0,34,18],[34,19,34,26],[34,27,34,31],[34,36,34,40],[34,71,34,79],[32,59,32,60],[32,61,32,63],[32,64,32,65],[32,66,32,67],[32,68,32,69],[32,70,32,75],[37,76,37,79],[31,66,31,67],[31,68,31,69],[31,70,31,75],[31,76,31,79],[32,0,32,12],[32,45,32,48],[32,49,32,50],[32,51,32,54],[32,55,32,56],[32,57,32,58],[31,0,31,12],[31,45,31,48],[31,49,31,50],[31,51,31,54],[31,55,31,56],[31,57,31,58],[31,59,31,60],[31,61,31,63],[31,64,31,65],[29,70,29,75],[29,76,29,79],[30,0,30,12],[30,45,30,48],[30,49,30,50],[30,51,30,54],[30,55,30,56],[30,57,30,58],[30,76,30,79],[30,59,30,60],[30,61,30,63],[30,64,30,65],[30,66,30,67],[30,68,30,69],[30,70,30,75],[28,0,28,12],[28,45,28,48],[28,49,28,50],[28,51,28,54],[28,55,28,56],[28,57,28,58],[28,76,28,79],[29,0,29,12],[29,45,29,48],[29,49,29,50],[29,51,29,54],[29,55,29,56],[29,57,29,58],[29,59,29,60],[29,61,29,63],[29,64,29,65],[28,59,28,60],[28,61,28,63],[28,64,28,65],[28,66,28,67],[28,68,28,69],[28,70,28,75],[29,66,29,67],[29,68,29,69],[26,76,26,79],[27,0,27,12],[27,45,27,48],[27,49,27,50],[27,51,27,54],[27,55,27,56],[27,57,27,58],[27,59,27,60],[27,61,27,63],[27,64,27,65],[26,59,26,60],[26,61,26,63],[26,64,26,65],[26,66,26,67],[26,68,26,69],[26,70,26,75],[27,66,27,67],[27,68,27,69],[27,70,27,75],[27,76,27,79],[24,59,24,60],[24,61,24,63],[24,64,24,65],[24,66,24,67],[26,0,26,12],[26,45,26,48],[26,49,26,50],[26,55,26,56],[26,57,26,58],[22,51,22,54],[22,55,22,56],[22,57,22,58],[22,59,22,60],[24,68,24,69],[24,70,24,75],[24,76,24,79],[25,0,25,12],[25,45,25,48],[25,49,25,50],[25,55,25,56],[25,57,25,58],[25,59,25,60],[25,61,25,63],[25,64,25,65],[25,66,25,67],[25,68,25,69],[25,70,25,75],[25,76,25,79],[24,0,24,12],[24,45,24,48],[24,49,24,50],[24,55,24,56],[24,57,24,58],[23,0,23,12],[23,45,23,48],[23,49,23,50],[23,51,23,54],[23,55,23,56],[23,57,23,58],[23,76,23,79],[23,59,23,60],[23,61,23,63],[23,64,23,65],[23,66,23,67],[23,68,23,69],[23,70,23,75],[22,61,22,63],[22,64,22,65],[20,70,20,75],[20,76,20,79],[21,0,21,12],[21,45,21,48],[21,49,21,50],[21,51,21,54],[21,55,21,56],[21,57,21,58],[21,76,21,79],[21,59,21,60],[21,61,21,63],[21,64,21,65],[21,66,21,67],[21,68,21,69],[21,70,21,75],[22,66,22,67],[22,68,22,69],[22,70,22,75],[22,76,22,79],[22,0,22,12],[22,45,22,48],[22,49,22,50],[19,76,19,79],[20,0,20,12],[20,45,20,48],[20,49,20,50],[20,51,20,54],[20,55,20,56],[20,57,20,58],[20,59,20,60],[20,61,20,63],[20,64,20,65],[19,59,19,60],[19,61,19,63],[19,64,19,65],[19,66,19,67],[19,68,19,69],[19,70,19,75],[19,0,19,12],[19,45,19,48],[19,49,19,50],[19,51,19,54],[19,55,19,56],[19,57,19,58],[20,66,20,67],[20,68,20,69],[18,61,18,63],[18,64,18,65],[18,66,18,67],[18,68,18,69],[18,70,18,75],[18,76,18,79],[17,68,17,69],[17,70,17,75],[17,76,17,79],[18,0,18,12],[18,45,18,48],[18,49,18,50],[18,51,18,54],[18,55,18,56],[18,57,18,58],[18,59,18,60],[16,76,16,79],[17,0,17,12],[17,45,17,48],[17,49,17,50],[17,55,17,56],[17,57,17,58],[17,59,17,60],[17,61,17,63],[17,64,17,65],[17,66,17,67],[16,59,16,60],[16,61,16,63],[16,64,16,65],[16,66,16,67],[16,68,16,69],[16,70,16,75],[16,0,16,12],[16,45,16,48],[16,49,16,50],[16,51,16,54],[16,55,16,56],[16,57,16,58],[15,61,15,63],[15,64,15,65],[15,66,15,67],[15,68,15,69],[15,51,15,54],[15,70,15,75],[15,76,15,79],[14,66,14,67],[14,68,14,69],[14,70,14,75],[14,76,14,79],[15,0,15,12],[15,45,15,48],[15,49,15,50],[15,55,15,56],[15,57,15,58],[15,59,15,60],[14,0,14,12],[14,45,14,48],[14,49,14,50],[14,51,14,54],[14,55,14,56],[14,57,14,58],[14,59,14,60],[14,61,14,63],[14,64,14,65],[12,66,12,67],[12,68,12,69],[12,70,12,75],[12,76,12,79],[13,0,13,12],[13,45,13,48],[13,49,13,50],[13,51,13,54],[13,55,13,56],[13,57,13,58],[13,76,13,79],[13,59,13,60],[13,61,13,63],[13,64,13,65],[13,66,13,67],[13,68,13,69],[13,70,13,75],[12,0,12,12],[12,45,12,48],[12,49,12,50],[12,51,12,54],[12,55,12,56],[12,57,12,58],[12,59,12,60],[12,61,12,63],[12,64,12,65],[10,66,10,67],[10,68,10,69],[10,70,10,75],[10,76,10,79],[11,0,11,12],[11,45,11,48],[11,49,11,50],[11,51,11,54],[11,55,11,56],[11,57,11,58],[11,76,11,79],[11,59,11,60],[11,61,11,63],[11,64,11,65],[11,66,11,67],[11,68,11,69],[11,70,11,75],[10,0,10,12],[10,45,10,48],[10,49,10,50],[10,51,10,54],[10,55,10,56],[10,57,10,58],[10,59,10,60],[10,61,10,63],[10,64,10,65],[8,70,8,75],[8,76,8,79],[9,0,9,12],[9,45,9,48],[9,49,9,50],[9,51,9,54],[9,55,9,56],[9,57,9,58],[9,76,9,79],[9,59,9,60],[9,61,9,63],[9,64,9,65],[9,66,9,67],[9,68,9,69],[9,70,9,75],[7,0,7,12],[7,45,7,48],[7,49,7,50],[7,51,7,54],[7,55,7,56],[7,57,7,58],[7,76,7,79],[8,0,8,12],[8,45,8,48],[8,49,8,50],[8,51,8,54],[8,55,8,56],[8,57,8,58],[8,59,8,60],[8,61,8,63],[8,64,8,65],[7,59,7,60],[7,61,7,63],[7,64,7,65],[7,66,7,67],[7,68,7,69],[7,70,7,75],[8,66,8,67],[8,68,8,69],[4,76,4,77],[4,78,4,79],[5,76,5,79],[6,45,6,48],[6,49,6,50],[6,51,6,54],[6,55,6,56],[6,57,6,58],[6,61,6,63],[6,64,6,65],[6,66,6,67],[6,68,6,69],[6,70,6,75],[6,76,6,79],[4,0,6,13],[4,14,5,48],[4,49,5,58],[4,59,6,60],[4,61,5,63],[4,64,5,65],[4,66,5,69],[4,70,5,72],[4,73,5,75],[2,39,3,40],[2,41,3,42],[1,52,1,54],[1,55,1,56],[1,57,1,58],[1,59,1,60],[1,61,1,64],[1,65,1,67],[3,76,3,79],[2,52,3,60],[2,61,2,64],[2,72,2,75],[2,76,2,79],[3,61,3,64],[3,72,3,75],[2,65,2,71],[3,65,3,71],[0,52,0,54],[0,55,0,56],[0,57,0,58],[0,59,0,60],[0,61,0,75],[0,76,0,79],[0,0,1,38],[0,39,1,40],[0,41,1,42],[0,43,1,44],[0,45,1,46],[0,47,3,51],[2,43,3,44],[2,45,3,46],[3,0,3,17],[3,18,3,38],[1,68,1,71],[1,72,1,75],[1,76,1,79],[2,0,2,13],[2,14,2,19],[2,20,2,22],[2,23,2,24],[2,25,2,38]]}
["Бригадный   табель-расчёт",null,null,null,null,null,null,null,null,null,null,null,null,null,null,null,null,null,null,null,null,null,null,null,null,null,null,null,null,null,null,null,null,null,null,null,null,null,null,"Ма-\nкет",null,"В. з.",null,"Цех",null,"Уч.",null,"По\n\nбригаде",null,null,null,null,"Бр.  №",null,null,"Пр.",null,"Мес.",null,"Т. с.",null,"Коэффициенты  распределения",null,null,null,null,null,null,null,null,null,null,null,null,null,null,"%  прем.",null,null,null,null,"Разница"]
[null,null,null,null,null,null,null,null,null,null,null,null,null,null,null,null,null,null,null,null,null,null,null,null,null,null,null,null,null,null,null,null,null,null,null,null,null,null,null,null,null,null,null,null,null,null,null,null,null,null,null,null,null,null,null,null,null,null,null,null,null,"Нормо-час",null,null,null,null,null,null,"сумма",null,null,null,{"$f":"CD34","v":{"$error":"#VALUE!"}},null,null,null,{"$f":"SUM(BU4)","v":3941.1399999999985},null,null,null,null,{"$f":"BU2-CD34","v":{"$error":"#VALUE!"}}]
["за",null,null,null,null,null,null,null,null,null,null,null,null,null,"январь",null,null,null,null,null,20,null,null,24,null,"г.",null,null,null,null,null,null,null,null,null,null,null,null,null,null,null,null,null,9,null,1,null,null,null,null,null,null,"И Т О Г О",null,null,null,null,null,null,null,null,"Фактич.\nотр.  вр.",null,null,null,"Тарифный\nзаработок",null,null,null,null,null,null,"Сумма\nпремии",null,null,null,"Сдельная\nзарплата",null,null,null,null,null,null,"Коэф. расчета","чел. в бригаде",null,"Дата начала работ","2024-01-01"]
["Фамилия  бригадира :  ",null,null,null,null,null,null,null,null,null,null,null,null,null,null,null,null,null,"ЭМР. Заказ 529",null,null,null,null,null,null,null,null,null,null,null,null,null,null,null,null,null,null,null,null,null,null,null,null,null,null,null,null,null,null,null,null,null,null,null,null,null,null,null,null,null,null,{"$f":"SUM(AT8:AW33)","v":64.8},null,null,null,{"$f":"SUM(BJ8:BL33)","v":11898.86},null,null,null,null,null,null,{"$f":"SUM(BS8:BX33)","v":3941.1399999999985},null,null,null,{"$f":"CD34","v":{"$error":"#VALUE!"}},null,null,null,null,{"$f":"SUM(BF8:BG33)-CG4","v":2.5299999999999998},{"$f":"SUM(CD8-BJ8)","v":9575.2799999999988},null,null,null,"Дата окончан. работ","2024-01-31"]
["Фамилия,   имя,\nотчество",null,null,null,null,null,null,null,null,null,null,null,null,null,"Отработано  часов  по  числам  месяца",null,null,null,null,null,null,null,null,null,null,null,null,null,null,null,null,null,null,null,null,null,null,null,null,null,null,null,null,null,null,null,null,null,null,"Состав  бригады",null,null,null,null,null,null,null,null,null,"За  час",null,"За  отраб.\nвремя",null,null,"Нор-\nчасы",null,"Факт.\nотраб.",null,null,null,"В.  о.",null,null,"01",null,null,"В.о.",null,null,null,null,null,null,null,{"$f":"CI34/CG4","v":{"$error":"#DIV/0!"}},null,"Шаг",1]
[null,null,null,null,null,null,null,null,null,null,null,null,null,null,null,null,null,null,null,null,null,null,null,null,null,null,null,null,null,null,null,null,null,null,null,null,null,null,null,null,null,null,null,null,null,null,null,null,null,null,null,null,null,null,null,null,null,null,null,null,null,null,null,null,null,null,null,null,null,null,null,null,null,null,null,null,"зак.  (ст)"]
{"$rows_left_out":35}