{"text_format":"1","workbook":"xlsx","n_sheets":2,"sheets":["1","2"],"not_rendered":{"charts":0,"images":0,"macros":1,"external_links":0,"defined_names":1,"comments":0,"pivot_tables":0},"unopened":[],"bounds":{"document_bytes":16777216,"sheet_cells":100000,"rows_first":2000,"rows_last":500,"rows_between":2000,"halvings":0,"cell_chars":16384,"cell_head_chars":4096},"cells_cut":0,"cells_raw":0,"read":"whole","date_system":"1900"}

{"sheet":"1","index":0,"n_rows":5,"n_cols":7,"rows_kept":5,"cut":false,"hidden":false,"merged":[]}
["Животные","Номер","Номер","Номер","Номер","Номер","Номер"]
["кролик"]
["чупакабра"]
["бобёр"]
["хомяк"]

{"sheet":"2","index":1,"n_rows":37,"n_cols":8,"rows_kept":37,"cut":false,"hidden":false,"merged":[]}
["Номер","Животные","0","1",null,null,3,{"$f":"INDEX('1'!A:A,G1)","v":"чупакабра"}]
[22,"кролик",{"$f":"IF(Таблица1[[#This Row],[Животные]]=H$1,IF(ISNA(MATCH(Таблица1[[#This Row],[Номер]],INDEX('1'!$1:$1048576,G$1,),)),C1+1,C1),C1)","v":"0"},{"$f":"IFERROR(INDEX(Таблица1[Номер],MATCH(ROW(D1),Таблица1[0],)),\"|\")","v":286}]
[33,"кролик",{"$f":"IF(Таблица1[[#This Row],[Животные]]=H$1,IF(ISNA(MATCH(Таблица1[[#This Row],[Номер]],INDEX('1'!$1:$1048576,G$1,),)),C2+1,C2),C2)","v":"0"},{"$f":"IFERROR(INDEX(Таблица1[Номер],MATCH(ROW(D2),Таблица1[0],)),\"|\")","v":297},null,null,{"$f":"IF(D2=\"|\",\"|\",\"D2:D\"&MATCH(\"|\",Таблица1[1],))","v":"D2:D7"}]
[44,"кролик",{"$f":"IF(Таблица1[[#This Row],[Животные]]=H$1,IF(ISNA(MATCH(Таблица1[[#This Row],[Номер]],INDEX('1'!$1:$1048576,G$1,),)),C3+1,C3),C3)","v":"0"},{"$f":"IFERROR(INDEX(Таблица1[Номер],MATCH(ROW(D3),Таблица1[0],)),\"|\")","v":308},null,null,{"$f":"CELL(\"filename\",H5)","v":"D:\\[22.xlsm]2"}]
[55,"кролик",{"$f":"IF(Таблица1[[#This Row],[Животные]]=H$1,IF(ISNA(MATCH(Таблица1[[#This Row],[Номер]],INDEX('1'!$1:$1048576,G$1,),)),C4+1,C4),C4)","v":"0"},{"$f":"IFERROR(INDEX(Таблица1[Номер],MATCH(ROW(D4),Таблица1[0],)),\"|\")","v":319},null,null,{"$f":"\"'\"&MID(G4,SEARCH(\"]\",G4)+1,31)&\"'!\"&G3","v":"'2'!D2:D7"}]
[66,"кролик",{"$f":"IF(Таблица1[[#This Row],[Животные]]=H$1,IF(ISNA(MATCH(Таблица1[[#This Row],[Номер]],INDEX('1'!$1:$1048576,G$1,),)),C5+1,C5),C5)","v":"0"},{"$f":"IFERROR(INDEX(Таблица1[Номер],MATCH(ROW(D5),Таблица1[0],)),\"|\")","v":330}]
[77,"кролик",{"$f":"IF(Таблица1[[#This Row],[Животные]]=H$1,IF(ISNA(MATCH(Таблица1[[#This Row],[Номер]],INDEX('1'!$1:$1048576,G$1,),)),C6+1,C6),C6)","v":"0"},{"$f":"IFERROR(INDEX(Таблица1[Номер],MATCH(ROW(D6),Таблица1[0],)),\"|\")","v":341}]
[88,"бобёр",{"$f":"IF(Таблица1[[#This Row],[Животные]]=H$1,IF(ISNA(MATCH(Таблица1[[#This Row],[Номер]],INDEX('1'!$1:$1048576,G$1,),)),C7+1,C7),C7)","v":"0"},{"$f":"IFERROR(INDEX(Таблица1[Номер],MATCH(ROW(D7),Таблица1[0],)),\"|\")","v":"|"}]
[99,"бобёр",{"$f":"IF(Таблица1[[#This Row],[Животные]]=H$1,IF(ISNA(MATCH(Таблица1[[#This Row],[Номер]],INDEX('1'!$1:$1048576,G$1,),)),C8+1,C8),C8)","v":"0"},{"$f":"IFERROR(INDEX(Таблица1[Номер],MATCH(ROW(D8),Таблица1[0],)),\"|\")","v":"|"}]
[110,"бобёр",{"$f":"IF(Таблица1[[#This Row],[Животные]]=H$1,IF(ISNA(MATCH(Таблица1[[#This Row],[Номер]],INDEX('1'!$1:$1048576,G$1,),)),C9+1,C9),C9)","v":"0"},{"$f":"IFERROR(INDEX(Таблица1[Номер],MATCH(ROW(D9),Таблица1[0],)),\"|\")","v":"|"}]
[121,"бобёр",{"$f":"IF(Таблица1[[#This Row],[Животные]]=H$1,IF(ISNA(MATCH(Таблица1[[#This Row],[Номер]],INDEX('1'!$1:$1048576,G$1,),)),C10+1,C10),C10)","v":"0"},{"$f":"IFERROR(INDEX(Таблица1[Номер],MATCH(ROW(D10),Таблица1[0],)),\"|\")","v":"|"}]
[132,"бобёр",{"$f":"IF(Таблица1[[#This Row],[Животные]]=H$1,IF(ISNA(MATCH(Таблица1[[#This Row],[Номер]],INDEX('1'!$1:$1048576,G$1,),)),C11+1,C11),C11)","v":"0"},{"$f":"IFERROR(INDEX(Таблица1[Номер],MATCH(ROW(D11),Таблица1[0],)),\"|\")","v":"|"}]
[143,"бобёр",{"$f":"IF(Таблица1[[#This Row],[Животные]]=H$1,IF(ISNA(MATCH(Таблица1[[#This Row],[Номер]],INDEX('1'!$1:$1048576,G$1,),)),C12+1,C12),C12)","v":"0"},{"$f":"IFERROR(INDEX(Таблица1[Номер],MATCH(ROW(D12),Таблица1[0],)),\"|\")","v":"|"}]
[154,"хомяк",{"$f":"IF(Таблица1[[#This Row],[Животные]]=H$1,IF(ISNA(MATCH(Таблица1[[#This Row],[Номер]],INDEX('1'!$1:$1048576,G$1,),)),C13+1,C13),C13)","v":"0"},{"$f":"IFERROR(INDEX(Таблица1[Номер],MATCH(ROW(D13),Таблица1[0],)),\"|\")","v":"|"}]
[165,"хомяк",{"$f":"IF(Таблица1[[#This Row],[Животные]]=H$1,IF(ISNA(MATCH(Таблица1[[#This Row],[Номер]],INDEX('1'!$1:$1048576,G$1,),)),C14+1,C14),C14)","v":"0"},{"$f":"IFERROR(INDEX(Таблица1[Номер],MATCH(ROW(D14),Таблица1[0],)),\"|\")","v":"|"}]
[176,"хомяк",{"$f":"IF(Таблица1[[#This Row],[Животные]]=H$1,IF(ISNA(MATCH(Таблица1[[#This Row],[Номер]],INDEX('1'!$1:$1048576,G$1,),)),C15+1,C15),C15)","v":"0"},{"$f":"IFERROR(INDEX(Таблица1[Номер],MATCH(ROW(D15),Таблица1[0],)),\"|\")","v":"|"}]
[187,"хомяк",{"$f":"IF(Таблица1[[#This Row],[Животные]]=H$1,IF(ISNA(MATCH(Таблица1[[#This Row],[Номер]],INDEX('1'!$1:$1048576,G$1,),)),C16+1,C16),C16)","v":"0"},{"$f":"IFERROR(INDEX(Таблица1[Номер],MATCH(ROW(D16),Таблица1[0],)),\"|\")","v":"|"}]
[198,"хомяк",{"$f":"IF(Таблица1[[#This Row],[Животные]]=H$1,IF(ISNA(MATCH(Таблица1[[#This Row],[Номер]],INDEX('1'!$1:$1048576,G$1,),)),C17+1,C17),C17)","v":"0"},{"$f":"IFERROR(INDEX(Таблица1[Номер],MATCH(ROW(D17),Таблица1[0],)),\"|\")","v":"|"}]
[209,"хомяк",{"$f":"IF(Таблица1[[#This Row],[Животные]]=H$1,IF(ISNA(MATCH(Таблица1[[#This Row],[Номер]],INDEX('1'!$1:$1048576,G$1,),)),C18+1,C18),C18)","v":"0"},{"$f":"IFERROR(INDEX(Таблица1[Номер],MATCH(ROW(D18),Таблица1[0],)),\"|\")","v":"|"}]
[220,"выдра",{"$f":"IF(Таблица1[[#This Row],[Животные]]=H$1,IF(ISNA(MATCH(Таблица1[[#This Row],[Номер]],INDEX('1'!$1:$1048576,G$1,),)),C19+1,C19),C19)","v":"0"},{"$f":"IFERROR(INDEX(Таблица1[Номер],MATCH(ROW(D19),Таблица1[0],)),\"|\")","v":"|"}]
[231,"выдра",{"$f":"IF(Таблица1[[#This Row],[Животные]]=H$1,IF(ISNA(MATCH(Таблица1[[#This Row],[Номер]],INDEX('1'!$1:$1048576,G$1,),)),C20+1,C20),C20)","v":"0"},{"$f":"IFERROR(INDEX(Таблица1[Номер],MATCH(ROW(D20),Таблица1[0],)),\"|\")","v":"|"}]
[242,"выдра",{"$f":"IF(Таблица1[[#This Row],[Животные]]=H$1,IF(ISNA(MATCH(Таблица1[[#This Row],[Номер]],INDEX('1'!$1:$1048576,G$1,),)),C21+1,C21),C21)","v":"0"},{"$f":"IFERROR(INDEX(Таблица1[Номер],MATCH(ROW(D21),Таблица1[0],)),\"|\")","v":"|"}]
[253,"выдра",{"$f":"IF(Таблица1[[#This Row],[Животные]]=H$1,IF(ISNA(MATCH(Таблица1[[#This Row],[Номер]],INDEX('1'!$1:$1048576,G$1,),)),C22+1,C22),C22)","v":"0"},{"$f":"IFERROR(INDEX(Таблица1[Номер],MATCH(ROW(D22),Таблица1[0],)),\"|\")","v":"|"}]
[264,"выдра",{"$f":"IF(Таблица1[[#This Row],[Животные]]=H$1,IF(ISNA(MATCH(Таблица1[[#This Row],[Номер]],INDEX('1'!$1:$1048576,G$1,),)),C23+1,C23),C23)","v":"0"},{"$f":"IFERROR(INDEX(Таблица1[Номер],MATCH(ROW(D23),Таблица1[0],)),\"|\")","v":"|"}]
[275,"выдра",{"$f":"IF(Таблица1[[#This Row],[Животные]]=H$1,IF(ISNA(MATCH(Таблица1[[#This Row],[Номер]],INDEX('1'!$1:$1048576,G$1,),)),C24+1,C24),C24)","v":"0"},{"$f":"IFERROR(INDEX(Таблица1[Номер],MATCH(ROW(D24),Таблица1[0],)),\"|\")","v":"|"}]
[286,"чупакабра",{"$f":"IF(Таблица1[[#This Row],[Животные]]=H$1,IF(ISNA(MATCH(Таблица1[[#This Row],[Номер]],INDEX('1'!$1:$1048576,G$1,),)),C25+1,C25),C25)","v":1},{"$f":"IFERROR(INDEX(Таблица1[Номер],MATCH(ROW(D25),Таблица1[0],)),\"|\")","v":"|"}]
[297,"чупакабра",{"$f":"IF(Таблица1[[#This Row],[Животные]]=H$1,IF(ISNA(MATCH(Таблица1[[#This Row],[Номер]],INDEX('1'!$1:$1048576,G$1,),)),C26+1,C26),C26)","v":2},{"$f":"IFERROR(INDEX(Таблица1[Номер],MATCH(ROW(D26),Таблица1[0],)),\"|\")","v":"|"}]
[308,"чупакабра",{"$f":"IF(Таблица1[[#This Row],[Животные]]=H$1,IF(ISNA(MATCH(Таблица1[[#This Row],[Номер]],INDEX('1'!$1:$1048576,G$1,),)),C27+1,C27),C27)","v":3},{"$f":"IFERROR(INDEX(Таблица1[Номер],MATCH(ROW(D27),Таблица1[0],)),\"|\")","v":"|"}]
[319,"чупакабра",{"$f":"IF(Таблица1[[#This Row],[Животные]]=H$1,IF(ISNA(MATCH(Таблица1[[#This Row],[Номер]],INDEX('1'!$1:$1048576,G$1,),)),C28+1,C28),C28)","v":4},{"$f":"IFERROR(INDEX(Таблица1[Номер],MATCH(ROW(D28),Таблица1[0],)),\"|\")","v":"|"}]
[330,"чупакабра",{"$f":"IF(Таблица1[[#This Row],[Животные]]=H$1,IF(ISNA(MATCH(Таблица1[[#This Row],[Номер]],INDEX('1'!$1:$1048576,G$1,),)),C29+1,C29),C29)","v":5},{"$f":"IFERROR(INDEX(Таблица1[Номер],MATCH(ROW(D29),Таблица1[0],)),\"|\")","v":"|"}]
[341,"чупакабра",{"$f":"IF(Таблица1[[#This Row],[Животные]]=H$1,IF(ISNA(MATCH(Таблица1[[#This Row],[Номер]],INDEX('1'!$1:$1048576,G$1,),)),C30+1,C30),C30)","v":6},{"$f":"IFERROR(INDEX(Таблица1[Номер],MATCH(ROW(D30),Таблица1[0],)),\"|\")","v":"|"}]
[null,null,{"$f":"IF(Таблица1[[#This Row],[Животные]]=H$1,IF(ISNA(MATCH(Таблица1[[#This Row],[Номер]],INDEX('1'!$1:$1048576,G$1,),)),C31+1,C31),C31)","v":6},{"$f":"IFERROR(INDEX(Таблица1[Номер],MATCH(ROW(D31),Таблица1[0],)),\"|\")","v":"|"}]
[null,null,{"$f":"IF(Таблица1[[#This Row],[Животные]]=H$1,IF(ISNA(MATCH(Таблица1[[#This Row],[Номер]],INDEX('1'!$1:$1048576,G$1,),)),C32+1,C32),C32)","v":6},{"$f":"IFERROR(INDEX(Таблица1[Номер],MATCH(ROW(D32),Таблица1[0],)),\"|\")","v":"|"}]
[null,null,{"$f":"IF(Таблица1[[#This Row],[Животные]]=H$1,IF(ISNA(MATCH(Таблица1[[#This Row],[Номер]],INDEX('1'!$1:$1048576,G$1,),)),C33+1,C33),C33)","v":6},{"$f":"IFERROR(INDEX(Таблица1[Номер],MATCH(ROW(D33),Таблица1[0],)),\"|\")","v":"|"}]
[null,null,{"$f":"IF(Таблица1[[#This Row],[Животные]]=H$1,IF(ISNA(MATCH(Таблица1[[#This Row],[Номер]],INDEX('1'!$1:$1048576,G$1,),)),C34+1,C34),C34)","v":6},{"$f":"IFERROR(INDEX(Таблица1[Номер],MATCH(ROW(D34),Таблица1[0],)),\"|\")","v":"|"}]
[null,null,{"$f":"IF(Таблица1[[#This Row],[Животные]]=H$1,IF(ISNA(MATCH(Таблица1[[#This Row],[Номер]],INDEX('1'!$1:$1048576,G$1,),)),C35+1,C35),C35)","v":6},{"$f":"IFERROR(INDEX(Таблица1[Номер],MATCH(ROW(D35),Таблица1[0],)),\"|\")","v":"|"}]
[null,null,{"$f":"IF(Таблица1[[#This Row],[Животные]]=H$1,IF(ISNA(MATCH(Таблица1[[#This Row],[Номер]],INDEX('1'!$1:$1048576,G$1,),)),C36+1,C36),C36)","v":6},{"$f":"IFERROR(INDEX(Таблица1[Номер],MATCH(ROW(D36),Таблица1[0],)),\"|\")","v":"|"}]