{"text_format":"1","workbook":"xlsx","n_sheets":2,"sheets":["СВОДНАЯ","Протокол"],"not_rendered":{"charts":0,"images":0,"macros":1,"external_links":0,"defined_names":0,"comments":0,"pivot_tables":0},"unopened":[],"bounds":{"document_bytes":16777216,"sheet_cells":100000,"rows_first":2000,"rows_last":500,"rows_between":2000,"halvings":0,"cell_chars":16384,"cell_head_chars":4096},"cells_cut":0,"cells_raw":0,"read":"whole","date_system":"1900"}

{"sheet":"СВОДНАЯ","index":0,"n_rows":34,"n_cols":18,"rows_kept":34,"cut":false,"hidden":false,"merged":[[1,12,1,17],[1,1,1,9],[1,10,1,11]]}
[null,1,2,3,4,5,6,7,8,9,10,11,12,13,14,15,16,17]
[null,"сведения по аудиту",null,null,null,null,null,null,null,null,"несоответствия (НС)"]
[null,"номер аудита","дата аудита","тип аудита","ведущий аудитор ФИО","группа аудиторов ФИО","наименование организации / отдела (для внутреннего аудита)","аудируемый представитель ФИО","номер предыдущего аудита","дата предыдущего аудита","номер п.п стандарта","Информация о наблюдении (формулировка НС и объективное свидетельство","Коррекции (для немедленного исправления)","Анализ первопричины (определить причину возникновения НС)","План КД \n(действия для предотвращения повторения)","ответственный","срок выполнения","проверка свидетельств, принятие коррекции и КД для НС"]
[1,"240411-01","2024-04-09","внешний","Петров","отсутствует","Ромашка","Иванов","230404-01","2023-04-04","1.1.","белка","поймали","орехи","белколовитель","Петров","2012-12-12","в следующий раз"]
[2,"240411-01","2024-04-09","внешний","Петров","отсутствует","Ромашка","Иванов","230404-01","2023-04-04","2.1.","заяц","сам пришел","морковка","зайцеловитель","Волков","2001-01-01","через раз"]
[4,"240411-01","2024-04-09","внешний","Петров","отсутствует","Ромашка","Иванов","230404-01","2023-04-04","1.1.","опять белка","отпустили","Петров","ограждение","Мазай","2024-04-04","когда-нибудь"]
[5]
[6]
[7]
[8]
[9]
[10]
[11]
[12]
[13]
[14]
[15]
[16]
[17]
[18]
[19]
[20]
[21]
[22]
[23]
[24]
[25]
[26]
[27]
[28]
[29]
[30]
[31]
[32]

{"sheet":"Протокол","index":1,"n_rows":10,"n_cols":9,"rows_kept":10,"cut":false,"hidden":false,"merged":[[3,1,3,4],[0,2,1,2],[8,1,8,8]]}
[null,null,"Протокол КД (аудит)","Номер: РП-09-Л.01.2","240411-01"]
[null,null,null,"Дата протокола:",{"$f":"VLOOKUP($E$1,СВОДНАЯ!$B$4:$R$1100,16,FALSE)","v":"2012-12-12"}]
[]
[null,"Сведения по аудиту"]
[null,"дата аудита",{"$f":"VLOOKUP($E$1,СВОДНАЯ!$B$4:$R$1100,2,FALSE)","v":"2024-04-09"},"тип аудита",{"$f":"VLOOKUP($E$1,СВОДНАЯ!$B$4:$R$1100,3,FALSE)","v":"внешний"}]
[null,"ведущий аудитор ФИО",{"$f":"VLOOKUP($E$1,СВОДНАЯ!$B$4:$R$1100,4,FALSE)","v":"Петров"},"группа аудиторов ФИО",{"$f":"VLOOKUP($E$1,СВОДНАЯ!$B$4:$R$1100,5,FALSE)","v":"отсутствует"}]
[null,"наименование ",{"$f":"VLOOKUP($E$1,СВОДНАЯ!$B$4:$R$1100,6,FALSE)","v":"Ромашка"},"номер предыдущего аудита",{"$f":"VLOOKUP($E$1,СВОДНАЯ!$B$4:$R$1100,8,FALSE)","v":"230404-01"}]
[null,"аудируемый представитель ФИО",{"$f":"VLOOKUP($E$1,СВОДНАЯ!$B$4:$R$1100,7,FALSE)","v":"Иванов"},"дата предыдущего аудита",{"$f":"VLOOKUP($E$1,СВОДНАЯ!$B$4:$R$1100,9,FALSE)","v":"2023-04-04"}]
[null,"План КД"]
[null,"номер п.п стандарта","Информация о наблюдении \n(формулировка НС и объективное свидетельство)","Коррекции \n(для немедленного исправления)","Анализ первопричины (определить причину возникновения НС)","План КД \n(действия для предотвращения повторения)","ответствен-ный","срок выполнения","принятие коррекции и КД для НС"]