{"text_format":"1","workbook":"xlsx","n_sheets":5,"sheets":["Лист1","Лист2","Лист3","Лист4","Лист5"],"not_rendered":{"charts":0,"images":0,"macros":1,"external_links":0,"defined_names":2,"comments":0,"pivot_tables":0},"unopened":[],"bounds":{"document_bytes":16777216,"sheet_cells":100000,"rows_first":2000,"rows_last":500,"rows_between":2000,"halvings":0,"cell_chars":16384,"cell_head_chars":4096},"cells_cut":0,"cells_raw":0,"read":"whole","date_system":"1900"}

{"sheet":"Лист1","index":0,"n_rows":31,"n_cols":12,"rows_kept":31,"cut":false,"hidden":true,"merged":[]}
["Имя файла","Размер","Дата изменения","MD5","CRC32","SHA1",null,"MD5",null,"Отсечение разрешения файла","Добавление в конец \"-УЛ\"","Выбор алгоритма "]
["profile.rar",562944,"2023-11-03T17:09:00","7B169E249554CA63078DF9BDE053ACD7","8EF0F5FF","E49ADF52FB317685CB23D8177D1FF242BEF57E70",null,"CRC32",null,{"$f":"IF(A2=\"\",\"\",LEFT(A2,SEARCH(\".\",A2)-1))","v":"profile"},{"$f":"IF(J2=\"\",\"\",J2&\"-УЛ\")","v":"profile-УЛ"},{"$f":"UPPER((IF(Лист5!$H$7=\"MD5\",D2,IF(Лист5!$H$7=\"CRC32\",E2,IF(Лист5!$H$7=\"SHA1\",F2,\"\")))))","v":"E49ADF52FB317685CB23D8177D1FF242BEF57E70"}]
["Tablitsy_kolodtsev_NVK_raschet_v_1_0 (1).xlsx",126215,"2023-12-15T21:11:38","26200018FB056096A26214C6C5011333","5B509CFD","3E517DBD26B1CC73DC10F3A6577BB5A3FC28ADA2",null,"SHA1",null,"Tablitsy_kolodtsev_NVK_raschet_v_1_0 (1)",{"$f":"IF(J3=\"\",\"\",J3&\"-УЛ\")","v":"Tablitsy_kolodtsev_NVK_raschet_v_1_0 (1)-УЛ"},{"$f":"UPPER((IF(Лист5!$H$7=\"MD5\",D3,IF(Лист5!$H$7=\"CRC32\",E3,IF(Лист5!$H$7=\"SHA1\",F3,\"\")))))","v":"3E517DBD26B1CC73DC10F3A6577BB5A3FC28ADA2"}]
["Инструкция.doc",477696,"2023-11-03T17:01:38","CA817403757D23109E8228F917301314","D2F0C99","C3C5F0CD9F134BCD496A94AEF09E80AFA92FE687",null,null,null,"Инструкция","Инструкция-УЛ",{"$f":"UPPER((IF(Лист5!$H$7=\"MD5\",D4,IF(Лист5!$H$7=\"CRC32\",E4,IF(Лист5!$H$7=\"SHA1\",F4,\"\")))))","v":"C3C5F0CD9F134BCD496A94AEF09E80AFA92FE687"}]
[null,null,null,null,null,null,null,null,null,"","",{"$f":"UPPER((IF(Лист5!$H$7=\"MD5\",D5,IF(Лист5!$H$7=\"CRC32\",E5,IF(Лист5!$H$7=\"SHA1\",F5,\"\")))))","v":""}]
[null,null,null,null,null,null,null,null,null,"","",{"$f":"UPPER((IF(Лист5!$H$7=\"MD5\",D6,IF(Лист5!$H$7=\"CRC32\",E6,IF(Лист5!$H$7=\"SHA1\",F6,\"\")))))","v":""}]
[null,null,null,null,null,null,null,null,null,"","",{"$f":"UPPER((IF(Лист5!$H$7=\"MD5\",D7,IF(Лист5!$H$7=\"CRC32\",E7,IF(Лист5!$H$7=\"SHA1\",F7,\"\")))))","v":""}]
[null,null,null,null,null,null,null,null,null,"","",{"$f":"UPPER((IF(Лист5!$H$7=\"MD5\",D8,IF(Лист5!$H$7=\"CRC32\",E8,IF(Лист5!$H$7=\"SHA1\",F8,\"\")))))","v":""}]
[null,null,null,null,null,null,null,null,null,"","",{"$f":"UPPER((IF(Лист5!$H$7=\"MD5\",D9,IF(Лист5!$H$7=\"CRC32\",E9,IF(Лист5!$H$7=\"SHA1\",F9,\"\")))))","v":""}]
[null,null,null,null,null,null,null,null,null,"","",{"$f":"UPPER((IF(Лист5!$H$7=\"MD5\",D10,IF(Лист5!$H$7=\"CRC32\",E10,IF(Лист5!$H$7=\"SHA1\",F10,\"\")))))","v":""}]
[null,null,null,null,null,null,null,null,null,"","",{"$f":"UPPER((IF(Лист5!$H$7=\"MD5\",D11,IF(Лист5!$H$7=\"CRC32\",E11,IF(Лист5!$H$7=\"SHA1\",F11,\"\")))))","v":""}]
[null,null,null,null,null,null,null,null,null,"","",{"$f":"UPPER((IF(Лист5!$H$7=\"MD5\",D12,IF(Лист5!$H$7=\"CRC32\",E12,IF(Лист5!$H$7=\"SHA1\",F12,\"\")))))","v":""}]
[null,null,null,null,null,null,null,null,null,"","",{"$f":"UPPER((IF(Лист5!$H$7=\"MD5\",D13,IF(Лист5!$H$7=\"CRC32\",E13,IF(Лист5!$H$7=\"SHA1\",F13,\"\")))))","v":""}]
[null,null,null,null,null,null,null,null,null,"","",{"$f":"UPPER((IF(Лист5!$H$7=\"MD5\",D14,IF(Лист5!$H$7=\"CRC32\",E14,IF(Лист5!$H$7=\"SHA1\",F14,\"\")))))","v":""}]
[null,null,null,null,null,null,null,null,null,"","",{"$f":"UPPER((IF(Лист5!$H$7=\"MD5\",D15,IF(Лист5!$H$7=\"CRC32\",E15,IF(Лист5!$H$7=\"SHA1\",F15,\"\")))))","v":""}]
[null,null,null,null,null,null,null,null,null,"","",{"$f":"UPPER((IF(Лист5!$H$7=\"MD5\",D16,IF(Лист5!$H$7=\"CRC32\",E16,IF(Лист5!$H$7=\"SHA1\",F16,\"\")))))","v":""}]
[null,null,null,null,null,null,null,null,null,"","",{"$f":"UPPER((IF(Лист5!$H$7=\"MD5\",D17,IF(Лист5!$H$7=\"CRC32\",E17,IF(Лист5!$H$7=\"SHA1\",F17,\"\")))))","v":""}]
[null,null,null,null,null,null,null,null,null,"","",{"$f":"UPPER((IF(Лист5!$H$7=\"MD5\",D18,IF(Лист5!$H$7=\"CRC32\",E18,IF(Лист5!$H$7=\"SHA1\",F18,\"\")))))","v":""}]
[null,null,null,null,null,null,null,null,null,"","",{"$f":"UPPER((IF(Лист5!$H$7=\"MD5\",D19,IF(Лист5!$H$7=\"CRC32\",E19,IF(Лист5!$H$7=\"SHA1\",F19,\"\")))))","v":""}]
[null,null,null,null,null,null,null,null,null,"","",{"$f":"UPPER((IF(Лист5!$H$7=\"MD5\",D20,IF(Лист5!$H$7=\"CRC32\",E20,IF(Лист5!$H$7=\"SHA1\",F20,\"\")))))","v":""}]
[null,null,null,null,null,null,null,null,null,"","",{"$f":"UPPER((IF(Лист5!$H$7=\"MD5\",D21,IF(Лист5!$H$7=\"CRC32\",E21,IF(Лист5!$H$7=\"SHA1\",F21,\"\")))))","v":""}]
[null,null,null,null,null,null,null,null,null,"","",{"$f":"UPPER((IF(Лист5!$H$7=\"MD5\",D22,IF(Лист5!$H$7=\"CRC32\",E22,IF(Лист5!$H$7=\"SHA1\",F22,\"\")))))","v":""}]
[null,null,null,null,null,null,null,null,null,"","",{"$f":"UPPER((IF(Лист5!$H$7=\"MD5\",D23,IF(Лист5!$H$7=\"CRC32\",E23,IF(Лист5!$H$7=\"SHA1\",F23,\"\")))))","v":""}]
[null,null,null,null,null,null,null,null,null,"","",{"$f":"UPPER((IF(Лист5!$H$7=\"MD5\",D24,IF(Лист5!$H$7=\"CRC32\",E24,IF(Лист5!$H$7=\"SHA1\",F24,\"\")))))","v":""}]
[null,null,null,null,null,null,null,null,null,"","",{"$f":"UPPER((IF(Лист5!$H$7=\"MD5\",D25,IF(Лист5!$H$7=\"CRC32\",E25,IF(Лист5!$H$7=\"SHA1\",F25,\"\")))))","v":""}]
[null,null,null,null,null,null,null,null,null,"","",{"$f":"UPPER((IF(Лист5!$H$7=\"MD5\",D26,IF(Лист5!$H$7=\"CRC32\",E26,IF(Лист5!$H$7=\"SHA1\",F26,\"\")))))","v":""}]
[null,null,null,null,null,null,null,null,null,"","",{"$f":"UPPER((IF(Лист5!$H$7=\"MD5\",D27,IF(Лист5!$H$7=\"CRC32\",E27,IF(Лист5!$H$7=\"SHA1\",F27,\"\")))))","v":""}]
[null,null,null,null,null,null,null,null,null,"","",{"$f":"UPPER((IF(Лист5!$H$7=\"MD5\",D28,IF(Лист5!$H$7=\"CRC32\",E28,IF(Лист5!$H$7=\"SHA1\",F28,\"\")))))","v":""}]
[null,null,null,null,null,null,null,null,null,"","",{"$f":"UPPER((IF(Лист5!$H$7=\"MD5\",D29,IF(Лист5!$H$7=\"CRC32\",E29,IF(Лист5!$H$7=\"SHA1\",F29,\"\")))))","v":""}]
[null,null,null,null,null,null,null,null,null,"","",{"$f":"UPPER((IF(Лист5!$H$7=\"MD5\",D30,IF(Лист5!$H$7=\"CRC32\",E30,IF(Лист5!$H$7=\"SHA1\",F30,\"\")))))","v":""}]
[null,null,null,null,null,null,null,null,null,"","",{"$f":"UPPER((IF(Лист5!$H$7=\"MD5\",D31,IF(Лист5!$H$7=\"CRC32\",E31,IF(Лист5!$H$7=\"SHA1\",F31,\"\")))))","v":""}]

{"sheet":"Лист2","index":1,"n_rows":31,"n_cols":16,"rows_kept":31,"cut":false,"hidden":false,"merged":[[0,4,0,8],[0,9,0,13],[0,15,0,22]]}
["№ п/п","Наименование файла","Наименование изделия, вид документа","Номер последнего изменения","Характер работы",null,null,null,null,"ФИО",null,null,null,null,null,"Если есть совпадение"]
[{"$f":"IF(ISBLANK(B2),\"\",COUNTA($B$2:B2))","v":1},"profile.rar","Архив профиля",1,"Инженер","ГИП","Директор",null,null,"Иванов","Петров","Сидоров",null,null,null,{"$f":"IF(SEARCH(\"*ПОС*\", B2), \"Проект организации строительства\", \"\")","v":{"$error":"#VALUE!"}}]
[{"$f":"IF(ISBLANK(B3),\"\",COUNTA($B$2:B3))","v":2},"Tablitsy_kolodtsev_NVK_raschet_v_1_0 (1).xlsx","Таблица колодцев",1,"Инженер","ГИП","Директор",null,null,"Иванов","Петров","Сидоров"]
[{"$f":"IF(ISBLANK(B4),\"\",COUNTA($B$2:B4))","v":3},"Инструкция.doc","Пояснительная записка",1,"Инженер","ГИП","Директор",null,null,"Иванов","Петров","Сидоров"]
[{"$f":"IF(ISBLANK(B5),\"\",COUNTA($B$2:B5))","v":""}]
[{"$f":"IF(ISBLANK(B6),\"\",COUNTA($B$2:B6))","v":""}]
[{"$f":"IF(ISBLANK(B7),\"\",COUNTA($B$2:B7))","v":""}]
[{"$f":"IF(ISBLANK(B8),\"\",COUNTA($B$2:B8))","v":""}]
[{"$f":"IF(ISBLANK(B9),\"\",COUNTA($B$2:B9))","v":""}]
[{"$f":"IF(ISBLANK(B10),\"\",COUNTA($B$2:B10))","v":""}]
[{"$f":"IF(ISBLANK(B11),\"\",COUNTA($B$2:B11))","v":""}]
[{"$f":"IF(ISBLANK(B12),\"\",COUNTA($B$2:B12))","v":""}]
[{"$f":"IF(ISBLANK(B13),\"\",COUNTA($B$2:B13))","v":""}]
[{"$f":"IF(ISBLANK(B14),\"\",COUNTA($B$2:B14))","v":""}]
[{"$f":"IF(ISBLANK(B15),\"\",COUNTA($B$2:B15))","v":""}]
[{"$f":"IF(ISBLANK(B16),\"\",COUNTA($B$2:B16))","v":""}]
[{"$f":"IF(ISBLANK(B17),\"\",COUNTA($B$2:B17))","v":""}]
[{"$f":"IF(ISBLANK(B18),\"\",COUNTA($B$2:B18))","v":""}]
[{"$f":"IF(ISBLANK(B19),\"\",COUNTA($B$2:B19))","v":""}]
[{"$f":"IF(ISBLANK(B20),\"\",COUNTA($B$2:B20))","v":""}]
[{"$f":"IF(ISBLANK(B21),\"\",COUNTA($B$2:B21))","v":""}]
[{"$f":"IF(ISBLANK(B22),\"\",COUNTA($B$2:B22))","v":""}]
[{"$f":"IF(ISBLANK(B23),\"\",COUNTA($B$2:B23))","v":""}]
[{"$f":"IF(ISBLANK(B24),\"\",COUNTA($B$2:B24))","v":""}]
[{"$f":"IF(ISBLANK(B25),\"\",COUNTA($B$2:B25))","v":""}]
[{"$f":"IF(ISBLANK(B26),\"\",COUNTA($B$2:B26))","v":""}]
[{"$f":"IF(ISBLANK(B27),\"\",COUNTA($B$2:B27))","v":""}]
[{"$f":"IF(ISBLANK(B28),\"\",COUNTA($B$2:B28))","v":""}]
[{"$f":"IF(ISBLANK(B29),\"\",COUNTA($B$2:B29))","v":""}]
[{"$f":"IF(ISBLANK(B30),\"\",COUNTA($B$2:B30))","v":""}]
[{"$f":"IF(ISBLANK(B31),\"\",COUNTA($B$2:B31))","v":""}]

{"sheet":"Лист3","index":2,"n_rows":51,"n_cols":10,"rows_kept":51,"cut":false,"hidden":true,"merged":[[5,7,6,9],[9,4,10,9],[3,0,4,0],[3,1,4,3],[3,4,4,6],[3,7,4,9],[5,0,6,0],[5,1,6,3],[5,4,6,6],[9,3,10,3],[9,0,10,2],[19,8,20,9],[19,6,20,7],[19,3,20,5],[19,0,20,2],[13,4,14,6],[13,7,14,9],[13,0,14,3],[15,0,16,3],[15,4,16,6],[15,7,16,9],[21,0,24,2],[21,3,24,5],[21,6,24,7],[21,8,24,9],[25,0,28,2],[25,3,28,5],[25,6,28,7],[25,8,28,9],[49,7,50,9],[41,0,42,9],[45,0,46,2],[45,3,46,7],[37,0,40,2],[37,3,40,5],[37,6,40,7],[37,8,40,9],[29,0,32,2],[29,3,32,5],[29,6,32,7],[29,8,32,9],[33,0,36,2],[33,3,36,5],[33,6,36,7],[33,8,36,9]]}
[null,null,null,"ИНФОРМАЦИОННО-УДОСТОВЕРЯЮЩИЙ ЛИСТ"]
[]
[]
["№\nп/п","Обозначение документа",null,null,"Наименование изделия, вид документа",null,null,"Номер последнего изменения (версия)"]
[]
[1]
[]
[]
[]
["Алгоритм расчета контрольной суммы",null,null,{"$f":"Лист5!$H$7","v":"SHA1"}]
[]
[]
[]
["Наименование файла",null,null,null,"Дата и время последнего изменения файла",null,null,"Размер файла (байт)"]
[]
[]
[]
[]
[]
["Характер работы",null,null,"ФИО",null,null,"Подпись",null,"Дата подписания"]
[]
[null,null,null,null,null,null,null,null,{"$f":"IF(A22=\"\",\"\",TODAY())","v":""}]
[]
[]
[]
[null,null,null,null,null,null,null,null,{"$f":"IF(A26=\"\",\"\",TODAY())","v":""}]
[]
[]
[]
[null,null,null,null,null,null,null,null,{"$f":"IF(A30=\"\",\"\",TODAY())","v":""}]
[]
[]
[]
[null,null,null,null,null,null,null,null,{"$f":"IF(A34=\"\",\"\",TODAY())","v":""}]
[]
[]
[]
[null,null,null,null,null,null,null,null,{"$f":"IF(A38=\"\",\"\",TODAY())","v":""}]
[]
[]
[]
[" * – характер работы, выполняемой лицом, подписавшим документ «Разработал», «Проверил», «Нормоконтроль», «Утвердил» (ГИП, ГАП) и т.д. "]
[]
[]
[]
["Информационно-удостоверяющий лист",null,null,null,null,null,null,null,"Лист","Листов"]
[null,null,null,null,null,null,null,null,1,1]
[]
[]
[{"$f":"Лист5!$H$5","v":"Директор"},null,null,null,null,null,null,{"$f":"Лист5!$H$6","v":"И.И. Иванов"}]
[{"$f":"Лист5!$H$4","v":"ООО «Рога и копыта»"}]

{"sheet":"Лист4","index":3,"n_rows":153,"n_cols":10,"rows_kept":153,"cut":false,"hidden":false,"merged":[[13,0,14,3],[13,4,14,6],[13,7,14,9],[15,0,16,3],[15,4,16,6],[15,7,16,9],[19,0,20,2],[60,0,61,2],[60,3,61,3],[60,4,61,9],[29,0,32,2],[29,3,32,5],[29,6,32,7],[29,8,32,9],[33,0,36,2],[33,3,36,5],[33,6,36,7],[33,8,36,9],[37,0,40,2],[37,3,40,5],[37,6,40,7],[37,8,40,9],[3,0,4,0],[3,1,4,3],[3,4,4,6],[3,7,4,9],[5,0,6,0],[5,1,6,3],[5,4,6,6],[5,7,6,9],[9,0,10,2],[9,3,10,3],[9,4,10,9],[92,0,93,9],[96,0,97,2],[96,3,97,7],[100,7,101,9],[19,6,20,7],[21,0,24,2],[21,3,24,5],[21,6,24,7],[21,8,24,9],[25,0,28,2],[25,3,28,5],[25,6,28,7],[25,8,28,9],[19,8,20,9],[64,0,65,3],[64,4,65,6],[64,7,65,9],[66,0,67,3],[66,4,67,6],[66,7,67,9],[88,0,91,2],[88,3,91,5],[88,6,91,7],[88,8,91,9],[19,3,20,5],[41,0,42,9],[45,0,46,2],[45,3,46,7],[49,7,50,9],[54,0,55,0],[54,1,55,3],[54,4,55,6],[54,7,55,9],[56,0,57,0],[56,1,57,3],[56,4,57,6],[56,7,57,9],[105,0,106,0],[105,1,106,3],[105,4,106,6],[105,7,106,9],[70,6,71,7],[70,8,71,9],[70,0,71,2],[70,3,71,5],[72,0,75,2],[72,3,75,5],[72,6,75,7],[72,8,75,9],[76,0,79,2],[76,3,79,5],[76,6,79,7],[76,8,79,9],[80,0,83,2],[80,3,83,5],[80,6,83,7],[80,8,83,9],[84,0,87,2],[84,3,87,5],[84,6,87,7],[84,8,87,9],[127,0,130,2],[127,3,130,5],[127,6,130,7],[127,8,130,9],[131,0,134,2],[131,3,134,5],[131,6,134,7],[131,8,134,9],[117,0,118,3],[117,4,118,6],[121,0,122,2],[121,3,122,5],[121,6,122,7],[121,8,122,9],[147,0,148,2],[147,3,148,7],[151,7,152,9],[139,0,142,2],[139,3,142,5],[139,6,142,7],[139,8,142,9],[135,0,138,2],[135,3,138,5],[135,6,138,7],[135,8,138,9],[143,0,144,9],[117,7,118,9],[123,0,126,2],[123,3,126,5],[123,6,126,7],[123,8,126,9],[107,0,108,0],[107,1,108,3],[107,4,108,6],[107,7,108,9],[111,0,112,2],[111,3,112,3],[111,4,112,9],[115,0,116,3],[115,4,116,6],[115,7,116,9]]}
[null,null,null,"ИНФОРМАЦИОННО-УДОСТОВЕРЯЮЩИЙ ЛИСТ"]
[]
[]
["№\nп/п","Обозначение документа",null,null,"Наименование изделия, вид документа",null,null,"Номер последнего изменения (версия)"]
[]
[1,"profile",null,null,"Архив профиля",null,null,1]
[]
[]
[]
["Алгоритм расчета контрольной суммы",null,null,{"$f":"Лист5!$H$7","v":"SHA1"},"E49ADF52FB317685CB23D8177D1FF242BEF57E70"]
[]
[]
[]
["Наименование файла",null,null,null,"Дата и время последнего изменения файла",null,null,"Размер файла (байт)"]
[]
["profile.rar",null,null,null,"2023-11-03T17:09:00",null,null,562944]
[]
[]
[]
["Характер работы",null,null,"ФИО",null,null,"Подпись",null,"Дата подписания"]
[]
["Инженер",null,null,"Иванов",null,null,null,null,{"$f":"IF(A22=\"\",\"\",TODAY())","v":"2024-05-07"}]
[]
[]
[]
["ГИП",null,null,"Петров",null,null,null,null,{"$f":"IF(A26=\"\",\"\",TODAY())","v":"2024-05-07"}]
[]
[]
[]
["Директор",null,null,"Сидоров",null,null,null,null,{"$f":"IF(A30=\"\",\"\",TODAY())","v":"2024-05-07"}]
[]
[]
[]
[null,null,null,null,null,null,null,null,{"$f":"IF(A34=\"\",\"\",TODAY())","v":""}]
[]
[]
[]
[null,null,null,null,null,null,null,null,{"$f":"IF(A38=\"\",\"\",TODAY())","v":""}]
[]
[]
[]
[" * – характер работы, выполняемой лицом, подписавшим документ «Разработал», «Проверил», «Нормоконтроль», «Утвердил» (ГИП, ГАП) и т.д. "]
[]
[]
[]
["Информационно-удостоверяющий лист",null,null,"profile-УЛ",null,null,null,null,"Лист","Листов"]
[null,null,null,null,null,null,null,null,1,1]
[]
[]
[{"$f":"Лист5!$H$5","v":"Директор"},null,null,null,null,null,null,{"$f":"Лист5!$H$6","v":"И.И. Иванов"}]
[{"$f":"Лист5!$H$4","v":"ООО «Рога и копыта»"}]
[null,null,null,"ИНФОРМАЦИОННО-УДОСТОВЕРЯЮЩИЙ ЛИСТ"]
[]
[]
["№\nп/п","Обозначение документа",null,null,"Наименование изделия, вид документа",null,null,"Номер последнего изменения (версия)"]
[]
[1,"Tablitsy_kolodtsev_NVK_raschet_v_1_0 (1)",null,null,"Таблица колодцев",null,null,1]
[]
[]
[]
["Алгоритм расчета контрольной суммы",null,null,{"$f":"Лист5!$H$7","v":"SHA1"},"3E517DBD26B1CC73DC10F3A6577BB5A3FC28ADA2"]
[]
[]
[]
["Наименование файла",null,null,null,"Дата и время последнего изменения файла",null,null,"Размер файла (байт)"]
[]
["Tablitsy_kolodtsev_NVK_raschet_v_1_0 (1).xlsx",null,null,null,"2023-12-15T21:11:38",null,null,126215]
[]
[]
[]
["Характер работы",null,null,"ФИО",null,null,"Подпись",null,"Дата подписания"]
[]
["Инженер",null,null,"Иванов",null,null,null,null,{"$f":"IF(A73=\"\",\"\",TODAY())","v":"2024-05-07"}]
[]
[]
[]
["ГИП",null,null,"Петров",null,null,null,null,{"$f":"IF(A77=\"\",\"\",TODAY())","v":"2024-05-07"}]
[]
[]
[]
["Директор",null,null,"Сидоров",null,null,null,null,{"$f":"IF(A81=\"\",\"\",TODAY())","v":"2024-05-07"}]
[]
[]
[]
[null,null,null,null,null,null,null,null,{"$f":"IF(A85=\"\",\"\",TODAY())","v":""}]
[]
[]
[]
[null,null,null,null,null,null,null,null,{"$f":"IF(A89=\"\",\"\",TODAY())","v":""}]
[]
[]
[]
[" * – характер работы, выполняемой лицом, подписавшим документ «Разработал», «Проверил», «Нормоконтроль», «Утвердил» (ГИП, ГАП) и т.д. "]
[]
[]
[]
["Информационно-удостоверяющий лист",null,null,"Tablitsy_kolodtsev_NVK_raschet_v_1_0 (1)-УЛ",null,null,null,null,"Лист","Листов"]
[null,null,null,null,null,null,null,null,1,1]
[]
[]
[{"$f":"Лист5!$H$5","v":"Директор"},null,null,null,null,null,null,{"$f":"Лист5!$H$6","v":"И.И. Иванов"}]
[{"$f":"Лист5!$H$4","v":"ООО «Рога и копыта»"}]
[null,null,null,"ИНФОРМАЦИОННО-УДОСТОВЕРЯЮЩИЙ ЛИСТ"]
[]
[]
["№\nп/п","Обозначение документа",null,null,"Наименование изделия, вид документа",null,null,"Номер последнего изменения (версия)"]
[]
[1,"Инструкция",null,null,"Пояснительная записка",null,null,1]
[]
[]
[]
["Алгоритм расчета контрольной суммы",null,null,{"$f":"Лист5!$H$7","v":"SHA1"},"C3C5F0CD9F134BCD496A94AEF09E80AFA92FE687"]
[]
[]
[]
["Наименование файла",null,null,null,"Дата и время последнего изменения файла",null,null,"Размер файла (байт)"]
[]
["Инструкция.doc",null,null,null,"2023-11-03T17:01:38",null,null,477696]
[]
[]
[]
["Характер работы",null,null,"ФИО",null,null,"Подпись",null,"Дата подписания"]
[]
["Инженер",null,null,"Иванов",null,null,null,null,{"$f":"IF(A124=\"\",\"\",TODAY())","v":"2024-05-07"}]
[]
[]
[]
["ГИП",null,null,"Петров",null,null,null,null,{"$f":"IF(A128=\"\",\"\",TODAY())","v":"2024-05-07"}]
[]
[]
[]
["Директор",null,null,"Сидоров",null,null,null,null,{"$f":"IF(A132=\"\",\"\",TODAY())","v":"2024-05-07"}]
[]
[]
[]
[null,null,null,null,null,null,null,null,{"$f":"IF(A136=\"\",\"\",TODAY())","v":""}]
[]
[]
[]
[null,null,null,null,null,null,null,null,{"$f":"IF(A140=\"\",\"\",TODAY())","v":""}]
[]
[]
[]
[" * – характер работы, выполняемой лицом, подписавшим документ «Разработал», «Проверил», «Нормоконтроль», «Утвердил» (ГИП, ГАП) и т.д. "]
[]
[]
[]
["Информационно-удостоверяющий лист",null,null,"Инструкция-УЛ",null,null,null,null,"Лист","Листов"]
[null,null,null,null,null,null,null,null,1,1]
[]
[]
[{"$f":"Лист5!$H$5","v":"Директор"},null,null,null,null,null,null,{"$f":"Лист5!$H$6","v":"И.И. Иванов"}]
[{"$f":"Лист5!$H$4","v":"ООО «Рога и копыта»"}]

{"sheet":"Лист5","index":4,"n_rows":19,"n_cols":8,"rows_kept":19,"cut":false,"hidden":false,"merged":[[1,6,2,7]]}
[]
[null,null,null,null,null,null,"Заполните данные и выполните Шаг 1 - 2"]
[]
[null,null,null,null,null,null,"Наименование организации","ООО «Рога и копыта»"]
[null,null,null,null,null,null,"Должность руководителя","Директор"]
[null,null,null,null,null,null,"ФИО руководителя","И.И. Иванов"]
[null,null,null,null,null,null,"Алгоритм расчета\nконтрольной суммы","SHA1"]
[]
[]
[]
[]
[]
[]
[null,"1. Для вставки « - Alt+0171"]
[null,"2. Для вставки » - Alt+0187"]
[]
[null,"3. Формитровать файлы с расширением .md5, .crc32, .sha1, можно с помощью программы «Total Commander»."]
[null,"4. Выбарть файлы в окне программы - далее «Файлы» - «Посчитать CRC-суммы» - выбрать нужный формат."]
[null,"5. Название файлов будет таким же как у файлов для которых вычисляется контрольная сумма."]