{"text_format":"1","workbook":"xlsx","n_sheets":3,"sheets":["Лист1","Данные","Лист2"],"not_rendered":{"charts":0,"images":0,"macros":1,"external_links":0,"defined_names":1,"comments":0,"pivot_tables":0},"unopened":[],"bounds":{"document_bytes":16777216,"sheet_cells":100000,"rows_first":2000,"rows_last":500,"rows_between":2000,"halvings":0,"cell_chars":16384,"cell_head_chars":4096},"cells_cut":0,"cells_raw":0,"read":"whole","date_system":"1900"}

{"sheet":"Лист1","index":0,"n_rows":33,"n_cols":13,"rows_kept":33,"cut":false,"hidden":false,"merged":[]}
[null,null,null,null,null,null,null,null,"MD5"]
[null,null,null,null,null,null,null,null,"CRC32"]
[null,null,null,"Наименование организации","ООО \"Рога и Копыта\"",null,null,null,"SHA1"]
[null,null,null,"Должность","Директор"]
[null,null,null,"ФИО Руководителя","И.И. Иванов"]
[null,null,null,"Алгоритм расчета\nконтрольной суммы","MD5"]
[]
[]
[]
["Имя файла","Размер","Дата изменения","MD5","CRC32","SHA1"]
["vk_DiafragmaPK.xlsb",496610,"2024-04-13T08:15:48","4DB05FBD9C84ECF499E1CECEDBFAEAC5","EF7F469F","EF438451C09D89C55B60831FEDDF78BB2996917A",null,null,null,{"$f":"IF(ISBLANK(A11),\"\",COUNTA($A$11:A11))","v":1},{"$f":"IF(A11=\"\",\"\",LEFT(A11,SEARCH(\".\",A11)-1))","v":"vk_DiafragmaPK"},{"$f":"K11&\"-УЛ\"","v":"vk_DiafragmaPK-УЛ"},{"$f":"UPPER((IF($E$6=\"MD5\",D11,IF($E$6=\"CRC32\",E11,IF($E$6=\"SHA1\",F11,\"\")))))","v":"4DB05FBD9C84ECF499E1CECEDBFAEAC5"}]
["vk_Gidravlika.xlsb",480545,"2024-04-13T08:15:48","B31562DF59AA68A9CE0F3254D39BD4A7","014904BC","F3B3E18420926FDCD59836F5A3F48997BF7C0443",null,null,null,{"$f":"IF(ISBLANK(A12),\"\",COUNTA($A$11:A12))","v":2},{"$f":"IF(A12=\"\",\"\",LEFT(A12,SEARCH(\".\",A12)-1))","v":"vk_Gidravlika"},"vk_Gidravlika-УЛ","B31562DF59AA68A9CE0F3254D39BD4A7"]
["vk_IshDannie.xlsb",134740,"2024-04-13T08:15:48","4CFFC4741926C19FCFDE0990F014D782","0A0E7741","E628258443BEC326C130D1D7843E9E8A9ADDD5D3",null,null,null,{"$f":"IF(ISBLANK(A13),\"\",COUNTA($A$11:A13))","v":3},"vk_IshDannie","vk_IshDannie-УЛ","4CFFC4741926C19FCFDE0990F014D782"]
["vk_OFO.xlsb",73155,"2024-04-13T08:15:48","1E9EFF5C54CF82F9543231D8E2187358","13E1BBF0","E36A19C9723EA19F8861AD44AF671D325F92A793",null,null,null,{"$f":"IF(ISBLANK(A14),\"\",COUNTA($A$11:A14))","v":4},"vk_OFO","vk_OFO-УЛ","1E9EFF5C54CF82F9543231D8E2187358"]
["vk_Oprosnik.xlsb",82660,"2024-04-13T08:15:50","F5C51936846960C6560EE1D6D93E0D13","E854AF46","FDFBF74357A3344217FB9E94116ADAE086CF470C",null,null,null,{"$f":"IF(ISBLANK(A15),\"\",COUNTA($A$11:A15))","v":5},"vk_Oprosnik","vk_Oprosnik-УЛ","F5C51936846960C6560EE1D6D93E0D13"]
["vk_Pojar.xlsb",131332,"2024-04-13T08:15:50","8C0F374D735C6CF86D0F7A5B8050867C","1C4637E8","C61F9FBEA440788FEA514056C496576197915866",null,null,null,{"$f":"IF(ISBLANK(A16),\"\",COUNTA($A$11:A16))","v":6},"vk_Pojar","vk_Pojar-УЛ","8C0F374D735C6CF86D0F7A5B8050867C"]
["vk_Rashody.xlsb",304094,"2024-04-13T08:15:50","13620F3393C0B645E119700393504E44","F539D32D","3B57A02A04A78643C985A76B6F5B027838FF617A",null,null,null,{"$f":"IF(ISBLANK(A17),\"\",COUNTA($A$11:A17))","v":7},"vk_Rashody","vk_Rashody-УЛ","13620F3393C0B645E119700393504E44"]
["vk_SchetVody.xlsb",32191,"2024-04-13T08:15:50","60D1514D57DF2A04CC517BEF89FDEDAC","E8F72A95","7AB1ACF46C6FC4E564AA74B45A591C2B0A3FFB72",null,null,null,{"$f":"IF(ISBLANK(A18),\"\",COUNTA($A$11:A18))","v":8},"vk_SchetVody","vk_SchetVody-УЛ","60D1514D57DF2A04CC517BEF89FDEDAC"]
["vk_Vodonagrevatel.xlsb",31665,"2024-04-13T08:15:50","BCD06762665584DF18A91A2E0ADCAE34","14C5DCB0","683311699C313BF953EDFA27176E010C6F7A5227",null,null,null,{"$f":"IF(ISBLANK(A19),\"\",COUNTA($A$11:A19))","v":9},"vk_Vodonagrevatel","vk_Vodonagrevatel-УЛ","BCD06762665584DF18A91A2E0ADCAE34"]
["vk_Vodostok.xlsb",376192,"2024-04-13T08:15:50","66DBE8EC25206B14C061EBF2B2DB0C82","03381CA1","8AB46672F0F4ADAC8B6EE0057F22E0AFE0DB4734",null,null,null,{"$f":"IF(ISBLANK(A20),\"\",COUNTA($A$11:A20))","v":10},"vk_Vodostok","vk_Vodostok-УЛ","66DBE8EC25206B14C061EBF2B2DB0C82"]
["Баланс ВиВ.docx",117559,"2024-04-13T08:15:50","1B8CF50ABD760BBA3FA21C736AA1A7E7","E28E5396","BBD5CA662A3C5092CB82AFB6705CE83146AF4013",null,null,null,{"$f":"IF(ISBLANK(A21),\"\",COUNTA($A$11:A21))","v":11},"Баланс ВиВ","Баланс ВиВ-УЛ","1B8CF50ABD760BBA3FA21C736AA1A7E7"]
["Задание на проектирование-ВК.xlsx",48989,"2024-04-13T08:15:50","219AD7B067E86A05B95E7DC4395FD9EC","04C96C76","24ECE106A9BEC07F9C4BE8D075CAC61567F6FE46",null,null,null,{"$f":"IF(ISBLANK(A22),\"\",COUNTA($A$11:A22))","v":12},"Задание на проектирование-ВК","Задание на проектирование-ВК-УЛ","219AD7B067E86A05B95E7DC4395FD9EC"]
["Запрос ТУ.docx",18582,"2024-04-13T08:15:50","E7508325198E5304A154CC2E3787900F","EF72F279","1C972661072BD6C9076467ACAC0804004862C201",null,null,null,{"$f":"IF(ISBLANK(A23),\"\",COUNTA($A$11:A23))","v":13},"Запрос ТУ","Запрос ТУ-УЛ","E7508325198E5304A154CC2E3787900F"]
["ТУ на подключение в части ВК.xlsx",422148,"2024-04-13T08:16:00","39C140068070A9B03F5D3328B7C9DC06","0E626FB0","0400707D7166150EE0C0E894E2F95D63F5117BF4",null,null,null,{"$f":"IF(ISBLANK(A24),\"\",COUNTA($A$11:A24))","v":14},"ТУ на подключение в части ВК","ТУ на подключение в части ВК-УЛ","39C140068070A9B03F5D3328B7C9DC06"]
[null,null,null,null,null,null,null,null,null,{"$f":"IF(ISBLANK(A25),\"\",COUNTA($A$11:A25))","v":""},"","-УЛ",""]
[null,null,null,null,null,null,null,null,null,{"$f":"IF(ISBLANK(A26),\"\",COUNTA($A$11:A26))","v":""},"","-УЛ",""]
[null,null,null,null,null,null,null,null,null,{"$f":"IF(ISBLANK(A27),\"\",COUNTA($A$11:A27))","v":""},"","-УЛ",""]
[null,null,null,null,null,null,null,null,null,{"$f":"IF(ISBLANK(A28),\"\",COUNTA($A$11:A28))","v":""},"","-УЛ",""]
[null,null,null,null,null,null,null,null,null,{"$f":"IF(ISBLANK(A29),\"\",COUNTA($A$11:A29))","v":""},"","-УЛ",""]
[null,null,null,null,null,null,null,null,null,{"$f":"IF(ISBLANK(A30),\"\",COUNTA($A$11:A30))","v":""},"","-УЛ",""]
[]
[]
[null,null,null,null,"9e60f9af"]

{"sheet":"Данные","index":1,"n_rows":54,"n_cols":3,"rows_kept":54,"cut":false,"hidden":false,"merged":[]}
[]
[]
[]
[]
[]
[]
[]
[]
[]
[null,"Наименование файла","Наименование изделия, вид документа"]
[{"$f":"IF(ISBLANK(B11),\"\",COUNTA($B$11:B11))","v":1},{"$f":"IF(Лист1!A11=0,\"\",Лист1!A11)","v":"vk_DiafragmaPK.xlsb"},"Проект организации строительства"]
[{"$f":"IF(ISBLANK(B12),\"\",COUNTA($B$11:B12))","v":2},{"$f":"IF(Лист1!A12=0,\"\",Лист1!A12)","v":"vk_Gidravlika.xlsb"},"Сметная документация"]
[{"$f":"IF(ISBLANK(B13),\"\",COUNTA($B$11:B13))","v":3},{"$f":"IF(Лист1!A13=0,\"\",Лист1!A13)","v":"vk_IshDannie.xlsb"},"Ведомость объемов работ 01"]
[{"$f":"IF(ISBLANK(B14),\"\",COUNTA($B$11:B14))","v":4},{"$f":"IF(Лист1!A14=0,\"\",Лист1!A14)","v":"vk_OFO.xlsb"},"Ведомость объемов работ 01"]
[{"$f":"IF(ISBLANK(B15),\"\",COUNTA($B$11:B15))","v":5},{"$f":"IF(Лист1!A15=0,\"\",Лист1!A15)","v":"vk_Oprosnik.xlsb"},"Ведомость объемов работ 02"]
[{"$f":"IF(ISBLANK(B16),\"\",COUNTA($B$11:B16))","v":6},{"$f":"IF(Лист1!A16=0,\"\",Лист1!A16)","v":"vk_Pojar.xlsb"},"Ведомость объемов работ 02"]
[{"$f":"IF(ISBLANK(B17),\"\",COUNTA($B$11:B17))","v":7},{"$f":"IF(Лист1!A17=0,\"\",Лист1!A17)","v":"vk_Rashody.xlsb"},"Ведомость ресурсов 01"]
[{"$f":"IF(ISBLANK(B18),\"\",COUNTA($B$11:B18))","v":8},{"$f":"IF(Лист1!A18=0,\"\",Лист1!A18)","v":"vk_SchetVody.xlsb"},"Ведомость ресурсов 01"]
[{"$f":"IF(ISBLANK(B19),\"\",COUNTA($B$11:B19))","v":9},{"$f":"IF(Лист1!A19=0,\"\",Лист1!A19)","v":"vk_Vodonagrevatel.xlsb"},"Ведомость ресурсов 02"]
[{"$f":"IF(ISBLANK(B20),\"\",COUNTA($B$11:B20))","v":10},{"$f":"IF(Лист1!A20=0,\"\",Лист1!A20)","v":"vk_Vodostok.xlsb"},"Ведомость ресурсов 02"]
[{"$f":"IF(ISBLANK(B21),\"\",COUNTA($B$11:B21))","v":11},{"$f":"IF(Лист1!A21=0,\"\",Лист1!A21)","v":"Баланс ВиВ.docx"},"Кон. Анализ"]
[{"$f":"IF(ISBLANK(B22),\"\",COUNTA($B$11:B22))","v":12},{"$f":"IF(Лист1!A22=0,\"\",Лист1!A22)","v":"Задание на проектирование-ВК.xlsx"},"Кон. Анализ"]
[{"$f":"IF(ISBLANK(B23),\"\",COUNTA($B$11:B23))","v":13},{"$f":"IF(Лист1!A23=0,\"\",Лист1!A23)","v":"Запрос ТУ.docx"},"Коммерческое предложение"]
[{"$f":"IF(ISBLANK(B24),\"\",COUNTA($B$11:B24))","v":14},{"$f":"IF(Лист1!A24=0,\"\",Лист1!A24)","v":"ТУ на подключение в части ВК.xlsx"},"ЛСР 01"]
[{"$f":"IF(ISBLANK(B25),\"\",COUNTA($B$11:B25))","v":15},{"$f":"IF(Лист1!A25=0,\"\",Лист1!A25)","v":""},"ЛСР 01"]
[{"$f":"IF(ISBLANK(B26),\"\",COUNTA($B$11:B26))","v":16},{"$f":"IF(Лист1!A26=0,\"\",Лист1!A26)","v":""},"ЛСР 02"]
[{"$f":"IF(ISBLANK(B27),\"\",COUNTA($B$11:B27))","v":17},{"$f":"IF(Лист1!A27=0,\"\",Лист1!A27)","v":""},"ЛСР 02"]
[{"$f":"IF(ISBLANK(B28),\"\",COUNTA($B$11:B28))","v":18},{"$f":"IF(Лист1!A28=0,\"\",Лист1!A28)","v":""},"ССРСС"]
[{"$f":"IF(ISBLANK(B29),\"\",COUNTA($B$11:B29))","v":19},{"$f":"IF(Лист1!A29=0,\"\",Лист1!A29)","v":""},"ССРСС"]
[{"$f":"IF(ISBLANK(B30),\"\",COUNTA($B$11:B30))","v":20},{"$f":"IF(Лист1!A30=0,\"\",Лист1!A30)","v":""},"ССРСС"]
[]
[]
[null,"Характер работы"]
[{"$f":"IF(ISBLANK(B34),\"\",COUNTA($B$34:B34))","v":1},"Раработал"]
[{"$f":"IF(ISBLANK(B35),\"\",COUNTA($B$34:B35))","v":2},"Проверил"]
[{"$f":"IF(ISBLANK(B36),\"\",COUNTA($B$34:B36))","v":3},"Сметчик"]
[{"$f":"IF(ISBLANK(B37),\"\",COUNTA($B$34:B37))","v":4},"Инженер"]
[{"$f":"IF(ISBLANK(B38),\"\",COUNTA($B$34:B38))","v":5},"ГИП"]
[{"$f":"IF(ISBLANK(B39),\"\",COUNTA($B$34:B39))","v":6},"Директор"]
[{"$f":"IF(ISBLANK(B40),\"\",COUNTA($B$34:B40))","v":7},"Заказчик"]
[{"$f":"IF(ISBLANK(B41),\"\",COUNTA($B$34:B41))","v":8},"Глава"]
[{"$f":"IF(ISBLANK(B42),\"\",COUNTA($B$34:B42))","v":9},"Эксперт"]
[]
[]
[null,"ФИО"]
[{"$f":"IF(ISBLANK(B46),\"\",COUNTA($B$46:B46))","v":1},"Иванов"]
[{"$f":"IF(ISBLANK(B47),\"\",COUNTA($B$46:B47))","v":2},"Петров"]
[{"$f":"IF(ISBLANK(B48),\"\",COUNTA($B$46:B48))","v":3},"Сидоров"]
[{"$f":"IF(ISBLANK(B49),\"\",COUNTA($B$46:B49))","v":4},"Красных"]
[{"$f":"IF(ISBLANK(B50),\"\",COUNTA($B$46:B50))","v":5},"Гагарин"]
[{"$f":"IF(ISBLANK(B51),\"\",COUNTA($B$46:B51))","v":6},"Редька"]
[{"$f":"IF(ISBLANK(B52),\"\",COUNTA($B$46:B52))","v":7},"Аратюнян"]
[{"$f":"IF(ISBLANK(B53),\"\",COUNTA($B$46:B53))","v":8},"Галицкий"]
[{"$f":"IF(ISBLANK(B54),\"\",COUNTA($B$46:B54))","v":9},"Акакий"]

{"sheet":"Лист2","index":2,"n_rows":980,"n_cols":10,"rows_kept":980,"cut":false,"hidden":false,"merged":[[47,7,48,9],[37,0,38,2],[37,3,38,5],[37,6,38,7],[37,8,38,9],[39,0,40,9],[35,0,36,2],[35,3,36,5],[35,6,36,7],[35,8,36,9],[31,0,32,2],[31,3,32,5],[31,6,32,7],[31,8,32,9],[21,8,22,9],[43,0,44,2],[43,3,44,7],[29,0,30,2],[29,3,30,5],[29,6,30,7],[29,8,30,9],[33,0,34,2],[33,3,34,5],[33,6,34,7],[33,8,34,9],[19,8,20,9],[19,6,20,7],[19,3,20,5],[19,0,20,2],[21,0,22,2],[21,3,22,5],[21,6,22,7],[23,0,24,2],[23,3,24,5],[23,6,24,7],[23,8,24,9],[25,0,26,2],[25,3,26,5],[25,6,26,7],[25,8,26,9],[27,6,28,7],[27,8,28,9],[27,0,28,2],[27,3,28,5],[5,7,6,9],[9,4,10,9],[3,0,4,0],[3,1,4,3],[3,4,4,6],[3,7,4,9],[5,0,6,0],[5,1,6,3],[5,4,6,6],[9,3,10,3],[9,0,10,2],[13,4,14,6],[13,7,14,9],[13,0,14,3],[15,0,16,3],[15,4,16,6],[15,7,16,9],[64,0,65,3],[64,4,65,6],[64,7,65,9],[68,0,69,2],[68,3,69,5],[68,6,69,7],[68,8,69,9],[58,0,59,2],[58,3,59,3],[58,4,59,9],[62,0,63,3],[62,4,63,6],[62,7,63,9],[52,0,53,0],[52,1,53,3],[52,4,53,6],[52,7,53,9],[54,0,55,0],[54,1,55,3],[54,4,55,6],[54,7,55,9],[78,0,79,2],[78,3,79,5],[78,6,79,7],[78,8,79,9],[80,0,81,2],[80,3,81,5],[80,6,81,7],[80,8,81,9],[74,0,75,2],[74,3,75,5],[74,6,75,7],[74,8,75,9],[76,0,77,2],[76,3,77,5],[76,6,77,7],[76,8,77,9],[70,0,71,2],[70,3,71,5],[70,6,71,7],[70,8,71,9],[72,0,73,2],[72,3,73,5],[72,6,73,7],[72,8,73,9],[92,0,93,2],[92,3,93,7],[96,7,97,9],[101,0,102,0],[101,1,102,3],[101,4,102,6],[101,7,102,9],[86,0,87,2],[86,3,87,5],[86,6,87,7],[86,8,87,9],[88,0,89,9],[82,0,83,2],[82,3,83,5],[82,6,83,7],[82,8,83,9],[84,0,85,2],[84,3,85,5],[84,6,85,7],[84,8,85,9],[117,0,118,2],[117,3,118,5],[117,6,118,7],[117,8,118,9],[119,0,120,2],[119,3,120,5],[119,6,120,7],[119,8,120,9],[111,0,112,3],[111,4,112,6],[111,7,112,9],[113,0,114,3],[113,4,114,6],[113,7,114,9],[103,0,104,0],[103,1,104,3],[103,4,104,6],[103,7,104,9],[107,0,108,2],[107,3,108,3],[107,4,108,9],[129,0,130,2],[129,3,130,5],[129,6,130,7],[129,8,130,9],[131,0,132,2],[131,3,132,5],[131,6,132,7],[131,8,132,9],[125,0,126,2],[125,3,126,5],[125,6,126,7],[125,8,126,9],[127,0,128,2],[127,3,128,5],[127,6,128,7],[127,8,128,9],[121,0,122,2],[121,3,122,5],[121,6,122,7],[121,8,122,9],[123,0,124,2],[123,3,124,5],[123,6,124,7],[123,8,124,9],[152,0,153,0],[152,1,153,3],[152,4,153,6],[152,7,153,9],[156,0,157,2],[156,3,157,3],[156,4,157,9],[137,0,138,9],[141,0,142,2],[141,3,142,7],[145,7,146,9],[150,0,151,0],[150,1,151,3],[150,4,151,6],[150,7,151,9],[133,0,134,2],[133,3,134,5],[133,6,134,7],[133,8,134,9],[135,0,136,2],[135,3,136,5],[135,6,136,7],[135,8,136,9],[170,0,171,2],[170,3,171,5],[170,6,171,7],[170,8,171,9],[172,0,173,2],[172,3,173,5],[172,6,173,7],[172,8,173,9],[166,0,167,2],[166,3,167,5],[166,6,167,7],[166,8,167,9],[168,0,169,2],[168,3,169,5],[168,6,169,7],[168,8,169,9],[160,0,161,3],[160,4,161,6],[160,7,161,9],[162,0,163,3],[162,4,163,6],[162,7,163,9],[182,0,183,2],[182,3,183,5],[182,6,183,7],[182,8,183,9],[184,0,185,2],[184,3,185,5],[184,6,185,7],[184,8,185,9],[178,0,179,2],[178,3,179,5],[178,6,179,7],[178,8,179,9],[180,0,181,2],[180,3,181,5],[180,6,181,7],[180,8,181,9],[174,0,175,2],[174,3,175,5],[174,6,175,7],[174,8,175,9],[176,0,177,2],[176,3,177,5],[176,6,177,7],[176,8,177,9],[209,0,210,3],[209,4,210,6],[209,7,210,9],[211,0,212,3],[211,4,212,6],[211,7,212,9],[201,0,202,0],[201,1,202,3],[201,4,202,6],[201,7,202,9],[205,0,206,2],[205,3,206,3],[205,4,206,9],[186,0,187,9],[190,0,191,2],[190,3,191,7],[194,7,195,9],[199,0,200,0],[199,1,200,3],[199,4,200,6],[199,7,200,9],[223,0,224,2],[223,3,224,5],[223,6,224,7],[223,8,224,9],[225,0,226,2],[225,3,226,5],[225,6,226,7],[225,8,226,9],[219,0,220,2],[219,3,220,5],[219,6,220,7],[219,8,220,9],[221,0,222,2],[221,3,222,5],[221,6,222,7],[221,8,222,9],[215,0,216,2],[215,3,216,5],[215,6,216,7],[215,8,216,9],[217,0,218,2],[217,3,218,5],[217,6,218,7],[217,8,218,9],[235,0,236,9],[239,0,240,2],[239,3,240,7],[243,7,244,9],[248,0,249,0],[248,1,249,3],[248,4,249,6],[248,7,249,9],[231,0,232,2],[231,3,232,5],[231,6,232,7],[231,8,232,9],[233,0,234,2],[233,3,234,5],[233,6,234,7],[233,8,234,9],[227,0,228,2],[227,3,228,5],[227,6,228,7],[227,8,228,9],[229,0,230,2],[229,3,230,5],[229,6,230,7],[229,8,230,9],[264,0,265,2],[264,3,265,5],[264,6,265,7],[264,8,265,9],[266,0,267,2],[266,3,267,5],[266,6,267,7],[266,8,267,9],[258,0,259,3],[258,4,259,6],[258,7,259,9],[260,0,261,3],[260,4,261,6],[260,7,261,9],[250,0,251,0],[250,1,251,3],[250,4,251,6],[250,7,251,9],[254,0,255,2],[254,3,255,3],[254,4,255,9],[276,0,277,2],[276,3,277,5],[276,6,277,7],[276,8,277,9],[278,0,279,2],[278,3,279,5],[278,6,279,7],[278,8,279,9],[272,0,273,2],[272,3,273,5],[272,6,273,7],[272,8,273,9],[274,0,275,2],[274,3,275,5],[274,6,275,7],[274,8,275,9],[268,0,269,2],[268,3,269,5],[268,6,269,7],[268,8,269,9],[270,0,271,2],[270,3,271,5],[270,6,271,7],[270,8,271,9],[299,0,300,0],[299,1,300,3],[299,4,300,6],[299,7,300,9],[303,0,304,2],[303,3,304,3],[303,4,304,9],[284,0,285,9],[288,0,289,2],[288,3,289,7],[292,7,293,9],[297,0,298,0],[297,1,298,3],[297,4,298,6],[297,7,298,9],[280,0,281,2],[280,3,281,5],[280,6,281,7],[280,8,281,9],[282,0,283,2],[282,3,283,5],[282,6,283,7],[282,8,283,9],[317,0,318,2],[317,3,318,5],[317,6,318,7],[317,8,318,9],[319,0,320,2],[319,3,320,5],[319,6,320,7],[319,8,320,9],[313,0,314,2],[313,3,314,5],[313,6,314,7],[313,8,314,9],[315,0,316,2],[315,3,316,5],[315,6,316,7],[315,8,316,9],[307,0,308,3],[307,4,308,6],[307,7,308,9],[309,0,310,3],[309,4,310,6],[309,7,310,9],[329,0,330,2],[329,3,330,5],[329,6,330,7],[329,8,330,9],[331,0,332,2],[331,3,332,5],[331,6,332,7],[331,8,332,9],[325,0,326,2],[325,3,326,5],[325,6,326,7],[325,8,326,9],[327,0,328,2],[327,3,328,5],[327,6,328,7],[327,8,328,9],[321,0,322,2],[321,3,322,5],[321,6,322,7],[321,8,322,9],[323,0,324,2],[323,3,324,5],[323,6,324,7],[323,8,324,9],[356,0,357,3],[356,4,357,6],[356,7,357,9],[358,0,359,3],[358,4,359,6],[358,7,359,9],[348,0,349,0],[348,1,349,3],[348,4,349,6],[348,7,349,9],[352,0,353,2],[352,3,353,3],[352,4,353,9],[333,0,334,9],[337,0,338,2],[337,3,338,7],[341,7,342,9],[346,0,347,0],[346,1,347,3],[346,4,347,6],[346,7,347,9],[370,0,371,2],[370,3,371,5],[370,6,371,7],[370,8,371,9],[372,0,373,2],[372,3,373,5],[372,6,373,7],[372,8,373,9],[366,0,367,2],[366,3,367,5],[366,6,367,7],[366,8,367,9],[368,0,369,2],[368,3,369,5],[368,6,369,7],[368,8,369,9],[362,0,363,2],[362,3,363,5],[362,6,363,7],[362,8,363,9],[364,0,365,2],[364,3,365,5],[364,6,365,7],[364,8,365,9],[382,0,383,9],[386,0,387,2],[386,3,387,7],[390,7,391,9],[395,0,396,0],[395,1,396,3],[395,4,396,6],[395,7,396,9],[378,0,379,2],[378,3,379,5],[378,6,379,7],[378,8,379,9],[380,0,381,2],[380,3,381,5],[380,6,381,7],[380,8,381,9],[374,0,375,2],[374,3,375,5],[374,6,375,7],[374,8,375,9],[376,0,377,2],[376,3,377,5],[376,6,377,7],[376,8,377,9],[411,0,412,2],[411,3,412,5],[411,6,412,7],[411,8,412,9],[413,0,414,2],[413,3,414,5],[413,6,414,7],[413,8,414,9],[405,0,406,3],[405,4,406,6],[405,7,406,9],[407,0,408,3],[407,4,408,6],[407,7,408,9],[397,0,398,0],[397,1,398,3],[397,4,398,6],[397,7,398,9],[401,0,402,2],[401,3,402,3],[401,4,402,9],[423,0,424,2],[423,3,424,5],[423,6,424,7],[423,8,424,9],[425,0,426,2],[425,3,426,5],[425,6,426,7],[425,8,426,9],[419,0,420,2],[419,3,420,5],[419,6,420,7],[419,8,420,9],[421,0,422,2],[421,3,422,5],[421,6,422,7],[421,8,422,9],[415,0,416,2],[415,3,416,5],[415,6,416,7],[415,8,416,9],[417,0,418,2],[417,3,418,5],[417,6,418,7],[417,8,418,9],[446,0,447,0],[446,1,447,3],[446,4,447,6],[446,7,447,9],[450,0,451,2],[450,3,451,3],[450,4,451,9],[431,0,432,9],[435,0,436,2],[435,3,436,7],[439,7,440,9],[444,0,445,0],[444,1,445,3],[444,4,445,6],[444,7,445,9],[427,0,428,2],[427,3,428,5],[427,6,428,7],[427,8,428,9],[429,0,430,2],[429,3,430,5],[429,6,430,7],[429,8,430,9],[464,0,465,2],[464,3,465,5],[464,6,465,7],[464,8,465,9],[466,0,467,2],[466,3,467,5],[466,6,467,7],[466,8,467,9],[460,0,461,2],[460,3,461,5],[460,6,461,7],[460,8,461,9],[462,0,463,2],[462,3,463,5],[462,6,463,7],[462,8,463,9],[454,0,455,3],[454,4,455,6],[454,7,455,9],[456,0,457,3],[456,4,457,6],[456,7,457,9],[476,0,477,2],[476,3,477,5],[476,6,477,7],[476,8,477,9],[478,0,479,2],[478,3,479,5],[478,6,479,7],[478,8,479,9],[472,0,473,2],[472,3,473,5],[472,6,473,7],[472,8,473,9],[474,0,475,2],[474,3,475,5],[474,6,475,7],[474,8,475,9],[468,0,469,2],[468,3,469,5],[468,6,469,7],[468,8,469,9],[470,0,471,2],[470,3,471,5],[470,6,471,7],[470,8,471,9],[503,0,504,3],[503,4,504,6],[503,7,504,9],[505,0,506,3],[505,4,506,6],[505,7,506,9],[495,0,496,0],[495,1,496,3],[495,4,496,6],[495,7,496,9],[499,0,500,2],[499,3,500,3],[499,4,500,9],[480,0,481,9],[484,0,485,2],[484,3,485,7],[488,7,489,9],[493,0,494,0],[493,1,494,3],[493,4,494,6],[493,7,494,9],[517,0,518,2],[517,3,518,5],[517,6,518,7],[517,8,518,9],[519,0,520,2],[519,3,520,5],[519,6,520,7],[519,8,520,9],[513,0,514,2],[513,3,514,5],[513,6,514,7],[513,8,514,9],[515,0,516,2],[515,3,516,5],[515,6,516,7],[515,8,516,9],[509,0,510,2],[509,3,510,5],[509,6,510,7],[509,8,510,9],[511,0,512,2],[511,3,512,5],[511,6,512,7],[511,8,512,9],[529,0,530,9],[533,0,534,2],[533,3,534,7],[537,7,538,9],[542,0,543,0],[542,1,543,3],[542,4,543,6],[542,7,543,9],[525,0,526,2],[525,3,526,5],[525,6,526,7],[525,8,526,9],[527,0,528,2],[527,3,528,5],[527,6,528,7],[527,8,528,9],[521,0,522,2],[521,3,522,5],[521,6,522,7],[521,8,522,9],[523,0,524,2],[523,3,524,5],[523,6,524,7],[523,8,524,9],[558,0,559,2],[558,3,559,5],[558,6,559,7],[558,8,559,9],[560,0,561,2],[560,3,561,5],[560,6,561,7],[560,8,561,9],[552,0,553,3],[552,4,553,6],[552,7,553,9],[554,0,555,3],[554,4,555,6],[554,7,555,9],[544,0,545,0],[544,1,545,3],[544,4,545,6],[544,7,545,9],[548,0,549,2],[548,3,549,3],[548,4,549,9],[570,0,571,2],[570,3,571,5],[570,6,571,7],[570,8,571,9],[572,0,573,2],[572,3,573,5],[572,6,573,7],[572,8,573,9],[566,0,567,2],[566,3,567,5],[566,6,567,7],[566,8,567,9],[568,0,569,2],[568,3,569,5],[568,6,569,7],[568,8,569,9],[562,0,563,2],[562,3,563,5],[562,6,563,7],[562,8,563,9],[564,0,565,2],[564,3,565,5],[564,6,565,7],[564,8,565,9],[593,0,594,0],[593,1,594,3],[593,4,594,6],[593,7,594,9],[597,0,598,2],[597,3,598,3],[597,4,598,9],[578,0,579,9],[582,0,583,2],[582,3,583,7],[586,7,587,9],[591,0,592,0],[591,1,592,3],[591,4,592,6],[591,7,592,9],[574,0,575,2],[574,3,575,5],[574,6,575,7],[574,8,575,9],[576,0,577,2],[576,3,577,5],[576,6,577,7],[576,8,577,9],[611,0,612,2],[611,3,612,5],[611,6,612,7],[611,8,612,9],[613,0,614,2],[613,3,614,5],[613,6,614,7],[613,8,614,9],[607,0,608,2],[607,3,608,5],[607,6,608,7],[607,8,608,9],[609,0,610,2],[609,3,610,5],[609,6,610,7],[609,8,610,9],[601,0,602,3],[601,4,602,6],[601,7,602,9],[603,0,604,3],[603,4,604,6],[603,7,604,9],[623,0,624,2],[623,3,624,5],[623,6,624,7],[623,8,624,9],[625,0,626,2],[625,3,626,5],[625,6,626,7],[625,8,626,9],[619,0,620,2],[619,3,620,5],[619,6,620,7],[619,8,620,9],[621,0,622,2],[621,3,622,5],[621,6,622,7],[621,8,622,9],[615,0,616,2],[615,3,616,5],[615,6,616,7],[615,8,616,9],[617,0,618,2],[617,3,618,5],[617,6,618,7],[617,8,618,9],[650,0,651,3],[650,4,651,6],[650,7,651,9],[652,0,653,3],[652,4,653,6],[652,7,653,9],[642,0,643,0],[642,1,643,3],[642,4,643,6],[642,7,643,9],[646,0,647,2],[646,3,647,3],[646,4,647,9],[627,0,628,9],[631,0,632,2],[631,3,632,7],[635,7,636,9],[640,0,641,0],[640,1,641,3],[640,4,641,6],[640,7,641,9],[664,0,665,2],[664,3,665,5],[664,6,665,7],[664,8,665,9],[666,0,667,2],[666,3,667,5],[666,6,667,7],[666,8,667,9],[660,0,661,2],[660,3,661,5],[660,6,661,7],[660,8,661,9],[662,0,663,2],[662,3,663,5],[662,6,663,7],[662,8,663,9],[656,0,657,2],[656,3,657,5],[656,6,657,7],[656,8,657,9],[658,0,659,2],[658,3,659,5],[658,6,659,7],[658,8,659,9],[676,0,677,9],[680,0,681,2],[680,3,681,7],[684,7,685,9],[689,0,690,0],[689,1,690,3],[689,4,690,6],[689,7,690,9],[672,0,673,2],[672,3,673,5],[672,6,673,7],[672,8,673,9],[674,0,675,2],[674,3,675,5],[674,6,675,7],[674,8,675,9],[668,0,669,2],[668,3,669,5],[668,6,669,7],[668,8,669,9],[670,0,671,2],[670,3,671,5],[670,6,671,7],[670,8,671,9],[705,0,706,2],[705,3,706,5],[705,6,706,7],[705,8,706,9],[707,0,708,2],[707,3,708,5],[707,6,708,7],[707,8,708,9],[699,0,700,3],[699,4,700,6],[699,7,700,9],[701,0,702,3],[701,4,702,6],[701,7,702,9],[691,0,692,0],[691,1,692,3],[691,4,692,6],[691,7,692,9],[695,0,696,2],[695,3,696,3],[695,4,696,9],[717,0,718,2],[717,3,718,5],[717,6,718,7],[717,8,718,9],[719,0,720,2],[719,3,720,5],[719,6,720,7],[719,8,720,9],[713,0,714,2],[713,3,714,5],[713,6,714,7],[713,8,714,9],[715,0,716,2],[715,3,716,5],[715,6,716,7],[715,8,716,9],[709,0,710,2],[709,3,710,5],[709,6,710,7],[709,8,710,9],[711,0,712,2],[711,3,712,5],[711,6,712,7],[711,8,712,9],[740,0,741,0],[740,1,741,3],[740,4,741,6],[740,7,741,9],[744,0,745,2],[744,3,745,3],[744,4,745,9],[725,0,726,9],[729,0,730,2],[729,3,730,7],[733,7,734,9],[738,0,739,0],[738,1,739,3],[738,4,739,6],[738,7,739,9],[721,0,722,2],[721,3,722,5],[721,6,722,7],[721,8,722,9],[723,0,724,2],[723,3,724,5],[723,6,724,7],[723,8,724,9],[758,0,759,2],[758,3,759,5],[758,6,759,7],[758,8,759,9],[760,0,761,2],[760,3,761,5],[760,6,761,7],[760,8,761,9],[754,0,755,2],[754,3,755,5],[754,6,755,7],[754,8,755,9],[756,0,757,2],[756,3,757,5],[756,6,757,7],[756,8,757,9],[748,0,749,3],[748,4,749,6],[748,7,749,9],[750,0,751,3],[750,4,751,6],[750,7,751,9],[770,0,771,2],[770,3,771,5],[770,6,771,7],[770,8,771,9],[772,0,773,2],[772,3,773,5],[772,6,773,7],[772,8,773,9],[766,0,767,2],[766,3,767,5],[766,6,767,7],[766,8,767,9],[768,0,769,2],[768,3,769,5],[768,6,769,7],[768,8,769,9],[762,0,763,2],[762,3,763,5],[762,6,763,7],[762,8,763,9],[764,0,765,2],[764,3,765,5],[764,6,765,7],[764,8,765,9],[797,0,798,3],[797,4,798,6],[797,7,798,9],[799,0,800,3],[799,4,800,6],[799,7,800,9],[789,0,790,0],[789,1,790,3],[789,4,790,6],[789,7,790,9],[793,0,794,2],[793,3,794,3],[793,4,794,9],[774,0,775,9],[778,0,779,2],[778,3,779,7],[782,7,783,9],[787,0,788,0],[787,1,788,3],[787,4,788,6],[787,7,788,9],[811,0,812,2],[811,3,812,5],[811,6,812,7],[811,8,812,9],[813,0,814,2],[813,3,814,5],[813,6,814,7]],"merged_total":1220,"flags":["merged_cut"]}
[null,null,null,"ИНФОРМАЦИОННО-УДОСТОВЕРЯЮЩИЙ ЛИСТ"]
[]
[]
["№\nп/п","Обозначение документа",null,null,"Наименование изделия, вид документа",null,null,"Номер последнего изменения (версия)"]
[]
[1,{"$f":"IF(Лист1!K11=\"\",\"\",Лист1!K11)","v":"vk_DiafragmaPK"},null,null,{"$f":"IF(Данные!C11=\"\",\"\",Данные!C11)","v":"Проект организации строительства"},null,null,1]
[]
[]
[]
["Алгоритм расчета контрольной суммы",null,null,{"$f":"Лист1!$E$6","v":"MD5"},{"$f":"IF(Лист1!M11=\"\",\"\",Лист1!M11)","v":"4DB05FBD9C84ECF499E1CECEDBFAEAC5"}]
[]
[]
[]
["Наименование файла",null,null,null,"Дата и время последнего изменения файла",null,null,"Размер файла (байт)"]
[]
[{"$f":"IF(Лист1!A11=\"\",\"\",Лист1!A11)","v":"vk_DiafragmaPK.xlsb"},null,null,null,null,null,null,{"$f":"IF(Лист1!B11=\"\",\"\",Лист1!B11)","v":496610}]
[]
[]
[]
["Характер работы",null,null,"ФИО",null,null,"Подпись",null,"Дата подписания"]
[]
[null,null,null,null,null,null,null,null,{"$f":"IF(A22=\"\",\"\",TODAY())","v":""}]
[]
[null,null,null,null,null,null,null,null,{"$f":"IF(A24=\"\",\"\",TODAY())","v":""}]
[]
[null,null,null,null,null,null,null,null,{"$f":"IF(A26=\"\",\"\",TODAY())","v":""}]
[]
[null,null,null,null,null,null,null,null,{"$f":"IF(A28=\"\",\"\",TODAY())","v":""}]
[]
[null,null,null,null,null,null,null,null,{"$f":"IF(A30=\"\",\"\",TODAY())","v":""}]
[]
[null,null,null,null,null,null,null,null,{"$f":"IF(A32=\"\",\"\",TODAY())","v":""}]
[]
[null,null,null,null,null,null,null,null,{"$f":"IF(A34=\"\",\"\",TODAY())","v":""}]
[]
[null,null,null,null,null,null,null,null,{"$f":"IF(A36=\"\",\"\",TODAY())","v":""}]
[]
[null,null,null,null,null,null,null,null,{"$f":"IF(A38=\"\",\"\",TODAY())","v":""}]
[]
[" * – характер работы, выполняемой лицом, подписавшим документ «Разработал», «Проверил», «Нормоконтроль», «Утвердил» (ГИП, ГАП) и т.д. "]
[]
[]
[]
["Информационно-удостоверяющий лист",null,null,{"$f":"IF(Лист1!L11=\"-УЛ\",\"\",Лист1!L11)","v":"vk_DiafragmaPK-УЛ"},null,null,null,null,"Лист","Листов"]
[null,null,null,null,null,null,null,null,1,1]
[]
[]
[{"$f":"Лист1!$E$4","v":"Директор"},null,null,null,null,null,null,{"$f":"Лист1!$E$5","v":"И.И. Иванов"}]
[{"$f":"Лист1!$E$3","v":"ООО \"Рога и Копыта\""}]
[null,null,null,"ИНФОРМАЦИОННО-УДОСТОВЕРЯЮЩИЙ ЛИСТ"]
[]
[]
["№\nп/п","Обозначение документа",null,null,"Наименование изделия, вид документа",null,null,"Номер последнего изменения (версия)"]
[]
[1,{"$f":"IF(Лист1!K12=\"\",\"\",Лист1!K12)","v":"vk_Gidravlika"},null,null,{"$f":"IF(Данные!C12=\"\",\"\",Данные!C12)","v":"Сметная документация"},null,null,1]
[]
[]
[]
["Алгоритм расчета контрольной суммы",null,null,{"$f":"Лист1!$E$6","v":"MD5"},{"$f":"IF(Лист1!M12=\"\",\"\",Лист1!M12)","v":"B31562DF59AA68A9CE0F3254D39BD4A7"}]
[]
[]
[]
["Наименование файла",null,null,null,"Дата и время последнего изменения файла",null,null,"Размер файла (байт)"]
[]
[{"$f":"IF(Лист1!A12=\"\",\"\",Лист1!A12)","v":"vk_Gidravlika.xlsb"},null,null,null,null,null,null,{"$f":"IF(Лист1!B12=\"\",\"\",Лист1!B12)","v":480545}]
[]
[]
[]
["Характер работы",null,null,"ФИО",null,null,"Подпись",null,"Дата подписания"]
[]
[null,null,null,null,null,null,null,null,{"$f":"IF(A71=\"\",\"\",TODAY())","v":""}]
[]
[null,null,null,null,null,null,null,null,{"$f":"IF(A73=\"\",\"\",TODAY())","v":""}]
[]
[null,null,null,null,null,null,null,null,{"$f":"IF(A75=\"\",\"\",TODAY())","v":""}]
[]
[null,null,null,null,null,null,null,null,{"$f":"IF(A77=\"\",\"\",TODAY())","v":""}]
[]
[null,null,null,null,null,null,null,null,{"$f":"IF(A79=\"\",\"\",TODAY())","v":""}]
[]
[null,null,null,null,null,null,null,null,{"$f":"IF(A81=\"\",\"\",TODAY())","v":""}]
[]
[null,null,null,null,null,null,null,null,{"$f":"IF(A83=\"\",\"\",TODAY())","v":""}]
[]
[null,null,null,null,null,null,null,null,{"$f":"IF(A85=\"\",\"\",TODAY())","v":""}]
[]
[null,null,null,null,null,null,null,null,{"$f":"IF(A87=\"\",\"\",TODAY())","v":""}]
[]
[" * – характер работы, выполняемой лицом, подписавшим документ «Разработал», «Проверил», «Нормоконтроль», «Утвердил» (ГИП, ГАП) и т.д. "]
[]
[]
[]
["Информационно-удостоверяющий лист",null,null,{"$f":"IF(Лист1!L12=\"-УЛ\",\"\",Лист1!L12)","v":"vk_Gidravlika-УЛ"},null,null,null,null,"Лист","Листов"]
[null,null,null,null,null,null,null,null,1,1]
[]
[]
[{"$f":"Лист1!$E$4","v":"Директор"},null,null,null,null,null,null,{"$f":"Лист1!$E$5","v":"И.И. Иванов"}]
[{"$f":"Лист1!$E$3","v":"ООО \"Рога и Копыта\""}]
[null,null,null,"ИНФОРМАЦИОННО-УДОСТОВЕРЯЮЩИЙ ЛИСТ"]
[]
[]
["№\nп/п","Обозначение документа",null,null,"Наименование изделия, вид документа",null,null,"Номер последнего изменения (версия)"]
[]
[1,{"$f":"IF(Лист1!K13=\"\",\"\",Лист1!K13)","v":"vk_IshDannie"},null,null,{"$f":"IF(Данные!C13=\"\",\"\",Данные!C13)","v":"Ведомость объемов работ 01"},null,null,1]
[]
[]
[]
["Алгоритм расчета контрольной суммы",null,null,{"$f":"Лист1!$E$6","v":"MD5"},{"$f":"IF(Лист1!M13=\"\",\"\",Лист1!M13)","v":"4CFFC4741926C19FCFDE0990F014D782"}]
[]
[]
[]
["Наименование файла",null,null,null,"Дата и время последнего изменения файла",null,null,"Размер файла (байт)"]
[]
[{"$f":"IF(Лист1!A13=\"\",\"\",Лист1!A13)","v":"vk_IshDannie.xlsb"},null,null,null,null,null,null,{"$f":"IF(Лист1!B13=\"\",\"\",Лист1!B13)","v":134740}]
[]
[]
[]
["Характер работы",null,null,"ФИО",null,null,"Подпись",null,"Дата подписания"]
[]
[null,null,null,null,null,null,null,null,{"$f":"IF(A120=\"\",\"\",TODAY())","v":""}]
[]
[null,null,null,null,null,null,null,null,{"$f":"IF(A122=\"\",\"\",TODAY())","v":""}]
[]
[null,null,null,null,null,null,null,null,{"$f":"IF(A124=\"\",\"\",TODAY())","v":""}]
[]
[null,null,null,null,null,null,null,null,{"$f":"IF(A126=\"\",\"\",TODAY())","v":""}]
[]
[null,null,null,null,null,null,null,null,{"$f":"IF(A128=\"\",\"\",TODAY())","v":""}]
[]
[null,null,null,null,null,null,null,null,{"$f":"IF(A130=\"\",\"\",TODAY())","v":""}]
[]
[null,null,null,null,null,null,null,null,{"$f":"IF(A132=\"\",\"\",TODAY())","v":""}]
[]
[null,null,null,null,null,null,null,null,{"$f":"IF(A134=\"\",\"\",TODAY())","v":""}]
[]
[null,null,null,null,null,null,null,null,{"$f":"IF(A136=\"\",\"\",TODAY())","v":""}]
[]
[" * – характер работы, выполняемой лицом, подписавшим документ «Разработал», «Проверил», «Нормоконтроль», «Утвердил» (ГИП, ГАП) и т.д. "]
[]
[]
[]
["Информационно-удостоверяющий лист",null,null,{"$f":"IF(Лист1!L13=\"-УЛ\",\"\",Лист1!L13)","v":"vk_IshDannie-УЛ"},null,null,null,null,"Лист","Листов"]
[null,null,null,null,null,null,null,null,1,1]
[]
[]
[{"$f":"Лист1!$E$4","v":"Директор"},null,null,null,null,null,null,{"$f":"Лист1!$E$5","v":"И.И. Иванов"}]
[{"$f":"Лист1!$E$3","v":"ООО \"Рога и Копыта\""}]
[null,null,null,"ИНФОРМАЦИОННО-УДОСТОВЕРЯЮЩИЙ ЛИСТ"]
[]
[]
["№\nп/п","Обозначение документа",null,null,"Наименование изделия, вид документа",null,null,"Номер последнего изменения (версия)"]
[]
[1,{"$f":"IF(Лист1!K14=\"\",\"\",Лист1!K14)","v":"vk_OFO"},null,null,{"$f":"IF(Данные!C14=\"\",\"\",Данные!C14)","v":"Ведомость объемов работ 01"},null,null,1]
[]
[]
[]
["Алгоритм расчета контрольной суммы",null,null,{"$f":"Лист1!$E$6","v":"MD5"},{"$f":"IF(Лист1!M14=\"\",\"\",Лист1!M14)","v":"1E9EFF5C54CF82F9543231D8E2187358"}]
[]
[]
[]
["Наименование файла",null,null,null,"Дата и время последнего изменения файла",null,null,"Размер файла (байт)"]
[]
[{"$f":"IF(Лист1!A14=\"\",\"\",Лист1!A14)","v":"vk_OFO.xlsb"},null,null,null,null,null,null,{"$f":"IF(Лист1!B14=\"\",\"\",Лист1!B14)","v":73155}]
[]
[]
[]
["Характер работы",null,null,"ФИО",null,null,"Подпись",null,"Дата подписания"]
[]
[null,null,null,null,null,null,null,null,{"$f":"IF(A169=\"\",\"\",TODAY())","v":""}]
[]
[null,null,null,null,null,null,null,null,{"$f":"IF(A171=\"\",\"\",TODAY())","v":""}]
[]
[null,null,null,null,null,null,null,null,{"$f":"IF(A173=\"\",\"\",TODAY())","v":""}]
[]
[null,null,null,null,null,null,null,null,{"$f":"IF(A175=\"\",\"\",TODAY())","v":""}]
[]
[null,null,null,null,null,null,null,null,{"$f":"IF(A177=\"\",\"\",TODAY())","v":""}]
[]
[null,null,null,null,null,null,null,null,{"$f":"IF(A179=\"\",\"\",TODAY())","v":""}]
[]
[null,null,null,null,null,null,null,null,{"$f":"IF(A181=\"\",\"\",TODAY())","v":""}]
[]
[null,null,null,null,null,null,null,null,{"$f":"IF(A183=\"\",\"\",TODAY())","v":""}]
[]
[null,null,null,null,null,null,null,null,{"$f":"IF(A185=\"\",\"\",TODAY())","v":""}]
[]
[" * – характер работы, выполняемой лицом, подписавшим документ «Разработал», «Проверил», «Нормоконтроль», «Утвердил» (ГИП, ГАП) и т.д. "]
[]
[]
[]
["Информационно-удостоверяющий лист",null,null,{"$f":"IF(Лист1!L14=\"-УЛ\",\"\",Лист1!L14)","v":"vk_OFO-УЛ"},null,null,null,null,"Лист","Листов"]
[null,null,null,null,null,null,null,null,1,1]
[]
[]
[{"$f":"Лист1!$E$4","v":"Директор"},null,null,null,null,null,null,{"$f":"Лист1!$E$5","v":"И.И. Иванов"}]
[{"$f":"Лист1!$E$3","v":"ООО \"Рога и Копыта\""}]
[null,null,null,"ИНФОРМАЦИОННО-УДОСТОВЕРЯЮЩИЙ ЛИСТ"]
[]
[]
["№\nп/п","Обозначение документа",null,null,"Наименование изделия, вид документа",null,null,"Номер последнего изменения (версия)"]
[]
[1,{"$f":"IF(Лист1!K15=\"\",\"\",Лист1!K15)","v":"vk_Oprosnik"},null,null,{"$f":"IF(Данные!C15=\"\",\"\",Данные!C15)","v":"Ведомость объемов работ 02"},null,null,1]
[]
[]
[]
["Алгоритм расчета контрольной суммы",null,null,{"$f":"Лист1!$E$6","v":"MD5"},{"$f":"IF(Лист1!M15=\"\",\"\",Лист1!M15)","v":"F5C51936846960C6560EE1D6D93E0D13"}]
[]
[]
[]
["Наименование файла",null,null,null,"Дата и время последнего изменения файла",null,null,"Размер файла (байт)"]
[]
[{"$f":"IF(Лист1!A15=\"\",\"\",Лист1!A15)","v":"vk_Oprosnik.xlsb"},null,null,null,null,null,null,{"$f":"IF(Лист1!B15=\"\",\"\",Лист1!B15)","v":82660}]
[]
[]
[]
["Характер работы",null,null,"ФИО",null,null,"Подпись",null,"Дата подписания"]
[]
[null,null,null,null,null,null,null,null,{"$f":"IF(A218=\"\",\"\",TODAY())","v":""}]
[]
[null,null,null,null,null,null,null,null,{"$f":"IF(A220=\"\",\"\",TODAY())","v":""}]
[]
[null,null,null,null,null,null,null,null,{"$f":"IF(A222=\"\",\"\",TODAY())","v":""}]
[]
[null,null,null,null,null,null,null,null,{"$f":"IF(A224=\"\",\"\",TODAY())","v":""}]
[]
[null,null,null,null,null,null,null,null,{"$f":"IF(A226=\"\",\"\",TODAY())","v":""}]
[]
[null,null,null,null,null,null,null,null,{"$f":"IF(A228=\"\",\"\",TODAY())","v":""}]
[]
[null,null,null,null,null,null,null,null,{"$f":"IF(A230=\"\",\"\",TODAY())","v":""}]
[]
[null,null,null,null,null,null,null,null,{"$f":"IF(A232=\"\",\"\",TODAY())","v":""}]
[]
[null,null,null,null,null,null,null,null,{"$f":"IF(A234=\"\",\"\",TODAY())","v":""}]
[]
[" * – характер работы, выполняемой лицом, подписавшим документ «Разработал», «Проверил», «Нормоконтроль», «Утвердил» (ГИП, ГАП) и т.д. "]
[]
[]
[]
["Информационно-удостоверяющий лист",null,null,{"$f":"IF(Лист1!L15=\"-УЛ\",\"\",Лист1!L15)","v":"vk_Oprosnik-УЛ"},null,null,null,null,"Лист","Листов"]
[null,null,null,null,null,null,null,null,1,1]
[]
[]
[{"$f":"Лист1!$E$4","v":"Директор"},null,null,null,null,null,null,{"$f":"Лист1!$E$5","v":"И.И. Иванов"}]
[{"$f":"Лист1!$E$3","v":"ООО \"Рога и Копыта\""}]
[null,null,null,"ИНФОРМАЦИОННО-УДОСТОВЕРЯЮЩИЙ ЛИСТ"]
[]
[]
["№\nп/п","Обозначение документа",null,null,"Наименование изделия, вид документа",null,null,"Номер последнего изменения (версия)"]
[]
[1,{"$f":"IF(Лист1!K16=\"\",\"\",Лист1!K16)","v":"vk_Pojar"},null,null,{"$f":"IF(Данные!C16=\"\",\"\",Данные!C16)","v":"Ведомость объемов работ 02"},null,null,1]
[]
[]
[]
["Алгоритм расчета контрольной суммы",null,null,{"$f":"Лист1!$E$6","v":"MD5"},{"$f":"IF(Лист1!M16=\"\",\"\",Лист1!M16)","v":"8C0F374D735C6CF86D0F7A5B8050867C"}]
[]
[]
[]
["Наименование файла",null,null,null,"Дата и время последнего изменения файла",null,null,"Размер файла (байт)"]
[]
[{"$f":"IF(Лист1!A16=\"\",\"\",Лист1!A16)","v":"vk_Pojar.xlsb"},null,null,null,null,null,null,{"$f":"IF(Лист1!B16=\"\",\"\",Лист1!B16)","v":131332}]
[]
[]
[]
["Характер работы",null,null,"ФИО",null,null,"Подпись",null,"Дата подписания"]
[]
[null,null,null,null,null,null,null,null,{"$f":"IF(A267=\"\",\"\",TODAY())","v":""}]
[]
[null,null,null,null,null,null,null,null,{"$f":"IF(A269=\"\",\"\",TODAY())","v":""}]
[]
[null,null,null,null,null,null,null,null,{"$f":"IF(A271=\"\",\"\",TODAY())","v":""}]
[]
[null,null,null,null,null,null,null,null,{"$f":"IF(A273=\"\",\"\",TODAY())","v":""}]
[]
[null,null,null,null,null,null,null,null,{"$f":"IF(A275=\"\",\"\",TODAY())","v":""}]
[]
[null,null,null,null,null,null,null,null,{"$f":"IF(A277=\"\",\"\",TODAY())","v":""}]
[]
[null,null,null,null,null,null,null,null,{"$f":"IF(A279=\"\",\"\",TODAY())","v":""}]
[]
[null,null,null,null,null,null,null,null,{"$f":"IF(A281=\"\",\"\",TODAY())","v":""}]
[]
[null,null,null,null,null,null,null,null,{"$f":"IF(A283=\"\",\"\",TODAY())","v":""}]
[]
[" * – характер работы, выполняемой лицом, подписавшим документ «Разработал», «Проверил», «Нормоконтроль», «Утвердил» (ГИП, ГАП) и т.д. "]
[]
[]
[]
["Информационно-удостоверяющий лист",null,null,{"$f":"IF(Лист1!L16=\"-УЛ\",\"\",Лист1!L16)","v":"vk_Pojar-УЛ"},null,null,null,null,"Лист","Листов"]
[null,null,null,null,null,null,null,null,1,1]
[]
[]
[{"$f":"Лист1!$E$4","v":"Директор"},null,null,null,null,null,null,{"$f":"Лист1!$E$5","v":"И.И. Иванов"}]
[{"$f":"Лист1!$E$3","v":"ООО \"Рога и Копыта\""}]
[null,null,null,"ИНФОРМАЦИОННО-УДОСТОВЕРЯЮЩИЙ ЛИСТ"]
[]
[]
["№\nп/п","Обозначение документа",null,null,"Наименование изделия, вид документа",null,null,"Номер последнего изменения (версия)"]
[]
[1,{"$f":"IF(Лист1!K17=\"\",\"\",Лист1!K17)","v":"vk_Rashody"},null,null,{"$f":"IF(Данные!C17=\"\",\"\",Данные!C17)","v":"Ведомость ресурсов 01"},null,null,1]
[]
[]
[]
["Алгоритм расчета контрольной суммы",null,null,{"$f":"Лист1!$E$6","v":"MD5"},{"$f":"IF(Лист1!M17=\"\",\"\",Лист1!M17)","v":"13620F3393C0B645E119700393504E44"}]
[]
[]
[]
["Наименование файла",null,null,null,"Дата и время последнего изменения файла",null,null,"Размер файла (байт)"]
[]
[{"$f":"IF(Лист1!A17=\"\",\"\",Лист1!A17)","v":"vk_Rashody.xlsb"},null,null,null,null,null,null,{"$f":"IF(Лист1!B17=\"\",\"\",Лист1!B17)","v":304094}]
[]
[]
[]
["Характер работы",null,null,"ФИО",null,null,"Подпись",null,"Дата подписания"]
[]
[null,null,null,null,null,null,null,null,{"$f":"IF(A316=\"\",\"\",TODAY())","v":""}]
[]
[null,null,null,null,null,null,null,null,{"$f":"IF(A318=\"\",\"\",TODAY())","v":""}]
[]
[null,null,null,null,null,null,null,null,{"$f":"IF(A320=\"\",\"\",TODAY())","v":""}]
[]
[null,null,null,null,null,null,null,null,{"$f":"IF(A322=\"\",\"\",TODAY())","v":""}]
[]
[null,null,null,null,null,null,null,null,{"$f":"IF(A324=\"\",\"\",TODAY())","v":""}]
[]
[null,null,null,null,null,null,null,null,{"$f":"IF(A326=\"\",\"\",TODAY())","v":""}]
[]
[null,null,null,null,null,null,null,null,{"$f":"IF(A328=\"\",\"\",TODAY())","v":""}]
[]
[null,null,null,null,null,null,null,null,{"$f":"IF(A330=\"\",\"\",TODAY())","v":""}]
[]
[null,null,null,null,null,null,null,null,{"$f":"IF(A332=\"\",\"\",TODAY())","v":""}]
[]
[" * – характер работы, выполняемой лицом, подписавшим документ «Разработал», «Проверил», «Нормоконтроль», «Утвердил» (ГИП, ГАП) и т.д. "]
[]
[]
[]
["Информационно-удостоверяющий лист",null,null,{"$f":"IF(Лист1!L17=\"-УЛ\",\"\",Лист1!L17)","v":"vk_Rashody-УЛ"},null,null,null,null,"Лист","Листов"]
[null,null,null,null,null,null,null,null,1,1]
[]
[]
[{"$f":"Лист1!$E$4","v":"Директор"},null,null,null,null,null,null,{"$f":"Лист1!$E$5","v":"И.И. Иванов"}]
[{"$f":"Лист1!$E$3","v":"ООО \"Рога и Копыта\""}]
[null,null,null,"ИНФОРМАЦИОННО-УДОСТОВЕРЯЮЩИЙ ЛИСТ"]
[]
[]
["№\nп/п","Обозначение документа",null,null,"Наименование изделия, вид документа",null,null,"Номер последнего изменения (версия)"]
[]
[1,{"$f":"IF(Лист1!K18=\"\",\"\",Лист1!K18)","v":"vk_SchetVody"},null,null,{"$f":"IF(Данные!C18=\"\",\"\",Данные!C18)","v":"Ведомость ресурсов 01"},null,null,1]
[]
[]
[]
["Алгоритм расчета контрольной суммы",null,null,{"$f":"Лист1!$E$6","v":"MD5"},{"$f":"IF(Лист1!M18=\"\",\"\",Лист1!M18)","v":"60D1514D57DF2A04CC517BEF89FDEDAC"}]
[]
[]
[]
["Наименование файла",null,null,null,"Дата и время последнего изменения файла",null,null,"Размер файла (байт)"]
[]
[{"$f":"IF(Лист1!A18=\"\",\"\",Лист1!A18)","v":"vk_SchetVody.xlsb"},null,null,null,null,null,null,{"$f":"IF(Лист1!B18=\"\",\"\",Лист1!B18)","v":32191}]
[]
[]
[]
["Характер работы",null,null,"ФИО",null,null,"Подпись",null,"Дата подписания"]
[]
[null,null,null,null,null,null,null,null,{"$f":"IF(A365=\"\",\"\",TODAY())","v":""}]
[]
[null,null,null,null,null,null,null,null,{"$f":"IF(A367=\"\",\"\",TODAY())","v":""}]
[]
[null,null,null,null,null,null,null,null,{"$f":"IF(A369=\"\",\"\",TODAY())","v":""}]
[]
[null,null,null,null,null,null,null,null,{"$f":"IF(A371=\"\",\"\",TODAY())","v":""}]
[]
[null,null,null,null,null,null,null,null,{"$f":"IF(A373=\"\",\"\",TODAY())","v":""}]
[]
[null,null,null,null,null,null,null,null,{"$f":"IF(A375=\"\",\"\",TODAY())","v":""}]
[]
[null,null,null,null,null,null,null,null,{"$f":"IF(A377=\"\",\"\",TODAY())","v":""}]
[]
[null,null,null,null,null,null,null,null,{"$f":"IF(A379=\"\",\"\",TODAY())","v":""}]
[]
[null,null,null,null,null,null,null,null,{"$f":"IF(A381=\"\",\"\",TODAY())","v":""}]
[]
[" * – характер работы, выполняемой лицом, подписавшим документ «Разработал», «Проверил», «Нормоконтроль», «Утвердил» (ГИП, ГАП) и т.д. "]
[]
[]
[]
["Информационно-удостоверяющий лист",null,null,{"$f":"IF(Лист1!L18=\"-УЛ\",\"\",Лист1!L18)","v":"vk_SchetVody-УЛ"},null,null,null,null,"Лист","Листов"]
[null,null,null,null,null,null,null,null,1,1]
[]
[]
[{"$f":"Лист1!$E$4","v":"Директор"},null,null,null,null,null,null,{"$f":"Лист1!$E$5","v":"И.И. Иванов"}]
[{"$f":"Лист1!$E$3","v":"ООО \"Рога и Копыта\""}]
[null,null,null,"ИНФОРМАЦИОННО-УДОСТОВЕРЯЮЩИЙ ЛИСТ"]
[]
[]
["№\nп/п","Обозначение документа",null,null,"Наименование изделия, вид документа",null,null,"Номер последнего изменения (версия)"]
[]
[1,{"$f":"IF(Лист1!K19=\"\",\"\",Лист1!K19)","v":"vk_Vodonagrevatel"},null,null,{"$f":"IF(Данные!C19=\"\",\"\",Данные!C19)","v":"Ведомость ресурсов 02"},null,null,1]
[]
[]
[]
["Алгоритм расчета контрольной суммы",null,null,{"$f":"Лист1!$E$6","v":"MD5"},{"$f":"IF(Лист1!M19=\"\",\"\",Лист1!M19)","v":"BCD06762665584DF18A91A2E0ADCAE34"}]
[]
[]
[]
["Наименование файла",null,null,null,"Дата и время последнего изменения файла",null,null,"Размер файла (байт)"]
[]
[{"$f":"IF(Лист1!A19=\"\",\"\",Лист1!A19)","v":"vk_Vodonagrevatel.xlsb"},null,null,null,null,null,null,{"$f":"IF(Лист1!B19=\"\",\"\",Лист1!B19)","v":31665}]
[]
[]
[]
["Характер работы",null,null,"ФИО",null,null,"Подпись",null,"Дата подписания"]
[]
[null,null,null,null,null,null,null,null,{"$f":"IF(A414=\"\",\"\",TODAY())","v":""}]
[]
[null,null,null,null,null,null,null,null,{"$f":"IF(A416=\"\",\"\",TODAY())","v":""}]
[]
[null,null,null,null,null,null,null,null,{"$f":"IF(A418=\"\",\"\",TODAY())","v":""}]
[]
[null,null,null,null,null,null,null,null,{"$f":"IF(A420=\"\",\"\",TODAY())","v":""}]
[]
[null,null,null,null,null,null,null,null,{"$f":"IF(A422=\"\",\"\",TODAY())","v":""}]
[]
[null,null,null,null,null,null,null,null,{"$f":"IF(A424=\"\",\"\",TODAY())","v":""}]
[]
[null,null,null,null,null,null,null,null,{"$f":"IF(A426=\"\",\"\",TODAY())","v":""}]
[]
[null,null,null,null,null,null,null,null,{"$f":"IF(A428=\"\",\"\",TODAY())","v":""}]
[]
[null,null,null,null,null,null,null,null,{"$f":"IF(A430=\"\",\"\",TODAY())","v":""}]
[]
[" * – характер работы, выполняемой лицом, подписавшим документ «Разработал», «Проверил», «Нормоконтроль», «Утвердил» (ГИП, ГАП) и т.д. "]
[]
[]
[]
["Информационно-удостоверяющий лист",null,null,{"$f":"IF(Лист1!L19=\"-УЛ\",\"\",Лист1!L19)","v":"vk_Vodonagrevatel-УЛ"},null,null,null,null,"Лист","Листов"]
[null,null,null,null,null,null,null,null,1,1]
[]
[]
[{"$f":"Лист1!$E$4","v":"Директор"},null,null,null,null,null,null,{"$f":"Лист1!$E$5","v":"И.И. Иванов"}]
[{"$f":"Лист1!$E$3","v":"ООО \"Рога и Копыта\""}]
[null,null,null,"ИНФОРМАЦИОННО-УДОСТОВЕРЯЮЩИЙ ЛИСТ"]
[]
[]
["№\nп/п","Обозначение документа",null,null,"Наименование изделия, вид документа",null,null,"Номер последнего изменения (версия)"]
[]
[1,{"$f":"IF(Лист1!K20=\"\",\"\",Лист1!K20)","v":"vk_Vodostok"},null,null,{"$f":"IF(Данные!C20=\"\",\"\",Данные!C20)","v":"Ведомость ресурсов 02"},null,null,1]
[]
[]
[]
["Алгоритм расчета контрольной суммы",null,null,{"$f":"Лист1!$E$6","v":"MD5"},{"$f":"IF(Лист1!M20=\"\",\"\",Лист1!M20)","v":"66DBE8EC25206B14C061EBF2B2DB0C82"}]
[]
[]
[]
["Наименование файла",null,null,null,"Дата и время последнего изменения файла",null,null,"Размер файла (байт)"]
[]
[{"$f":"IF(Лист1!A20=\"\",\"\",Лист1!A20)","v":"vk_Vodostok.xlsb"},null,null,null,null,null,null,{"$f":"IF(Лист1!B20=\"\",\"\",Лист1!B20)","v":376192}]
[]
[]
[]
["Характер работы",null,null,"ФИО",null,null,"Подпись",null,"Дата подписания"]
[]
[null,null,null,null,null,null,null,null,{"$f":"IF(A463=\"\",\"\",TODAY())","v":""}]
[]
[null,null,null,null,null,null,null,null,{"$f":"IF(A465=\"\",\"\",TODAY())","v":""}]
[]
[null,null,null,null,null,null,null,null,{"$f":"IF(A467=\"\",\"\",TODAY())","v":""}]
[]
[null,null,null,null,null,null,null,null,{"$f":"IF(A469=\"\",\"\",TODAY())","v":""}]
[]
[null,null,null,null,null,null,null,null,{"$f":"IF(A471=\"\",\"\",TODAY())","v":""}]
[]
[null,null,null,null,null,null,null,null,{"$f":"IF(A473=\"\",\"\",TODAY())","v":""}]
[]
[null,null,null,null,null,null,null,null,{"$f":"IF(A475=\"\",\"\",TODAY())","v":""}]
[]
[null,null,null,null,null,null,null,null,{"$f":"IF(A477=\"\",\"\",TODAY())","v":""}]
[]
[null,null,null,null,null,null,null,null,{"$f":"IF(A479=\"\",\"\",TODAY())","v":""}]
[]
[" * – характер работы, выполняемой лицом, подписавшим документ «Разработал», «Проверил», «Нормоконтроль», «Утвердил» (ГИП, ГАП) и т.д. "]
[]
[]
[]
["Информационно-удостоверяющий лист",null,null,{"$f":"IF(Лист1!L20=\"-УЛ\",\"\",Лист1!L20)","v":"vk_Vodostok-УЛ"},null,null,null,null,"Лист","Листов"]
[null,null,null,null,null,null,null,null,1,1]
[]
[]
[{"$f":"Лист1!$E$4","v":"Директор"},null,null,null,null,null,null,{"$f":"Лист1!$E$5","v":"И.И. Иванов"}]
[{"$f":"Лист1!$E$3","v":"ООО \"Рога и Копыта\""}]
[null,null,null,"ИНФОРМАЦИОННО-УДОСТОВЕРЯЮЩИЙ ЛИСТ"]
[]
[]
["№\nп/п","Обозначение документа",null,null,"Наименование изделия, вид документа",null,null,"Номер последнего изменения (версия)"]
[]
[1,{"$f":"IF(Лист1!K21=\"\",\"\",Лист1!K21)","v":"Баланс ВиВ"},null,null,{"$f":"IF(Данные!C21=\"\",\"\",Данные!C21)","v":"Кон. Анализ"},null,null,1]
[]
[]
[]
["Алгоритм расчета контрольной суммы",null,null,{"$f":"Лист1!$E$6","v":"MD5"},{"$f":"IF(Лист1!M21=\"\",\"\",Лист1!M21)","v":"1B8CF50ABD760BBA3FA21C736AA1A7E7"}]
[]
[]
[]
["Наименование файла",null,null,null,"Дата и время последнего изменения файла",null,null,"Размер файла (байт)"]
[]
[{"$f":"IF(Лист1!A21=\"\",\"\",Лист1!A21)","v":"Баланс ВиВ.docx"},null,null,null,null,null,null,{"$f":"IF(Лист1!B21=\"\",\"\",Лист1!B21)","v":117559}]
[]
[]
[]
["Характер работы",null,null,"ФИО",null,null,"Подпись",null,"Дата подписания"]
[]
[null,null,null,null,null,null,null,null,{"$f":"IF(A512=\"\",\"\",TODAY())","v":""}]
[]
[null,null,null,null,null,null,null,null,{"$f":"IF(A514=\"\",\"\",TODAY())","v":""}]
[]
[null,null,null,null,null,null,null,null,{"$f":"IF(A516=\"\",\"\",TODAY())","v":""}]
[]
[null,null,null,null,null,null,null,null,{"$f":"IF(A518=\"\",\"\",TODAY())","v":""}]
[]
[null,null,null,null,null,null,null,null,{"$f":"IF(A520=\"\",\"\",TODAY())","v":""}]
[]
[null,null,null,null,null,null,null,null,{"$f":"IF(A522=\"\",\"\",TODAY())","v":""}]
[]
[null,null,null,null,null,null,null,null,{"$f":"IF(A524=\"\",\"\",TODAY())","v":""}]
[]
[null,null,null,null,null,null,null,null,{"$f":"IF(A526=\"\",\"\",TODAY())","v":""}]
[]
[null,null,null,null,null,null,null,null,{"$f":"IF(A528=\"\",\"\",TODAY())","v":""}]
[]
[" * – характер работы, выполняемой лицом, подписавшим документ «Разработал», «Проверил», «Нормоконтроль», «Утвердил» (ГИП, ГАП) и т.д. "]
[]
[]
[]
["Информационно-удостоверяющий лист",null,null,{"$f":"IF(Лист1!L21=\"-УЛ\",\"\",Лист1!L21)","v":"Баланс ВиВ-УЛ"},null,null,null,null,"Лист","Листов"]
[null,null,null,null,null,null,null,null,1,1]
[]
[]
[{"$f":"Лист1!$E$4","v":"Директор"},null,null,null,null,null,null,{"$f":"Лист1!$E$5","v":"И.И. Иванов"}]
[{"$f":"Лист1!$E$3","v":"ООО \"Рога и Копыта\""}]
[null,null,null,"ИНФОРМАЦИОННО-УДОСТОВЕРЯЮЩИЙ ЛИСТ"]
[]
[]
["№\nп/п","Обозначение документа",null,null,"Наименование изделия, вид документа",null,null,"Номер последнего изменения (версия)"]
[]
[1,{"$f":"IF(Лист1!K22=\"\",\"\",Лист1!K22)","v":"Задание на проектирование-ВК"},null,null,{"$f":"IF(Данные!C22=\"\",\"\",Данные!C22)","v":"Кон. Анализ"},null,null,1]
[]
[]
[]
["Алгоритм расчета контрольной суммы",null,null,{"$f":"Лист1!$E$6","v":"MD5"},{"$f":"IF(Лист1!M22=\"\",\"\",Лист1!M22)","v":"219AD7B067E86A05B95E7DC4395FD9EC"}]
[]
[]
[]
["Наименование файла",null,null,null,"Дата и время последнего изменения файла",null,null,"Размер файла (байт)"]
[]
[{"$f":"IF(Лист1!A22=\"\",\"\",Лист1!A22)","v":"Задание на проектирование-ВК.xlsx"},null,null,null,null,null,null,{"$f":"IF(Лист1!B22=\"\",\"\",Лист1!B22)","v":48989}]
[]
[]
[]
["Характер работы",null,null,"ФИО",null,null,"Подпись",null,"Дата подписания"]
[]
[null,null,null,null,null,null,null,null,{"$f":"IF(A561=\"\",\"\",TODAY())","v":""}]
[]
[null,null,null,null,null,null,null,null,{"$f":"IF(A563=\"\",\"\",TODAY())","v":""}]
[]
[null,null,null,null,null,null,null,null,{"$f":"IF(A565=\"\",\"\",TODAY())","v":""}]
[]
[null,null,null,null,null,null,null,null,{"$f":"IF(A567=\"\",\"\",TODAY())","v":""}]
[]
[null,null,null,null,null,null,null,null,{"$f":"IF(A569=\"\",\"\",TODAY())","v":""}]
[]
[null,null,null,null,null,null,null,null,{"$f":"IF(A571=\"\",\"\",TODAY())","v":""}]
[]
[null,null,null,null,null,null,null,null,{"$f":"IF(A573=\"\",\"\",TODAY())","v":""}]
[]
[null,null,null,null,null,null,null,null,{"$f":"IF(A575=\"\",\"\",TODAY())","v":""}]
[]
[null,null,null,null,null,null,null,null,{"$f":"IF(A577=\"\",\"\",TODAY())","v":""}]
[]
[" * – характер работы, выполняемой лицом, подписавшим документ «Разработал», «Проверил», «Нормоконтроль», «Утвердил» (ГИП, ГАП) и т.д. "]
[]
[]
[]
["Информационно-удостоверяющий лист",null,null,{"$f":"IF(Лист1!L22=\"-УЛ\",\"\",Лист1!L22)","v":"Задание на проектирование-ВК-УЛ"},null,null,null,null,"Лист","Листов"]
[null,null,null,null,null,null,null,null,1,1]
[]
[]
[{"$f":"Лист1!$E$4","v":"Директор"},null,null,null,null,null,null,{"$f":"Лист1!$E$5","v":"И.И. Иванов"}]
[{"$f":"Лист1!$E$3","v":"ООО \"Рога и Копыта\""}]
[null,null,null,"ИНФОРМАЦИОННО-УДОСТОВЕРЯЮЩИЙ ЛИСТ"]
[]
[]
["№\nп/п","Обозначение документа",null,null,"Наименование изделия, вид документа",null,null,"Номер последнего изменения (версия)"]
[]
[1,{"$f":"IF(Лист1!K23=\"\",\"\",Лист1!K23)","v":"Запрос ТУ"},null,null,{"$f":"IF(Данные!C23=\"\",\"\",Данные!C23)","v":"Коммерческое предложение"},null,null,1]
[]
[]
[]
["Алгоритм расчета контрольной суммы",null,null,{"$f":"Лист1!$E$6","v":"MD5"},{"$f":"IF(Лист1!M23=\"\",\"\",Лист1!M23)","v":"E7508325198E5304A154CC2E3787900F"}]
[]
[]
[]
["Наименование файла",null,null,null,"Дата и время последнего изменения файла",null,null,"Размер файла (байт)"]
[]
[{"$f":"IF(Лист1!A23=\"\",\"\",Лист1!A23)","v":"Запрос ТУ.docx"},null,null,null,null,null,null,{"$f":"IF(Лист1!B23=\"\",\"\",Лист1!B23)","v":18582}]
[]
[]
[]
["Характер работы",null,null,"ФИО",null,null,"Подпись",null,"Дата подписания"]
[]
[null,null,null,null,null,null,null,null,{"$f":"IF(A610=\"\",\"\",TODAY())","v":""}]
[]
[null,null,null,null,null,null,null,null,{"$f":"IF(A612=\"\",\"\",TODAY())","v":""}]
[]
[null,null,null,null,null,null,null,null,{"$f":"IF(A614=\"\",\"\",TODAY())","v":""}]
[]
[null,null,null,null,null,null,null,null,{"$f":"IF(A616=\"\",\"\",TODAY())","v":""}]
[]
[null,null,null,null,null,null,null,null,{"$f":"IF(A618=\"\",\"\",TODAY())","v":""}]
[]
[null,null,null,null,null,null,null,null,{"$f":"IF(A620=\"\",\"\",TODAY())","v":""}]
[]
[null,null,null,null,null,null,null,null,{"$f":"IF(A622=\"\",\"\",TODAY())","v":""}]
[]
[null,null,null,null,null,null,null,null,{"$f":"IF(A624=\"\",\"\",TODAY())","v":""}]
[]
[null,null,null,null,null,null,null,null,{"$f":"IF(A626=\"\",\"\",TODAY())","v":""}]
[]
[" * – характер работы, выполняемой лицом, подписавшим документ «Разработал», «Проверил», «Нормоконтроль», «Утвердил» (ГИП, ГАП) и т.д. "]
[]
[]
[]
["Информационно-удостоверяющий лист",null,null,{"$f":"IF(Лист1!L23=\"-УЛ\",\"\",Лист1!L23)","v":"Запрос ТУ-УЛ"},null,null,null,null,"Лист","Листов"]
[null,null,null,null,null,null,null,null,1,1]
[]
[]
[{"$f":"Лист1!$E$4","v":"Директор"},null,null,null,null,null,null,{"$f":"Лист1!$E$5","v":"И.И. Иванов"}]
[{"$f":"Лист1!$E$3","v":"ООО \"Рога и Копыта\""}]
[null,null,null,"ИНФОРМАЦИОННО-УДОСТОВЕРЯЮЩИЙ ЛИСТ"]
[]
[]
["№\nп/п","Обозначение документа",null,null,"Наименование изделия, вид документа",null,null,"Номер последнего изменения (версия)"]
[]
[1,{"$f":"IF(Лист1!K24=\"\",\"\",Лист1!K24)","v":"ТУ на подключение в части ВК"},null,null,{"$f":"IF(Данные!C24=\"\",\"\",Данные!C24)","v":"ЛСР 01"},null,null,1]
[]
[]
[]
["Алгоритм расчета контрольной суммы",null,null,{"$f":"Лист1!$E$6","v":"MD5"},{"$f":"IF(Лист1!M24=\"\",\"\",Лист1!M24)","v":"39C140068070A9B03F5D3328B7C9DC06"}]
[]
[]
[]
["Наименование файла",null,null,null,"Дата и время последнего изменения файла",null,null,"Размер файла (байт)"]
[]
[{"$f":"IF(Лист1!A24=\"\",\"\",Лист1!A24)","v":"ТУ на подключение в части ВК.xlsx"},null,null,null,null,null,null,{"$f":"IF(Лист1!B24=\"\",\"\",Лист1!B24)","v":422148}]
[]
[]
[]
["Характер работы",null,null,"ФИО",null,null,"Подпись",null,"Дата подписания"]
[]
[null,null,null,null,null,null,null,null,{"$f":"IF(A659=\"\",\"\",TODAY())","v":""}]
[]
[null,null,null,null,null,null,null,null,{"$f":"IF(A661=\"\",\"\",TODAY())","v":""}]
[]
[null,null,null,null,null,null,null,null,{"$f":"IF(A663=\"\",\"\",TODAY())","v":""}]
[]
[null,null,null,null,null,null,null,null,{"$f":"IF(A665=\"\",\"\",TODAY())","v":""}]
[]
[null,null,null,null,null,null,null,null,{"$f":"IF(A667=\"\",\"\",TODAY())","v":""}]
[]
[null,null,null,null,null,null,null,null,{"$f":"IF(A669=\"\",\"\",TODAY())","v":""}]
[]
[null,null,null,null,null,null,null,null,{"$f":"IF(A671=\"\",\"\",TODAY())","v":""}]
[]
[null,null,null,null,null,null,null,null,{"$f":"IF(A673=\"\",\"\",TODAY())","v":""}]
[]
[null,null,null,null,null,null,null,null,{"$f":"IF(A675=\"\",\"\",TODAY())","v":""}]
[]
[" * – характер работы, выполняемой лицом, подписавшим документ «Разработал», «Проверил», «Нормоконтроль», «Утвердил» (ГИП, ГАП) и т.д. "]
[]
[]
[]
["Информационно-удостоверяющий лист",null,null,{"$f":"IF(Лист1!L24=\"-УЛ\",\"\",Лист1!L24)","v":"ТУ на подключение в части ВК-УЛ"},null,null,null,null,"Лист","Листов"]
[null,null,null,null,null,null,null,null,1,1]
[]
[]
[{"$f":"Лист1!$E$4","v":"Директор"},null,null,null,null,null,null,{"$f":"Лист1!$E$5","v":"И.И. Иванов"}]
[{"$f":"Лист1!$E$3","v":"ООО \"Рога и Копыта\""}]
[null,null,null,"ИНФОРМАЦИОННО-УДОСТОВЕРЯЮЩИЙ ЛИСТ"]
[]
[]
["№\nп/п","Обозначение документа",null,null,"Наименование изделия, вид документа",null,null,"Номер последнего изменения (версия)"]
[]
[1,{"$f":"IF(Лист1!K25=\"\",\"\",Лист1!K25)","v":""},null,null,{"$f":"IF(Данные!C25=\"\",\"\",Данные!C25)","v":"ЛСР 01"},null,null,1]
[]
[]
[]
["Алгоритм расчета контрольной суммы",null,null,{"$f":"Лист1!$E$6","v":"MD5"},{"$f":"IF(Лист1!M25=\"\",\"\",Лист1!M25)","v":""}]
[]
[]
[]
["Наименование файла",null,null,null,"Дата и время последнего изменения файла",null,null,"Размер файла (байт)"]
[]
[{"$f":"IF(Лист1!A25=\"\",\"\",Лист1!A25)","v":""},null,null,null,null,null,null,{"$f":"IF(Лист1!B25=\"\",\"\",Лист1!B25)","v":""}]
[]
[]
[]
["Характер работы",null,null,"ФИО",null,null,"Подпись",null,"Дата подписания"]
[]
[null,null,null,null,null,null,null,null,{"$f":"IF(A708=\"\",\"\",TODAY())","v":""}]
[]
[null,null,null,null,null,null,null,null,{"$f":"IF(A710=\"\",\"\",TODAY())","v":""}]
[]
[null,null,null,null,null,null,null,null,{"$f":"IF(A712=\"\",\"\",TODAY())","v":""}]
[]
[null,null,null,null,null,null,null,null,{"$f":"IF(A714=\"\",\"\",TODAY())","v":""}]
[]
[null,null,null,null,null,null,null,null,{"$f":"IF(A716=\"\",\"\",TODAY())","v":""}]
[]
[null,null,null,null,null,null,null,null,{"$f":"IF(A718=\"\",\"\",TODAY())","v":""}]
[]
[null,null,null,null,null,null,null,null,{"$f":"IF(A720=\"\",\"\",TODAY())","v":""}]
[]
[null,null,null,null,null,null,null,null,{"$f":"IF(A722=\"\",\"\",TODAY())","v":""}]
[]
[null,null,null,null,null,null,null,null,{"$f":"IF(A724=\"\",\"\",TODAY())","v":""}]
[]
[" * – характер работы, выполняемой лицом, подписавшим документ «Разработал», «Проверил», «Нормоконтроль», «Утвердил» (ГИП, ГАП) и т.д. "]
[]
[]
[]
["Информационно-удостоверяющий лист",null,null,{"$f":"IF(Лист1!L25=\"-УЛ\",\"\",Лист1!L25)","v":""},null,null,null,null,"Лист","Листов"]
[null,null,null,null,null,null,null,null,1,1]
[]
[]
[{"$f":"Лист1!$E$4","v":"Директор"},null,null,null,null,null,null,{"$f":"Лист1!$E$5","v":"И.И. Иванов"}]
[{"$f":"Лист1!$E$3","v":"ООО \"Рога и Копыта\""}]
[null,null,null,"ИНФОРМАЦИОННО-УДОСТОВЕРЯЮЩИЙ ЛИСТ"]
[]
[]
["№\nп/п","Обозначение документа",null,null,"Наименование изделия, вид документа",null,null,"Номер последнего изменения (версия)"]
[]
[1,{"$f":"IF(Лист1!K26=\"\",\"\",Лист1!K26)","v":""},null,null,{"$f":"IF(Данные!C26=\"\",\"\",Данные!C26)","v":"ЛСР 02"},null,null,1]
[]
[]
[]
["Алгоритм расчета контрольной суммы",null,null,{"$f":"Лист1!$E$6","v":"MD5"},{"$f":"IF(Лист1!M26=\"\",\"\",Лист1!M26)","v":""}]
[]
[]
[]
["Наименование файла",null,null,null,"Дата и время последнего изменения файла",null,null,"Размер файла (байт)"]
[]
[{"$f":"IF(Лист1!A26=\"\",\"\",Лист1!A26)","v":""},null,null,null,null,null,null,{"$f":"IF(Лист1!B26=\"\",\"\",Лист1!B26)","v":""}]
[]
[]
[]
["Характер работы",null,null,"ФИО",null,null,"Подпись",null,"Дата подписания"]
[]
[null,null,null,null,null,null,null,null,{"$f":"IF(A757=\"\",\"\",TODAY())","v":""}]
[]
[null,null,null,null,null,null,null,null,{"$f":"IF(A759=\"\",\"\",TODAY())","v":""}]
[]
[null,null,null,null,null,null,null,null,{"$f":"IF(A761=\"\",\"\",TODAY())","v":""}]
[]
[null,null,null,null,null,null,null,null,{"$f":"IF(A763=\"\",\"\",TODAY())","v":""}]
[]
[null,null,null,null,null,null,null,null,{"$f":"IF(A765=\"\",\"\",TODAY())","v":""}]
[]
[null,null,null,null,null,null,null,null,{"$f":"IF(A767=\"\",\"\",TODAY())","v":""}]
[]
[null,null,null,null,null,null,null,null,{"$f":"IF(A769=\"\",\"\",TODAY())","v":""}]
[]
[null,null,null,null,null,null,null,null,{"$f":"IF(A771=\"\",\"\",TODAY())","v":""}]
[]
[null,null,null,null,null,null,null,null,{"$f":"IF(A773=\"\",\"\",TODAY())","v":""}]
[]
[" * – характер работы, выполняемой лицом, подписавшим документ «Разработал», «Проверил», «Нормоконтроль», «Утвердил» (ГИП, ГАП) и т.д. "]
[]
[]
[]
["Информационно-удостоверяющий лист",null,null,{"$f":"IF(Лист1!L26=\"-УЛ\",\"\",Лист1!L26)","v":""},null,null,null,null,"Лист","Листов"]
[null,null,null,null,null,null,null,null,1,1]
[]
[]
[{"$f":"Лист1!$E$4","v":"Директор"},null,null,null,null,null,null,{"$f":"Лист1!$E$5","v":"И.И. Иванов"}]
[{"$f":"Лист1!$E$3","v":"ООО \"Рога и Копыта\""}]
[null,null,null,"ИНФОРМАЦИОННО-УДОСТОВЕРЯЮЩИЙ ЛИСТ"]
[]
[]
["№\nп/п","Обозначение документа",null,null,"Наименование изделия, вид документа",null,null,"Номер последнего изменения (версия)"]
[]
[1,{"$f":"IF(Лист1!K27=\"\",\"\",Лист1!K27)","v":""},null,null,{"$f":"IF(Данные!C27=\"\",\"\",Данные!C27)","v":"ЛСР 02"},null,null,1]
[]
[]
[]
["Алгоритм расчета контрольной суммы",null,null,{"$f":"Лист1!$E$6","v":"MD5"},{"$f":"IF(Лист1!M27=\"\",\"\",Лист1!M27)","v":""}]
[]
[]
[]
["Наименование файла",null,null,null,"Дата и время последнего изменения файла",null,null,"Размер файла (байт)"]
[]
[{"$f":"IF(Лист1!A27=\"\",\"\",Лист1!A27)","v":""},null,null,null,null,null,null,{"$f":"IF(Лист1!B27=\"\",\"\",Лист1!B27)","v":""}]
[]
[]
[]
["Характер работы",null,null,"ФИО",null,null,"Подпись",null,"Дата подписания"]
[]
[null,null,null,null,null,null,null,null,{"$f":"IF(A806=\"\",\"\",TODAY())","v":""}]
[]
[null,null,null,null,null,null,null,null,{"$f":"IF(A808=\"\",\"\",TODAY())","v":""}]
[]
[null,null,null,null,null,null,null,null,{"$f":"IF(A810=\"\",\"\",TODAY())","v":""}]
[]
[null,null,null,null,null,null,null,null,{"$f":"IF(A812=\"\",\"\",TODAY())","v":""}]
[]
[null,null,null,null,null,null,null,null,{"$f":"IF(A814=\"\",\"\",TODAY())","v":""}]
[]
[null,null,null,null,null,null,null,null,{"$f":"IF(A816=\"\",\"\",TODAY())","v":""}]
[]
[null,null,null,null,null,null,null,null,{"$f":"IF(A818=\"\",\"\",TODAY())","v":""}]
[]
[null,null,null,null,null,null,null,null,{"$f":"IF(A820=\"\",\"\",TODAY())","v":""}]
[]
[null,null,null,null,null,null,null,null,{"$f":"IF(A822=\"\",\"\",TODAY())","v":""}]
[]
[" * – характер работы, выполняемой лицом, подписавшим документ «Разработал», «Проверил», «Нормоконтроль», «Утвердил» (ГИП, ГАП) и т.д. "]
[]
[]
[]
["Информационно-удостоверяющий лист",null,null,{"$f":"IF(Лист1!L27=\"-УЛ\",\"\",Лист1!L27)","v":""},null,null,null,null,"Лист","Листов"]
[null,null,null,null,null,null,null,null,1,1]
[]
[]
[{"$f":"Лист1!$E$4","v":"Директор"},null,null,null,null,null,null,{"$f":"Лист1!$E$5","v":"И.И. Иванов"}]
[{"$f":"Лист1!$E$3","v":"ООО \"Рога и Копыта\""}]
[null,null,null,"ИНФОРМАЦИОННО-УДОСТОВЕРЯЮЩИЙ ЛИСТ"]
[]
[]
["№\nп/п","Обозначение документа",null,null,"Наименование изделия, вид документа",null,null,"Номер последнего изменения (версия)"]
[]
[1,{"$f":"IF(Лист1!K28=\"\",\"\",Лист1!K28)","v":""},null,null,{"$f":"IF(Данные!C28=\"\",\"\",Данные!C28)","v":"ССРСС"},null,null,1]
[]
[]
[]
["Алгоритм расчета контрольной суммы",null,null,{"$f":"Лист1!$E$6","v":"MD5"},{"$f":"IF(Лист1!M28=\"\",\"\",Лист1!M28)","v":""}]
[]
[]
[]
["Наименование файла",null,null,null,"Дата и время последнего изменения файла",null,null,"Размер файла (байт)"]
[]
[{"$f":"IF(Лист1!A28=\"\",\"\",Лист1!A28)","v":""},null,null,null,null,null,null,{"$f":"IF(Лист1!B28=\"\",\"\",Лист1!B28)","v":""}]
[]
[]
[]
["Характер работы",null,null,"ФИО",null,null,"Подпись",null,"Дата подписания"]
[]
[null,null,null,null,null,null,null,null,{"$f":"IF(A855=\"\",\"\",TODAY())","v":""}]
[]
[null,null,null,null,null,null,null,null,{"$f":"IF(A857=\"\",\"\",TODAY())","v":""}]
[]
[null,null,null,null,null,null,null,null,{"$f":"IF(A859=\"\",\"\",TODAY())","v":""}]
[]
[null,null,null,null,null,null,null,null,{"$f":"IF(A861=\"\",\"\",TODAY())","v":""}]
[]
[null,null,null,null,null,null,null,null,{"$f":"IF(A863=\"\",\"\",TODAY())","v":""}]
[]
[null,null,null,null,null,null,null,null,{"$f":"IF(A865=\"\",\"\",TODAY())","v":""}]
[]
[null,null,null,null,null,null,null,null,{"$f":"IF(A867=\"\",\"\",TODAY())","v":""}]
[]
[null,null,null,null,null,null,null,null,{"$f":"IF(A869=\"\",\"\",TODAY())","v":""}]
[]
[null,null,null,null,null,null,null,null,{"$f":"IF(A871=\"\",\"\",TODAY())","v":""}]
[]
[" * – характер работы, выполняемой лицом, подписавшим документ «Разработал», «Проверил», «Нормоконтроль», «Утвердил» (ГИП, ГАП) и т.д. "]
[]
[]
[]
["Информационно-удостоверяющий лист",null,null,{"$f":"IF(Лист1!L28=\"-УЛ\",\"\",Лист1!L28)","v":""},null,null,null,null,"Лист","Листов"]
[null,null,null,null,null,null,null,null,1,1]
[]
[]
[{"$f":"Лист1!$E$4","v":"Директор"},null,null,null,null,null,null,{"$f":"Лист1!$E$5","v":"И.И. Иванов"}]
[{"$f":"Лист1!$E$3","v":"ООО \"Рога и Копыта\""}]
[null,null,null,"ИНФОРМАЦИОННО-УДОСТОВЕРЯЮЩИЙ ЛИСТ"]
[]
[]
["№\nп/п","Обозначение документа",null,null,"Наименование изделия, вид документа",null,null,"Номер последнего изменения (версия)"]
[]
[1,{"$f":"IF(Лист1!K29=\"\",\"\",Лист1!K29)","v":""},null,null,{"$f":"IF(Данные!C29=\"\",\"\",Данные!C29)","v":"ССРСС"},null,null,1]
[]
[]
[]
["Алгоритм расчета контрольной суммы",null,null,{"$f":"Лист1!$E$6","v":"MD5"},{"$f":"IF(Лист1!M29=\"\",\"\",Лист1!M29)","v":""}]
[]
[]
[]
["Наименование файла",null,null,null,"Дата и время последнего изменения файла",null,null,"Размер файла (байт)"]
[]
[{"$f":"IF(Лист1!A29=\"\",\"\",Лист1!A29)","v":""},null,null,null,null,null,null,{"$f":"IF(Лист1!B29=\"\",\"\",Лист1!B29)","v":""}]
[]
[]
[]
["Характер работы",null,null,"ФИО",null,null,"Подпись",null,"Дата подписания"]
[]
[null,null,null,null,null,null,null,null,{"$f":"IF(A904=\"\",\"\",TODAY())","v":""}]
[]
[null,null,null,null,null,null,null,null,{"$f":"IF(A906=\"\",\"\",TODAY())","v":""}]
[]
[null,null,null,null,null,null,null,null,{"$f":"IF(A908=\"\",\"\",TODAY())","v":""}]
[]
[null,null,null,null,null,null,null,null,{"$f":"IF(A910=\"\",\"\",TODAY())","v":""}]
[]
[null,null,null,null,null,null,null,null,{"$f":"IF(A912=\"\",\"\",TODAY())","v":""}]
[]
[null,null,null,null,null,null,null,null,{"$f":"IF(A914=\"\",\"\",TODAY())","v":""}]
[]
[null,null,null,null,null,null,null,null,{"$f":"IF(A916=\"\",\"\",TODAY())","v":""}]
[]
[null,null,null,null,null,null,null,null,{"$f":"IF(A918=\"\",\"\",TODAY())","v":""}]
[]
[null,null,null,null,null,null,null,null,{"$f":"IF(A920=\"\",\"\",TODAY())","v":""}]
[]
[" * – характер работы, выполняемой лицом, подписавшим документ «Разработал», «Проверил», «Нормоконтроль», «Утвердил» (ГИП, ГАП) и т.д. "]
[]
[]
[]
["Информационно-удостоверяющий лист",null,null,{"$f":"IF(Лист1!L29=\"-УЛ\",\"\",Лист1!L29)","v":""},null,null,null,null,"Лист","Листов"]
[null,null,null,null,null,null,null,null,1,1]
[]
[]
[{"$f":"Лист1!$E$4","v":"Директор"},null,null,null,null,null,null,{"$f":"Лист1!$E$5","v":"И.И. Иванов"}]
[{"$f":"Лист1!$E$3","v":"ООО \"Рога и Копыта\""}]
[null,null,null,"ИНФОРМАЦИОННО-УДОСТОВЕРЯЮЩИЙ ЛИСТ"]
[]
[]
["№\nп/п","Обозначение документа",null,null,"Наименование изделия, вид документа",null,null,"Номер последнего изменения (версия)"]
[]
[1,{"$f":"IF(Лист1!K30=\"\",\"\",Лист1!K30)","v":""},null,null,{"$f":"IF(Данные!C30=\"\",\"\",Данные!C30)","v":"ССРСС"},null,null,1]
[]
[]
[]
["Алгоритм расчета контрольной суммы",null,null,{"$f":"Лист1!$E$6","v":"MD5"},{"$f":"IF(Лист1!M30=\"\",\"\",Лист1!M30)","v":""}]
[]
[]
[]
["Наименование файла",null,null,null,"Дата и время последнего изменения файла",null,null,"Размер файла (байт)"]
[]
[{"$f":"IF(Лист1!A30=\"\",\"\",Лист1!A30)","v":""},null,null,null,null,null,null,{"$f":"IF(Лист1!B30=\"\",\"\",Лист1!B30)","v":""}]
[]
[]
[]
["Характер работы",null,null,"ФИО",null,null,"Подпись",null,"Дата подписания"]
[]
[null,null,null,null,null,null,null,null,{"$f":"IF(A953=\"\",\"\",TODAY())","v":""}]
[]
[null,null,null,null,null,null,null,null,{"$f":"IF(A955=\"\",\"\",TODAY())","v":""}]
[]
[null,null,null,null,null,null,null,null,{"$f":"IF(A957=\"\",\"\",TODAY())","v":""}]
[]
[null,null,null,null,null,null,null,null,{"$f":"IF(A959=\"\",\"\",TODAY())","v":""}]
[]
[null,null,null,null,null,null,null,null,{"$f":"IF(A961=\"\",\"\",TODAY())","v":""}]
[]
[null,null,null,null,null,null,null,null,{"$f":"IF(A963=\"\",\"\",TODAY())","v":""}]
[]
[null,null,null,null,null,null,null,null,{"$f":"IF(A965=\"\",\"\",TODAY())","v":""}]
[]
[null,null,null,null,null,null,null,null,{"$f":"IF(A967=\"\",\"\",TODAY())","v":""}]
[]
[null,null,null,null,null,null,null,null,{"$f":"IF(A969=\"\",\"\",TODAY())","v":""}]
[]
[" * – характер работы, выполняемой лицом, подписавшим документ «Разработал», «Проверил», «Нормоконтроль», «Утвердил» (ГИП, ГАП) и т.д. "]
[]
[]
[]
["Информационно-удостоверяющий лист",null,null,{"$f":"IF(Лист1!L30=\"-УЛ\",\"\",Лист1!L30)","v":""},null,null,null,null,"Лист","Листов"]
[null,null,null,null,null,null,null,null,1,1]
[]
[]
[{"$f":"Лист1!$E$4","v":"Директор"},null,null,null,null,null,null,{"$f":"Лист1!$E$5","v":"И.И. Иванов"}]
[{"$f":"Лист1!$E$3","v":"ООО \"Рога и Копыта\""}]