{"text_format":"1","workbook":"xlsx","n_sheets":9,"sheets":["обработано","как хочу","Статусы","Список оборудования","КПУ EBS","ДП","ТРП","ТРПШ","ТРПП"],"not_rendered":{"charts":0,"images":0,"macros":0,"external_links":0,"defined_names":1,"comments":0,"pivot_tables":0},"unopened":[],"bounds":{"document_bytes":16777216,"sheet_cells":100000,"rows_first":2000,"rows_last":500,"rows_between":2000,"halvings":0,"cell_chars":16384,"cell_head_chars":4096},"cells_cut":0,"cells_raw":0,"read":"whole","date_system":"1900"}

{"sheet":"обработано","index":0,"n_rows":37,"n_cols":7,"rows_kept":37,"cut":false,"hidden":false,"merged":[]}
[]
[]
["Шифр детали или СБ","Наименование детали или СБ","Количество ДСЕ в спецификации","Количество ДСЕ к запуску, расчетное","Остаток ДСЕ на складе","Статус запуска ДСЕ","Количество запущенных в производство ДСЕ"]
[{"$f":"IFERROR(INDEX(ТаблВспомогалка12[Шифр детали или СБ],MATCH(ROW(A1),ТаблВспомогалка12[0],)),\"\")","v":"EBС.01.000"},{"$f":"IFERROR(VLOOKUP(A4,ТаблВспомогалка12[[Шифр детали или СБ]:[Наименование детали или СБ]],2,),\"\")","v":"Кронштейн пушки"},{"$f":"IF(A4<>\"\",SUMIF(ТаблВспомогалка12[Шифр детали или СБ],A4,ТаблВспомогалка12[Количество ДСЕ в спецификации]),\"\")","v":2},{"$f":"IF(A4<>\"\",SUMIF(ТаблВспомогалка12[Шифр детали или СБ],A4,ТаблВспомогалка12[Количество ДСЕ к запуску, расчетное]),\"\")","v":17}]
[{"$f":"IFERROR(INDEX(ТаблВспомогалка12[Шифр детали или СБ],MATCH(ROW(A2),ТаблВспомогалка12[0],)),\"\")","v":"ЕВС.01.001"},{"$f":"IFERROR(VLOOKUP(A5,ТаблВспомогалка12[[Шифр детали или СБ]:[Наименование детали или СБ]],2,),\"\")","v":"Скоба"},{"$f":"IF(A5<>\"\",SUMIF(ТаблВспомогалка12[Шифр детали или СБ],A5,ТаблВспомогалка12[Количество ДСЕ в спецификации]),\"\")","v":1},{"$f":"IF(A5<>\"\",SUMIF(ТаблВспомогалка12[Шифр детали или СБ],A5,ТаблВспомогалка12[Количество ДСЕ к запуску, расчетное]),\"\")","v":15}]
[{"$f":"IFERROR(INDEX(ТаблВспомогалка12[Шифр детали или СБ],MATCH(ROW(A3),ТаблВспомогалка12[0],)),\"\")","v":"EBС.00.001"},{"$f":"IFERROR(VLOOKUP(A6,ТаблВспомогалка12[[Шифр детали или СБ]:[Наименование детали или СБ]],2,),\"\")","v":"Кронштейн"},{"$f":"IF(A6<>\"\",SUMIF(ТаблВспомогалка12[Шифр детали или СБ],A6,ТаблВспомогалка12[Количество ДСЕ в спецификации]),\"\")","v":1},{"$f":"IF(A6<>\"\",SUMIF(ТаблВспомогалка12[Шифр детали или СБ],A6,ТаблВспомогалка12[Количество ДСЕ к запуску, расчетное]),\"\")","v":15}]
[{"$f":"IFERROR(INDEX(ТаблВспомогалка12[Шифр детали или СБ],MATCH(ROW(A4),ТаблВспомогалка12[0],)),\"\")","v":"EBС.00.004"},{"$f":"IFERROR(VLOOKUP(A7,ТаблВспомогалка12[[Шифр детали или СБ]:[Наименование детали или СБ]],2,),\"\")","v":"Грибок"},{"$f":"IF(A7<>\"\",SUMIF(ТаблВспомогалка12[Шифр детали или СБ],A7,ТаблВспомогалка12[Количество ДСЕ в спецификации]),\"\")","v":3},{"$f":"IF(A7<>\"\",SUMIF(ТаблВспомогалка12[Шифр детали или СБ],A7,ТаблВспомогалка12[Количество ДСЕ к запуску, расчетное]),\"\")","v":45}]
[{"$f":"IFERROR(INDEX(ТаблВспомогалка12[Шифр детали или СБ],MATCH(ROW(A5),ТаблВспомогалка12[0],)),\"\")","v":"EBС.00.005"},{"$f":"IFERROR(VLOOKUP(A8,ТаблВспомогалка12[[Шифр детали или СБ]:[Наименование детали или СБ]],2,),\"\")","v":"Полка"},{"$f":"IF(A8<>\"\",SUMIF(ТаблВспомогалка12[Шифр детали или СБ],A8,ТаблВспомогалка12[Количество ДСЕ в спецификации]),\"\")","v":1},{"$f":"IF(A8<>\"\",SUMIF(ТаблВспомогалка12[Шифр детали или СБ],A8,ТаблВспомогалка12[Количество ДСЕ к запуску, расчетное]),\"\")","v":15}]
[{"$f":"IFERROR(INDEX(ТаблВспомогалка12[Шифр детали или СБ],MATCH(ROW(A6),ТаблВспомогалка12[0],)),\"\")","v":"EBС.00.006"},{"$f":"IFERROR(VLOOKUP(A9,ТаблВспомогалка12[[Шифр детали или СБ]:[Наименование детали или СБ]],2,),\"\")","v":"Держатель"},{"$f":"IF(A9<>\"\",SUMIF(ТаблВспомогалка12[Шифр детали или СБ],A9,ТаблВспомогалка12[Количество ДСЕ в спецификации]),\"\")","v":2},{"$f":"IF(A9<>\"\",SUMIF(ТаблВспомогалка12[Шифр детали или СБ],A9,ТаблВспомогалка12[Количество ДСЕ к запуску, расчетное]),\"\")","v":30}]
[{"$f":"IFERROR(INDEX(ТаблВспомогалка12[Шифр детали или СБ],MATCH(ROW(A7),ТаблВспомогалка12[0],)),\"\")","v":"ЕБС.00.007"},{"$f":"IFERROR(VLOOKUP(A10,ТаблВспомогалка12[[Шифр детали или СБ]:[Наименование детали или СБ]],2,),\"\")","v":"Пластина"},{"$f":"IF(A10<>\"\",SUMIF(ТаблВспомогалка12[Шифр детали или СБ],A10,ТаблВспомогалка12[Количество ДСЕ в спецификации]),\"\")","v":2},{"$f":"IF(A10<>\"\",SUMIF(ТаблВспомогалка12[Шифр детали или СБ],A10,ТаблВспомогалка12[Количество ДСЕ к запуску, расчетное]),\"\")","v":30}]
[{"$f":"IFERROR(INDEX(ТаблВспомогалка12[Шифр детали или СБ],MATCH(ROW(A8),ТаблВспомогалка12[0],)),\"\")","v":"ЕВС.01.002"},{"$f":"IFERROR(VLOOKUP(A11,ТаблВспомогалка12[[Шифр детали или СБ]:[Наименование детали или СБ]],2,),\"\")","v":"Трубка 16х1.5 08X18H10 L=800"},{"$f":"IF(A11<>\"\",SUMIF(ТаблВспомогалка12[Шифр детали или СБ],A11,ТаблВспомогалка12[Количество ДСЕ в спецификации]),\"\")","v":1},{"$f":"IF(A11<>\"\",SUMIF(ТаблВспомогалка12[Шифр детали или СБ],A11,ТаблВспомогалка12[Количество ДСЕ к запуску, расчетное]),\"\")","v":15}]
[{"$f":"IFERROR(INDEX(ТаблВспомогалка12[Шифр детали или СБ],MATCH(ROW(A9),ТаблВспомогалка12[0],)),\"\")","v":"EBС.00.002"},{"$f":"IFERROR(VLOOKUP(A12,ТаблВспомогалка12[[Шифр детали или СБ]:[Наименование детали или СБ]],2,),\"\")","v":"Труба 48.3х1.5 08X18H10 L=780"},{"$f":"IF(A12<>\"\",SUMIF(ТаблВспомогалка12[Шифр детали или СБ],A12,ТаблВспомогалка12[Количество ДСЕ в спецификации]),\"\")","v":2},{"$f":"IF(A12<>\"\",SUMIF(ТаблВспомогалка12[Шифр детали или СБ],A12,ТаблВспомогалка12[Количество ДСЕ к запуску, расчетное]),\"\")","v":30}]
[{"$f":"IFERROR(INDEX(ТаблВспомогалка12[Шифр детали или СБ],MATCH(ROW(A10),ТаблВспомогалка12[0],)),\"\")","v":"EBС.00.003"},{"$f":"IFERROR(VLOOKUP(A13,ТаблВспомогалка12[[Шифр детали или СБ]:[Наименование детали или СБ]],2,),\"\")","v":"Труба 42.4х1.5 08X18H10 L=315"},{"$f":"IF(A13<>\"\",SUMIF(ТаблВспомогалка12[Шифр детали или СБ],A13,ТаблВспомогалка12[Количество ДСЕ в спецификации]),\"\")","v":2},{"$f":"IF(A13<>\"\",SUMIF(ТаблВспомогалка12[Шифр детали или СБ],A13,ТаблВспомогалка12[Количество ДСЕ к запуску, расчетное]),\"\")","v":17}]
[{"$f":"IFERROR(INDEX(ТаблВспомогалка12[Шифр детали или СБ],MATCH(ROW(A11),ТаблВспомогалка12[0],)),\"\")","v":"ДП1"},{"$f":"IFERROR(VLOOKUP(A14,ТаблВспомогалка12[[Шифр детали или СБ]:[Наименование детали или СБ]],2,),\"\")","v":"Кронштейн пушки"},{"$f":"IF(A14<>\"\",SUMIF(ТаблВспомогалка12[Шифр детали или СБ],A14,ТаблВспомогалка12[Количество ДСЕ в спецификации]),\"\")","v":1},{"$f":"IF(A14<>\"\",SUMIF(ТаблВспомогалка12[Шифр детали или СБ],A14,ТаблВспомогалка12[Количество ДСЕ к запуску, расчетное]),\"\")","v":2}]
[{"$f":"IFERROR(INDEX(ТаблВспомогалка12[Шифр детали или СБ],MATCH(ROW(A12),ТаблВспомогалка12[0],)),\"\")","v":"ДП2"},{"$f":"IFERROR(VLOOKUP(A15,ТаблВспомогалка12[[Шифр детали или СБ]:[Наименование детали или СБ]],2,),\"\")","v":"Скоба"},{"$f":"IF(A15<>\"\",SUMIF(ТаблВспомогалка12[Шифр детали или СБ],A15,ТаблВспомогалка12[Количество ДСЕ в спецификации]),\"\")","v":1},{"$f":"IF(A15<>\"\",SUMIF(ТаблВспомогалка12[Шифр детали или СБ],A15,ТаблВспомогалка12[Количество ДСЕ к запуску, расчетное]),\"\")","v":2}]
[{"$f":"IFERROR(INDEX(ТаблВспомогалка12[Шифр детали или СБ],MATCH(ROW(A13),ТаблВспомогалка12[0],)),\"\")","v":"ДП3"},{"$f":"IFERROR(VLOOKUP(A16,ТаблВспомогалка12[[Шифр детали или СБ]:[Наименование детали или СБ]],2,),\"\")","v":"Кронштейн"},{"$f":"IF(A16<>\"\",SUMIF(ТаблВспомогалка12[Шифр детали или СБ],A16,ТаблВспомогалка12[Количество ДСЕ в спецификации]),\"\")","v":1},{"$f":"IF(A16<>\"\",SUMIF(ТаблВспомогалка12[Шифр детали или СБ],A16,ТаблВспомогалка12[Количество ДСЕ к запуску, расчетное]),\"\")","v":2}]
[{"$f":"IFERROR(INDEX(ТаблВспомогалка12[Шифр детали или СБ],MATCH(ROW(A14),ТаблВспомогалка12[0],)),\"\")","v":"ДП4"},{"$f":"IFERROR(VLOOKUP(A17,ТаблВспомогалка12[[Шифр детали или СБ]:[Наименование детали или СБ]],2,),\"\")","v":"Грибок"},{"$f":"IF(A17<>\"\",SUMIF(ТаблВспомогалка12[Шифр детали или СБ],A17,ТаблВспомогалка12[Количество ДСЕ в спецификации]),\"\")","v":3},{"$f":"IF(A17<>\"\",SUMIF(ТаблВспомогалка12[Шифр детали или СБ],A17,ТаблВспомогалка12[Количество ДСЕ к запуску, расчетное]),\"\")","v":6}]
[{"$f":"IFERROR(INDEX(ТаблВспомогалка12[Шифр детали или СБ],MATCH(ROW(A15),ТаблВспомогалка12[0],)),\"\")","v":"ДП5"},{"$f":"IFERROR(VLOOKUP(A18,ТаблВспомогалка12[[Шифр детали или СБ]:[Наименование детали или СБ]],2,),\"\")","v":"Полка"},{"$f":"IF(A18<>\"\",SUMIF(ТаблВспомогалка12[Шифр детали или СБ],A18,ТаблВспомогалка12[Количество ДСЕ в спецификации]),\"\")","v":1},{"$f":"IF(A18<>\"\",SUMIF(ТаблВспомогалка12[Шифр детали или СБ],A18,ТаблВспомогалка12[Количество ДСЕ к запуску, расчетное]),\"\")","v":2}]
[{"$f":"IFERROR(INDEX(ТаблВспомогалка12[Шифр детали или СБ],MATCH(ROW(A16),ТаблВспомогалка12[0],)),\"\")","v":"ДП6"},{"$f":"IFERROR(VLOOKUP(A19,ТаблВспомогалка12[[Шифр детали или СБ]:[Наименование детали или СБ]],2,),\"\")","v":"Держатель"},{"$f":"IF(A19<>\"\",SUMIF(ТаблВспомогалка12[Шифр детали или СБ],A19,ТаблВспомогалка12[Количество ДСЕ в спецификации]),\"\")","v":2},{"$f":"IF(A19<>\"\",SUMIF(ТаблВспомогалка12[Шифр детали или СБ],A19,ТаблВспомогалка12[Количество ДСЕ к запуску, расчетное]),\"\")","v":4}]
[{"$f":"IFERROR(INDEX(ТаблВспомогалка12[Шифр детали или СБ],MATCH(ROW(A17),ТаблВспомогалка12[0],)),\"\")","v":"ДП7"},{"$f":"IFERROR(VLOOKUP(A20,ТаблВспомогалка12[[Шифр детали или СБ]:[Наименование детали или СБ]],2,),\"\")","v":"Пластина"},{"$f":"IF(A20<>\"\",SUMIF(ТаблВспомогалка12[Шифр детали или СБ],A20,ТаблВспомогалка12[Количество ДСЕ в спецификации]),\"\")","v":2},{"$f":"IF(A20<>\"\",SUMIF(ТаблВспомогалка12[Шифр детали или СБ],A20,ТаблВспомогалка12[Количество ДСЕ к запуску, расчетное]),\"\")","v":4}]
{"$rows_left_out":18}
{"sheet":"как хочу","index":1,"n_rows":84,"n_cols":8,"rows_kept":84,"cut":false,"hidden":false,"merged":[]}
["Оборудование, шифр","Количество оборудования к запуску","Текущая дата","Столбец1","Для расчета",null,{"$f":"SUM(таблПоиск11[Столбец1])","v":30}]
["КПУ EBS",15,null,{"$f":"IF(таблПоиск11[[#This Row],[Оборудование, шифр]]=\"\",\"\",COUNTA(INDIRECT(\"'\"&таблПоиск11[[#This Row],[Оборудование, шифр]]&\"'!A:A\"))-1)","v":10},{"$f":"IF(таблПоиск11[[#This Row],[Оборудование, шифр]]=\"\",\"\",SUM($D$1:D1)+1)","v":1}]
["ДП",2,null,{"$f":"IF(таблПоиск11[[#This Row],[Оборудование, шифр]]=\"\",\"\",COUNTA(INDIRECT(\"'\"&таблПоиск11[[#This Row],[Оборудование, шифр]]&\"'!A:A\"))-1)","v":10},{"$f":"IF(таблПоиск11[[#This Row],[Оборудование, шифр]]=\"\",\"\",SUM($D$1:D2)+1)","v":11}]
["трп",2,null,{"$f":"IF(таблПоиск11[[#This Row],[Оборудование, шифр]]=\"\",\"\",COUNTA(INDIRECT(\"'\"&таблПоиск11[[#This Row],[Оборудование, шифр]]&\"'!A:A\"))-1)","v":10},{"$f":"IF(таблПоиск11[[#This Row],[Оборудование, шифр]]=\"\",\"\",SUM($D$1:D3)+1)","v":21}]
[null,null,null,{"$f":"IF(таблПоиск11[[#This Row],[Оборудование, шифр]]=\"\",\"\",COUNTA(INDIRECT(\"'\"&таблПоиск11[[#This Row],[Оборудование, шифр]]&\"'!A:A\"))-1)","v":""},{"$f":"IF(таблПоиск11[[#This Row],[Оборудование, шифр]]=\"\",\"\",SUM($D$1:D4)+1)","v":""}]
[null,null,null,{"$f":"IF(таблПоиск11[[#This Row],[Оборудование, шифр]]=\"\",\"\",COUNTA(INDIRECT(\"'\"&таблПоиск11[[#This Row],[Оборудование, шифр]]&\"'!A:A\"))-1)","v":""},{"$f":"IF(таблПоиск11[[#This Row],[Оборудование, шифр]]=\"\",\"\",SUM($D$1:D5)+1)","v":""}]
[null,null,null,{"$f":"IF(таблПоиск11[[#This Row],[Оборудование, шифр]]=\"\",\"\",COUNTA(INDIRECT(\"'\"&таблПоиск11[[#This Row],[Оборудование, шифр]]&\"'!A:A\"))-1)","v":""},{"$f":"IF(таблПоиск11[[#This Row],[Оборудование, шифр]]=\"\",\"\",SUM($D$1:D6)+1)","v":""}]
[null,null,null,{"$f":"IF(таблПоиск11[[#This Row],[Оборудование, шифр]]=\"\",\"\",COUNTA(INDIRECT(\"'\"&таблПоиск11[[#This Row],[Оборудование, шифр]]&\"'!A:A\"))-1)","v":""},{"$f":"IF(таблПоиск11[[#This Row],[Оборудование, шифр]]=\"\",\"\",SUM($D$1:D7)+1)","v":""}]
[null,null,null,{"$f":"IF(таблПоиск11[[#This Row],[Оборудование, шифр]]=\"\",\"\",COUNTA(INDIRECT(\"'\"&таблПоиск11[[#This Row],[Оборудование, шифр]]&\"'!A:A\"))-1)","v":""},{"$f":"IF(таблПоиск11[[#This Row],[Оборудование, шифр]]=\"\",\"\",SUM($D$1:D8)+1)","v":""}]
[null,null,null,{"$f":"IF(таблПоиск11[[#This Row],[Оборудование, шифр]]=\"\",\"\",COUNTA(INDIRECT(\"'\"&таблПоиск11[[#This Row],[Оборудование, шифр]]&\"'!A:A\"))-1)","v":""},{"$f":"IF(таблПоиск11[[#This Row],[Оборудование, шифр]]=\"\",\"\",SUM($D$1:D9)+1)","v":""}]
[null,null,null,{"$f":"IF(таблПоиск11[[#This Row],[Оборудование, шифр]]=\"\",\"\",COUNTA(INDIRECT(\"'\"&таблПоиск11[[#This Row],[Оборудование, шифр]]&\"'!A:A\"))-1)","v":""},{"$f":"IF(таблПоиск11[[#This Row],[Оборудование, шифр]]=\"\",\"\",SUM($D$1:D10)+1)","v":""}]
[]
[]
[]
[]
[]
[]
[]
["Шифр детали или СБ","Наименование детали или СБ","Количество ДСЕ в спецификации","Количество ДСЕ к запуску, расчетное","Остаток ДСЕ на складе","Статус запуска ДСЕ","Количество запущенных в производство ДСЕ","0"]
[{"$f":"IF(ROW(A1)>$G$1,\"\",INDIRECT(\"'\"&INDEX(таблПоиск11[Оборудование, шифр],MATCH(ROW(A1),таблПоиск11[Для расчета]))&\"'!\"&ADDRESS(ROW(A1)-INDEX(таблПоиск11[Для расчета],MATCH(ROW(A1),таблПоиск11[Для расчета]))+3,COLUMN())))","v":"EBС.01.000"},{"$f":"IF(ROW(A1)>$G$1,\"\",INDIRECT(\"'\"&INDEX(таблПоиск11[Оборудование, шифр],MATCH(ROW(A1),таблПоиск11[Для расчета]))&\"'!\"&ADDRESS(ROW(A1)-INDEX(таблПоиск11[Для расчета],MATCH(ROW(A1),таблПоиск11[Для расчета]))+3,COLUMN())))","v":"Кронштейн пушки"},{"$f":"IF(ROW(C1)>$G$1,\"\",INDIRECT(\"'\"&INDEX(таблПоиск11[Оборудование, шифр],MATCH(ROW(C1),таблПоиск11[Для расчета]))&\"'!\"&ADDRESS(ROW(C1)-INDEX(таблПоиск11[Для расчета],MATCH(ROW(C1),таблПоиск11[Для расчета]))+3,COLUMN())))","v":1},{"$f":"IF(ROW(A1)>$G$1,\"\",ТаблВспомогалка12[[#This Row],[Количество ДСЕ в спецификации]]*INDEX(таблПоиск11[Количество оборудования к запуску],MATCH(ROW(A1),таблПоиск11[Для расчета])))","v":15},null,null,null,{"$f":"IF(MATCH(ТаблВспомогалка12[[#This Row],[Шифр детали или СБ]],A$20:A20,)=ROW(H1),H19+1,H19)","v":1}]
{"$rows_left_out":65}
{"sheet":"Статусы","index":2,"n_rows":9,"n_cols":1,"rows_kept":9,"cut":false,"hidden":true,"merged":[]}
["Статусы"]
["На запуске в КБ"]
["На запуске МУ"]
["Изготовление на МУ"]
["Сдано на склад ДСЕ"]
["На участке сборки"]
["Установка электрики и автоматики"]
["Испытания"]
["Упаковано"]

{"sheet":"Список оборудования","index":3,"n_rows":46,"n_cols":2,"rows_kept":46,"cut":false,"hidden":true,"merged":[]}
["Список шифров оборудовния","Список названий оборудовния"]
[]
[]
[{"$f":"IFERROR(INDEX(Оглавление,ROW()),\"\")","v":"КПУ EBS"},"Длинная печь(разогрев преформы)"]
[{"$f":"IFERROR(INDEX(Оглавление,ROW()),\"\")","v":"ДП"},"Автомат выдува"]
[{"$f":"IFERROR(INDEX(Оглавление,ROW()),\"\")","v":"ТРП"},"Автоматический группиратор бутылок"]
[{"$f":"IFERROR(INDEX(Оглавление,ROW()),\"\")","v":"ТРПШ"},"Автоматический группиратор бутылок"]
[{"$f":"IFERROR(INDEX(Оглавление,ROW()),\"\")","v":"ТРПП"},"Автоматический группиратор бутылок"]
[{"$f":"IFERROR(INDEX(Оглавление,ROW()),\"\")","v":""}]
[{"$f":"IFERROR(INDEX(Оглавление,ROW()),\"\")","v":""}]
[{"$f":"IFERROR(INDEX(Оглавление,ROW()),\"\")","v":""}]
[{"$f":"IFERROR(INDEX(Оглавление,ROW()),\"\")","v":""}]
[{"$f":"IFERROR(INDEX(Оглавление,ROW()),\"\")","v":""}]
[{"$f":"IFERROR(INDEX(Оглавление,ROW()),\"\")","v":""}]
[{"$f":"IFERROR(INDEX(Оглавление,ROW()),\"\")","v":""}]
[{"$f":"IFERROR(INDEX(Оглавление,ROW()),\"\")","v":""}]
[{"$f":"IFERROR(INDEX(Оглавление,ROW()),\"\")","v":""}]
[{"$f":"IFERROR(INDEX(Оглавление,ROW()),\"\")","v":""}]
[{"$f":"IFERROR(INDEX(Оглавление,ROW()),\"\")","v":""}]
[{"$f":"IFERROR(INDEX(Оглавление,ROW()),\"\")","v":""}]
{"$rows_left_out":27}
{"sheet":"КПУ EBS","index":4,"n_rows":12,"n_cols":25,"rows_kept":12,"cut":false,"hidden":false,"merged":[]}
["Шифр детали или СБ","Наименование детали или СБ","количество","Порядок запуска","Вырубка","Ленточнопильный","Гидрообразив","Лазер","Токарный","Токарный с ЧПУ","Фрезерный","Фрезерный с ЧПУ","Общее время","Расточка","Портальный фрезерный","Сварка","Шлифовальный","Зачистка","ОТК","Получение со склада","Сборка","Гибка","Упаковка, час","Сверловка","Резьба"]
[]
["EBС.01.000","Кронштейн пушки",1,null,null,null,null,null,null,null,null,null,null,null,null,null,null,null,null,null,null,null,12]
["ЕВС.01.001","Скоба",1]
["EBС.00.001","Кронштейн",1]
["EBС.00.004","Грибок",3,null,null,null,null,null,0.17,null,0.02,null,0.2,null,null,null,null,null,null,null,null,null,null,0.1,0.1]
["EBС.00.005","Полка",1]
["EBС.00.006","Держатель",2,null,null,0.05,null,null,0.25,null,0.4,null,1.1000000000000001,0.25,null,null,null,null,null,null,null,null,null,0.2,0.2]
["ЕБС.00.007","Пластина",2]
["ЕВС.01.002","Трубка 16х1.5 08X18H10 L=800",1]
["EBС.00.002","Труба 48.3х1.5 08X18H10 L=780",2]
["EBС.00.003","Труба 42.4х1.5 08X18H10 L=315",1]

{"sheet":"ДП","index":5,"n_rows":12,"n_cols":25,"rows_kept":12,"cut":false,"hidden":false,"merged":[]}
["Шифр детали или СБ","Наименование детали или СБ","количество","Порядок запуска","Вырубка","Ленточнопильный","Гидрообразив","Лазер","Токарный","Токарный с ЧПУ","Фрезерный","Фрезерный с ЧПУ","Общее время","Расточка","Портальный фрезерный","Сварка","Шлифовальный","Зачистка","ОТК","Получение со склада","Сборка","Гибка","Упаковка, час","Сверловка","Резьба"]
[]
["ДП1","Кронштейн пушки",1,null,null,null,null,null,null,null,null,null,null,null,null,null,null,null,null,null,null,null,12]
["ДП2","Скоба",1]
["ДП3","Кронштейн",1]
["ДП4","Грибок",3,null,null,null,null,null,0.17,null,0.02,null,0.2,null,null,null,null,null,null,null,null,null,null,0.1,0.1]
["ДП5","Полка",1]
["ДП6","Держатель",2,null,null,0.05,null,null,0.25,null,0.4,null,1.1000000000000001,0.25,null,null,null,null,null,null,null,null,null,0.2,0.2]
["ДП7","Пластина",2]
["ДП8","Трубка 16х1.5 08X18H10 L=800",1]
["ДП9","Труба 48.3х1.5 08X18H10 L=780",2]
["EBС.00.003","Труба 42.4х1.5 08X18H10 L=315",1]

{"sheet":"ТРП","index":6,"n_rows":12,"n_cols":25,"rows_kept":12,"cut":false,"hidden":false,"merged":[]}
["Шифр детали или СБ","Наименование детали или СБ","количество","Порядок запуска","Вырубка","Ленточнопильный","Гидрообразив","Лазер","Токарный","Токарный с ЧПУ","Фрезерный","Фрезерный с ЧПУ","Общее время","Расточка","Портальный фрезерный","Сварка","Шлифовальный","Зачистка","ОТК","Получение со склада","Сборка","Гибка","Упаковка, час","Сверловка","Резьба"]
[]
["EBС.01.000","Кронштейн пушки",1,null,null,null,null,null,null,null,null,null,null,null,null,null,null,null,null,null,null,null,12]
["ТРП1","Скоба",1]
["ТРП2","Кронштейн",1]
["ТРП3","Грибок",3,null,null,null,null,null,0.17,null,0.02,null,0.2,null,null,null,null,null,null,null,null,null,null,0.1,0.1]
["ТРП4","Полка",1]
["ТРП5","Держатель",2,null,null,0.05,null,null,0.25,null,0.4,null,1.1000000000000001,0.25,null,null,null,null,null,null,null,null,null,0.2,0.2]
["ТРП6","Пластина",2]
["ТРП7","Трубка 16х1.5 08X18H10 L=800",1]
["ТРП8","Труба 48.3х1.5 08X18H10 L=780",2]
["ТРП9","Труба 42.4х1.5 08X18H10 L=315",1]

{"sheet":"ТРПШ","index":7,"n_rows":12,"n_cols":25,"rows_kept":12,"cut":false,"hidden":false,"merged":[]}
["Шифр детали или СБ","Наименование детали или СБ","количество","Порядок запуска","Вырубка","Ленточнопильный","Гидрообразив","Лазер","Токарный","Токарный с ЧПУ","Фрезерный","Фрезерный с ЧПУ","Общее время","Расточка","Портальный фрезерный","Сварка","Шлифовальный","Зачистка","ОТК","Получение со склада","Сборка","Гибка","Упаковка, час","Сверловка","Резьба"]
[]
["ДП1","Кронштейн пушки",1,null,null,null,null,null,null,null,null,null,null,null,null,null,null,null,null,null,null,null,12]
["ТРПШ1","Скоба",1]
["ТРПШ2","Кронштейн",1]
["ТРПШ3","Грибок",3,null,null,null,null,null,0.17,null,0.02,null,0.2,null,null,null,null,null,null,null,null,null,null,0.1,0.1]
["ТРПШ4","Полка",1]
["ТРПШ5","Держатель",2,null,null,0.05,null,null,0.25,null,0.4,null,1.1000000000000001,0.25,null,null,null,null,null,null,null,null,null,0.2,0.2]
["ТРПШ6","Пластина",2]
["ТРПШ7","Трубка 16х1.5 08X18H10 L=800",1]
["ТРПШ8","Труба 48.3х1.5 08X18H10 L=780",2]
["ТРП8","Труба 42.4х1.5 08X18H10 L=315",1]

{"sheet":"ТРПП","index":8,"n_rows":12,"n_cols":25,"rows_kept":12,"cut":false,"hidden":false,"merged":[]}
["Шифр детали или СБ","Наименование детали или СБ","количество","Порядок запуска","Вырубка","Ленточнопильный","Гидрообразив","Лазер","Токарный","Токарный с ЧПУ","Фрезерный","Фрезерный с ЧПУ","Общее время","Расточка","Портальный фрезерный","Сварка","Шлифовальный","Зачистка","ОТК","Получение со склада","Сборка","Гибка","Упаковка, час","Сверловка","Резьба"]
[]
["ТРПП1","Кронштейн пушки",1,null,null,null,null,null,null,null,null,null,null,null,null,null,null,null,null,null,null,null,12]
["ТРПП2","Скоба",1]
["ТРПП3","Кронштейн",1]
["ТРПП4","Грибок",3,null,null,null,null,null,0.17,null,0.02,null,0.2,null,null,null,null,null,null,null,null,null,null,0.1,0.1]
["ТРПП5","Полка",1]
["ТРПП6","Держатель",2,null,null,0.05,null,null,0.25,null,0.4,null,1.1000000000000001,0.25,null,null,null,null,null,null,null,null,null,0.2,0.2]
["ТРПП7","Пластина",2]
["ТРПП8","Трубка 16х1.5 08X18H10 L=800",1]
["ТРПП9","Труба 48.3х1.5 08X18H10 L=780",2]
["ТРПП10","Труба 42.4х1.5 08X18H10 L=315",1]