{"text_format":"1","workbook":"xlsx","n_sheets":3,"sheets":["Формулой","База","Макросом"],"not_rendered":{"charts":0,"images":2,"macros":1,"external_links":0,"defined_names":2,"comments":0,"pivot_tables":0},"unopened":[],"bounds":{"document_bytes":16777216,"sheet_cells":100000,"rows_first":2000,"rows_last":500,"rows_between":2000,"halvings":0,"cell_chars":16384,"cell_head_chars":4096},"cells_cut":0,"cells_raw":0,"read":"whole","date_system":"1900"}

{"sheet":"Формулой","index":0,"n_rows":11,"n_cols":26,"rows_kept":11,"cut":false,"hidden":false,"merged":[]}
[null,"ввод"]
[1,"T. Lansoprazole 30мг п/о    1р/сут",null,{"$f":"IFERROR(INDEX(База!$B$1:$B$11,SMALL(IFERROR((SEARCH($B2,База!$B$2:$B$11)>0)*ROW(База!$B$2:$B$11),\"\"),COLUMN(A2))),\"\")","v":"T. Lansoprazole 30мг п/о    1р/сут"},{"$f":"IFERROR(INDEX(База!$B$1:$B$11,SMALL(IFERROR((SEARCH($B2,База!$B$2:$B$11)>0)*ROW(База!$B$2:$B$11),\"\"),COLUMN(B2))),\"\")","v":""},{"$f":"IFERROR(INDEX(База!$B$1:$B$11,SMALL(IFERROR((SEARCH($B2,База!$B$2:$B$11)>0)*ROW(База!$B$2:$B$11),\"\"),COLUMN(C2))),\"\")","v":""},{"$f":"IFERROR(INDEX(База!$B$1:$B$11,SMALL(IFERROR((SEARCH($B2,База!$B$2:$B$11)>0)*ROW(База!$B$2:$B$11),\"\"),COLUMN(D2))),\"\")","v":""},{"$f":"IFERROR(INDEX(База!$B$1:$B$11,SMALL(IFERROR((SEARCH($B2,База!$B$2:$B$11)>0)*ROW(База!$B$2:$B$11),\"\"),COLUMN(E2))),\"\")","v":""},{"$f":"IFERROR(INDEX(База!$B$1:$B$11,SMALL(IFERROR((SEARCH($B2,База!$B$2:$B$11)>0)*ROW(База!$B$2:$B$11),\"\"),COLUMN(F2))),\"\")","v":""},{"$f":"IFERROR(INDEX(База!$B$1:$B$11,SMALL(IFERROR((SEARCH($B2,База!$B$2:$B$11)>0)*ROW(База!$B$2:$B$11),\"\"),COLUMN(G2))),\"\")","v":""},{"$f":"IFERROR(INDEX(База!$B$1:$B$11,SMALL(IFERROR((SEARCH($B2,База!$B$2:$B$11)>0)*ROW(База!$B$2:$B$11),\"\"),COLUMN(H2))),\"\")","v":""},{"$f":"IFERROR(INDEX(База!$B$1:$B$11,SMALL(IFERROR((SEARCH($B2,База!$B$2:$B$11)>0)*ROW(База!$B$2:$B$11),\"\"),COLUMN(I2))),\"\")","v":""},{"$f":"IFERROR(INDEX(База!$B$1:$B$11,SMALL(IFERROR((SEARCH($B2,База!$B$2:$B$11)>0)*ROW(База!$B$2:$B$11),\"\"),COLUMN(J2))),\"\")","v":""},{"$f":"IFERROR(INDEX(База!$B$1:$B$11,SMALL(IFERROR((SEARCH($B2,База!$B$2:$B$11)>0)*ROW(База!$B$2:$B$11),\"\"),COLUMN(K2))),\"\")","v":""},{"$f":"IFERROR(INDEX(База!$B$1:$B$11,SMALL(IFERROR((SEARCH($B2,База!$B$2:$B$11)>0)*ROW(База!$B$2:$B$11),\"\"),COLUMN(L2))),\"\")","v":""},{"$f":"IFERROR(INDEX(База!$B$1:$B$11,SMALL(IFERROR((SEARCH($B2,База!$B$2:$B$11)>0)*ROW(База!$B$2:$B$11),\"\"),COLUMN(M2))),\"\")","v":""},{"$f":"IFERROR(INDEX(База!$B$1:$B$11,SMALL(IFERROR((SEARCH($B2,База!$B$2:$B$11)>0)*ROW(База!$B$2:$B$11),\"\"),COLUMN(N2))),\"\")","v":""},{"$f":"IFERROR(INDEX(База!$B$1:$B$11,SMALL(IFERROR((SEARCH($B2,База!$B$2:$B$11)>0)*ROW(База!$B$2:$B$11),\"\"),COLUMN(O2))),\"\")","v":""},{"$f":"IFERROR(INDEX(База!$B$1:$B$11,SMALL(IFERROR((SEARCH($B2,База!$B$2:$B$11)>0)*ROW(База!$B$2:$B$11),\"\"),COLUMN(P2))),\"\")","v":""},{"$f":"IFERROR(INDEX(База!$B$1:$B$11,SMALL(IFERROR((SEARCH($B2,База!$B$2:$B$11)>0)*ROW(База!$B$2:$B$11),\"\"),COLUMN(Q2))),\"\")","v":""},{"$f":"IFERROR(INDEX(База!$B$1:$B$11,SMALL(IFERROR((SEARCH($B2,База!$B$2:$B$11)>0)*ROW(База!$B$2:$B$11),\"\"),COLUMN(R2))),\"\")","v":""},{"$f":"IFERROR(INDEX(База!$B$1:$B$11,SMALL(IFERROR((SEARCH($B2,База!$B$2:$B$11)>0)*ROW(База!$B$2:$B$11),\"\"),COLUMN(S2))),\"\")","v":""},{"$f":"IFERROR(INDEX(База!$B$1:$B$11,SMALL(IFERROR((SEARCH($B2,База!$B$2:$B$11)>0)*ROW(База!$B$2:$B$11),\"\"),COLUMN(T2))),\"\")","v":""},{"$f":"IFERROR(INDEX(База!$B$1:$B$11,SMALL(IFERROR((SEARCH($B2,База!$B$2:$B$11)>0)*ROW(База!$B$2:$B$11),\"\"),COLUMN(U2))),\"\")","v":""},{"$f":"IFERROR(INDEX(База!$B$1:$B$11,SMALL(IFERROR((SEARCH($B2,База!$B$2:$B$11)>0)*ROW(База!$B$2:$B$11),\"\"),COLUMN(V2))),\"\")","v":""},{"$f":"IFERROR(INDEX(База!$B$1:$B$11,SMALL(IFERROR((SEARCH($B2,База!$B$2:$B$11)>0)*ROW(База!$B$2:$B$11),\"\"),COLUMN(W2))),\"\")","v":""}]
[2,null,null,{"$f":"IFERROR(INDEX(База!$B$1:$B$11,SMALL(IFERROR((SEARCH($B3,База!$B$2:$B$11)>0)*ROW(База!$B$2:$B$11),\"\"),COLUMN(A3))),\"\")","v":"S. Omeprazoli 40мг в/в    1р/сут"},{"$f":"IFERROR(INDEX(База!$B$1:$B$11,SMALL(IFERROR((SEARCH($B3,База!$B$2:$B$11)>0)*ROW(База!$B$2:$B$11),\"\"),COLUMN(B3))),\"\")","v":"T. Lansoprazole 30мг п/о    1р/сут"},{"$f":"IFERROR(INDEX(База!$B$1:$B$11,SMALL(IFERROR((SEARCH($B3,База!$B$2:$B$11)>0)*ROW(База!$B$2:$B$11),\"\"),COLUMN(C3))),\"\")","v":"S. Ranitidini 2.5%-2.0 в/в ч/з 8ч"},{"$f":"IFERROR(INDEX(База!$B$1:$B$11,SMALL(IFERROR((SEARCH($B3,База!$B$2:$B$11)>0)*ROW(База!$B$2:$B$11),\"\"),COLUMN(D3))),\"\")","v":"S. Ranitidini 2.5%-2.0 в/в ч/з 12ч"},{"$f":"IFERROR(INDEX(База!$B$1:$B$11,SMALL(IFERROR((SEARCH($B3,База!$B$2:$B$11)>0)*ROW(База!$B$2:$B$11),\"\"),COLUMN(E3))),\"\")","v":"T. Aspicard 75мг   1р/сут"},{"$f":"IFERROR(INDEX(База!$B$1:$B$11,SMALL(IFERROR((SEARCH($B3,База!$B$2:$B$11)>0)*ROW(База!$B$2:$B$11),\"\"),COLUMN(F3))),\"\")","v":"T. АСК 300мг (разжевать)   однократно"},{"$f":"IFERROR(INDEX(База!$B$1:$B$11,SMALL(IFERROR((SEARCH($B3,База!$B$2:$B$11)>0)*ROW(База!$B$2:$B$11),\"\"),COLUMN(G3))),\"\")","v":"T. Atorvastatini 20мг п/о   1р/сут"},{"$f":"IFERROR(INDEX(База!$B$1:$B$11,SMALL(IFERROR((SEARCH($B3,База!$B$2:$B$11)>0)*ROW(База!$B$2:$B$11),\"\"),COLUMN(H3))),\"\")","v":""},{"$f":"IFERROR(INDEX(База!$B$1:$B$11,SMALL(IFERROR((SEARCH($B3,База!$B$2:$B$11)>0)*ROW(База!$B$2:$B$11),\"\"),COLUMN(I3))),\"\")","v":""},{"$f":"IFERROR(INDEX(База!$B$1:$B$11,SMALL(IFERROR((SEARCH($B3,База!$B$2:$B$11)>0)*ROW(База!$B$2:$B$11),\"\"),COLUMN(J3))),\"\")","v":""},{"$f":"IFERROR(INDEX(База!$B$1:$B$11,SMALL(IFERROR((SEARCH($B3,База!$B$2:$B$11)>0)*ROW(База!$B$2:$B$11),\"\"),COLUMN(K3))),\"\")","v":""},{"$f":"IFERROR(INDEX(База!$B$1:$B$11,SMALL(IFERROR((SEARCH($B3,База!$B$2:$B$11)>0)*ROW(База!$B$2:$B$11),\"\"),COLUMN(L3))),\"\")","v":""},{"$f":"IFERROR(INDEX(База!$B$1:$B$11,SMALL(IFERROR((SEARCH($B3,База!$B$2:$B$11)>0)*ROW(База!$B$2:$B$11),\"\"),COLUMN(M3))),\"\")","v":""},{"$f":"IFERROR(INDEX(База!$B$1:$B$11,SMALL(IFERROR((SEARCH($B3,База!$B$2:$B$11)>0)*ROW(База!$B$2:$B$11),\"\"),COLUMN(N3))),\"\")","v":""},{"$f":"IFERROR(INDEX(База!$B$1:$B$11,SMALL(IFERROR((SEARCH($B3,База!$B$2:$B$11)>0)*ROW(База!$B$2:$B$11),\"\"),COLUMN(O3))),\"\")","v":""},{"$f":"IFERROR(INDEX(База!$B$1:$B$11,SMALL(IFERROR((SEARCH($B3,База!$B$2:$B$11)>0)*ROW(База!$B$2:$B$11),\"\"),COLUMN(P3))),\"\")","v":""},{"$f":"IFERROR(INDEX(База!$B$1:$B$11,SMALL(IFERROR((SEARCH($B3,База!$B$2:$B$11)>0)*ROW(База!$B$2:$B$11),\"\"),COLUMN(Q3))),\"\")","v":""},{"$f":"IFERROR(INDEX(База!$B$1:$B$11,SMALL(IFERROR((SEARCH($B3,База!$B$2:$B$11)>0)*ROW(База!$B$2:$B$11),\"\"),COLUMN(R3))),\"\")","v":""},{"$f":"IFERROR(INDEX(База!$B$1:$B$11,SMALL(IFERROR((SEARCH($B3,База!$B$2:$B$11)>0)*ROW(База!$B$2:$B$11),\"\"),COLUMN(S3))),\"\")","v":""},{"$f":"IFERROR(INDEX(База!$B$1:$B$11,SMALL(IFERROR((SEARCH($B3,База!$B$2:$B$11)>0)*ROW(База!$B$2:$B$11),\"\"),COLUMN(T3))),\"\")","v":""},{"$f":"IFERROR(INDEX(База!$B$1:$B$11,SMALL(IFERROR((SEARCH($B3,База!$B$2:$B$11)>0)*ROW(База!$B$2:$B$11),\"\"),COLUMN(U3))),\"\")","v":""},{"$f":"IFERROR(INDEX(База!$B$1:$B$11,SMALL(IFERROR((SEARCH($B3,База!$B$2:$B$11)>0)*ROW(База!$B$2:$B$11),\"\"),COLUMN(V3))),\"\")","v":""},{"$f":"IFERROR(INDEX(База!$B$1:$B$11,SMALL(IFERROR((SEARCH($B3,База!$B$2:$B$11)>0)*ROW(База!$B$2:$B$11),\"\"),COLUMN(W3))),\"\")","v":""}]
[3,null,null,{"$f":"IFERROR(INDEX(База!$B$1:$B$11,SMALL(IFERROR((SEARCH($B4,База!$B$2:$B$11)>0)*ROW(База!$B$2:$B$11),\"\"),COLUMN(A4))),\"\")","v":"S. Omeprazoli 40мг в/в    1р/сут"},{"$f":"IFERROR(INDEX(База!$B$1:$B$11,SMALL(IFERROR((SEARCH($B4,База!$B$2:$B$11)>0)*ROW(База!$B$2:$B$11),\"\"),COLUMN(B4))),\"\")","v":"T. Lansoprazole 30мг п/о    1р/сут"},{"$f":"IFERROR(INDEX(База!$B$1:$B$11,SMALL(IFERROR((SEARCH($B4,База!$B$2:$B$11)>0)*ROW(База!$B$2:$B$11),\"\"),COLUMN(C4))),\"\")","v":"S. Ranitidini 2.5%-2.0 в/в ч/з 8ч"},{"$f":"IFERROR(INDEX(База!$B$1:$B$11,SMALL(IFERROR((SEARCH($B4,База!$B$2:$B$11)>0)*ROW(База!$B$2:$B$11),\"\"),COLUMN(D4))),\"\")","v":"S. Ranitidini 2.5%-2.0 в/в ч/з 12ч"},{"$f":"IFERROR(INDEX(База!$B$1:$B$11,SMALL(IFERROR((SEARCH($B4,База!$B$2:$B$11)>0)*ROW(База!$B$2:$B$11),\"\"),COLUMN(E4))),\"\")","v":"T. Aspicard 75мг   1р/сут"},{"$f":"IFERROR(INDEX(База!$B$1:$B$11,SMALL(IFERROR((SEARCH($B4,База!$B$2:$B$11)>0)*ROW(База!$B$2:$B$11),\"\"),COLUMN(F4))),\"\")","v":"T. АСК 300мг (разжевать)   однократно"},{"$f":"IFERROR(INDEX(База!$B$1:$B$11,SMALL(IFERROR((SEARCH($B4,База!$B$2:$B$11)>0)*ROW(База!$B$2:$B$11),\"\"),COLUMN(G4))),\"\")","v":"T. Atorvastatini 20мг п/о   1р/сут"},{"$f":"IFERROR(INDEX(База!$B$1:$B$11,SMALL(IFERROR((SEARCH($B4,База!$B$2:$B$11)>0)*ROW(База!$B$2:$B$11),\"\"),COLUMN(H4))),\"\")","v":""},{"$f":"IFERROR(INDEX(База!$B$1:$B$11,SMALL(IFERROR((SEARCH($B4,База!$B$2:$B$11)>0)*ROW(База!$B$2:$B$11),\"\"),COLUMN(I4))),\"\")","v":""},{"$f":"IFERROR(INDEX(База!$B$1:$B$11,SMALL(IFERROR((SEARCH($B4,База!$B$2:$B$11)>0)*ROW(База!$B$2:$B$11),\"\"),COLUMN(J4))),\"\")","v":""},{"$f":"IFERROR(INDEX(База!$B$1:$B$11,SMALL(IFERROR((SEARCH($B4,База!$B$2:$B$11)>0)*ROW(База!$B$2:$B$11),\"\"),COLUMN(K4))),\"\")","v":""},{"$f":"IFERROR(INDEX(База!$B$1:$B$11,SMALL(IFERROR((SEARCH($B4,База!$B$2:$B$11)>0)*ROW(База!$B$2:$B$11),\"\"),COLUMN(L4))),\"\")","v":""},{"$f":"IFERROR(INDEX(База!$B$1:$B$11,SMALL(IFERROR((SEARCH($B4,База!$B$2:$B$11)>0)*ROW(База!$B$2:$B$11),\"\"),COLUMN(M4))),\"\")","v":""},{"$f":"IFERROR(INDEX(База!$B$1:$B$11,SMALL(IFERROR((SEARCH($B4,База!$B$2:$B$11)>0)*ROW(База!$B$2:$B$11),\"\"),COLUMN(N4))),\"\")","v":""},{"$f":"IFERROR(INDEX(База!$B$1:$B$11,SMALL(IFERROR((SEARCH($B4,База!$B$2:$B$11)>0)*ROW(База!$B$2:$B$11),\"\"),COLUMN(O4))),\"\")","v":""},{"$f":"IFERROR(INDEX(База!$B$1:$B$11,SMALL(IFERROR((SEARCH($B4,База!$B$2:$B$11)>0)*ROW(База!$B$2:$B$11),\"\"),COLUMN(P4))),\"\")","v":""},{"$f":"IFERROR(INDEX(База!$B$1:$B$11,SMALL(IFERROR((SEARCH($B4,База!$B$2:$B$11)>0)*ROW(База!$B$2:$B$11),\"\"),COLUMN(Q4))),\"\")","v":""},{"$f":"IFERROR(INDEX(База!$B$1:$B$11,SMALL(IFERROR((SEARCH($B4,База!$B$2:$B$11)>0)*ROW(База!$B$2:$B$11),\"\"),COLUMN(R4))),\"\")","v":""},{"$f":"IFERROR(INDEX(База!$B$1:$B$11,SMALL(IFERROR((SEARCH($B4,База!$B$2:$B$11)>0)*ROW(База!$B$2:$B$11),\"\"),COLUMN(S4))),\"\")","v":""},{"$f":"IFERROR(INDEX(База!$B$1:$B$11,SMALL(IFERROR((SEARCH($B4,База!$B$2:$B$11)>0)*ROW(База!$B$2:$B$11),\"\"),COLUMN(T4))),\"\")","v":""},{"$f":"IFERROR(INDEX(База!$B$1:$B$11,SMALL(IFERROR((SEARCH($B4,База!$B$2:$B$11)>0)*ROW(База!$B$2:$B$11),\"\"),COLUMN(U4))),\"\")","v":""},{"$f":"IFERROR(INDEX(База!$B$1:$B$11,SMALL(IFERROR((SEARCH($B4,База!$B$2:$B$11)>0)*ROW(База!$B$2:$B$11),\"\"),COLUMN(V4))),\"\")","v":""},{"$f":"IFERROR(INDEX(База!$B$1:$B$11,SMALL(IFERROR((SEARCH($B4,База!$B$2:$B$11)>0)*ROW(База!$B$2:$B$11),\"\"),COLUMN(W4))),\"\")","v":""}]
[4,null,null,{"$f":"IFERROR(INDEX(База!$B$1:$B$11,SMALL(IFERROR((SEARCH($B5,База!$B$2:$B$11)>0)*ROW(База!$B$2:$B$11),\"\"),COLUMN(A5))),\"\")","v":"S. Omeprazoli 40мг в/в    1р/сут"},{"$f":"IFERROR(INDEX(База!$B$1:$B$11,SMALL(IFERROR((SEARCH($B5,База!$B$2:$B$11)>0)*ROW(База!$B$2:$B$11),\"\"),COLUMN(B5))),\"\")","v":"T. Lansoprazole 30мг п/о    1р/сут"},{"$f":"IFERROR(INDEX(База!$B$1:$B$11,SMALL(IFERROR((SEARCH($B5,База!$B$2:$B$11)>0)*ROW(База!$B$2:$B$11),\"\"),COLUMN(C5))),\"\")","v":"S. Ranitidini 2.5%-2.0 в/в ч/з 8ч"},{"$f":"IFERROR(INDEX(База!$B$1:$B$11,SMALL(IFERROR((SEARCH($B5,База!$B$2:$B$11)>0)*ROW(База!$B$2:$B$11),\"\"),COLUMN(D5))),\"\")","v":"S. Ranitidini 2.5%-2.0 в/в ч/з 12ч"},{"$f":"IFERROR(INDEX(База!$B$1:$B$11,SMALL(IFERROR((SEARCH($B5,База!$B$2:$B$11)>0)*ROW(База!$B$2:$B$11),\"\"),COLUMN(E5))),\"\")","v":"T. Aspicard 75мг   1р/сут"},{"$f":"IFERROR(INDEX(База!$B$1:$B$11,SMALL(IFERROR((SEARCH($B5,База!$B$2:$B$11)>0)*ROW(База!$B$2:$B$11),\"\"),COLUMN(F5))),\"\")","v":"T. АСК 300мг (разжевать)   однократно"},{"$f":"IFERROR(INDEX(База!$B$1:$B$11,SMALL(IFERROR((SEARCH($B5,База!$B$2:$B$11)>0)*ROW(База!$B$2:$B$11),\"\"),COLUMN(G5))),\"\")","v":"T. Atorvastatini 20мг п/о   1р/сут"},{"$f":"IFERROR(INDEX(База!$B$1:$B$11,SMALL(IFERROR((SEARCH($B5,База!$B$2:$B$11)>0)*ROW(База!$B$2:$B$11),\"\"),COLUMN(H5))),\"\")","v":""},{"$f":"IFERROR(INDEX(База!$B$1:$B$11,SMALL(IFERROR((SEARCH($B5,База!$B$2:$B$11)>0)*ROW(База!$B$2:$B$11),\"\"),COLUMN(I5))),\"\")","v":""},{"$f":"IFERROR(INDEX(База!$B$1:$B$11,SMALL(IFERROR((SEARCH($B5,База!$B$2:$B$11)>0)*ROW(База!$B$2:$B$11),\"\"),COLUMN(J5))),\"\")","v":""},{"$f":"IFERROR(INDEX(База!$B$1:$B$11,SMALL(IFERROR((SEARCH($B5,База!$B$2:$B$11)>0)*ROW(База!$B$2:$B$11),\"\"),COLUMN(K5))),\"\")","v":""},{"$f":"IFERROR(INDEX(База!$B$1:$B$11,SMALL(IFERROR((SEARCH($B5,База!$B$2:$B$11)>0)*ROW(База!$B$2:$B$11),\"\"),COLUMN(L5))),\"\")","v":""},{"$f":"IFERROR(INDEX(База!$B$1:$B$11,SMALL(IFERROR((SEARCH($B5,База!$B$2:$B$11)>0)*ROW(База!$B$2:$B$11),\"\"),COLUMN(M5))),\"\")","v":""},{"$f":"IFERROR(INDEX(База!$B$1:$B$11,SMALL(IFERROR((SEARCH($B5,База!$B$2:$B$11)>0)*ROW(База!$B$2:$B$11),\"\"),COLUMN(N5))),\"\")","v":""},{"$f":"IFERROR(INDEX(База!$B$1:$B$11,SMALL(IFERROR((SEARCH($B5,База!$B$2:$B$11)>0)*ROW(База!$B$2:$B$11),\"\"),COLUMN(O5))),\"\")","v":""},{"$f":"IFERROR(INDEX(База!$B$1:$B$11,SMALL(IFERROR((SEARCH($B5,База!$B$2:$B$11)>0)*ROW(База!$B$2:$B$11),\"\"),COLUMN(P5))),\"\")","v":""},{"$f":"IFERROR(INDEX(База!$B$1:$B$11,SMALL(IFERROR((SEARCH($B5,База!$B$2:$B$11)>0)*ROW(База!$B$2:$B$11),\"\"),COLUMN(Q5))),\"\")","v":""},{"$f":"IFERROR(INDEX(База!$B$1:$B$11,SMALL(IFERROR((SEARCH($B5,База!$B$2:$B$11)>0)*ROW(База!$B$2:$B$11),\"\"),COLUMN(R5))),\"\")","v":""},{"$f":"IFERROR(INDEX(База!$B$1:$B$11,SMALL(IFERROR((SEARCH($B5,База!$B$2:$B$11)>0)*ROW(База!$B$2:$B$11),\"\"),COLUMN(S5))),\"\")","v":""},{"$f":"IFERROR(INDEX(База!$B$1:$B$11,SMALL(IFERROR((SEARCH($B5,База!$B$2:$B$11)>0)*ROW(База!$B$2:$B$11),\"\"),COLUMN(T5))),\"\")","v":""},{"$f":"IFERROR(INDEX(База!$B$1:$B$11,SMALL(IFERROR((SEARCH($B5,База!$B$2:$B$11)>0)*ROW(База!$B$2:$B$11),\"\"),COLUMN(U5))),\"\")","v":""},{"$f":"IFERROR(INDEX(База!$B$1:$B$11,SMALL(IFERROR((SEARCH($B5,База!$B$2:$B$11)>0)*ROW(База!$B$2:$B$11),\"\"),COLUMN(V5))),\"\")","v":""},{"$f":"IFERROR(INDEX(База!$B$1:$B$11,SMALL(IFERROR((SEARCH($B5,База!$B$2:$B$11)>0)*ROW(База!$B$2:$B$11),\"\"),COLUMN(W5))),\"\")","v":""}]
[5,null,null,{"$f":"IFERROR(INDEX(База!$B$1:$B$11,SMALL(IFERROR((SEARCH($B6,База!$B$2:$B$11)>0)*ROW(База!$B$2:$B$11),\"\"),COLUMN(A6))),\"\")","v":"S. Omeprazoli 40мг в/в    1р/сут"},{"$f":"IFERROR(INDEX(База!$B$1:$B$11,SMALL(IFERROR((SEARCH($B6,База!$B$2:$B$11)>0)*ROW(База!$B$2:$B$11),\"\"),COLUMN(B6))),\"\")","v":"T. Lansoprazole 30мг п/о    1р/сут"},{"$f":"IFERROR(INDEX(База!$B$1:$B$11,SMALL(IFERROR((SEARCH($B6,База!$B$2:$B$11)>0)*ROW(База!$B$2:$B$11),\"\"),COLUMN(C6))),\"\")","v":"S. Ranitidini 2.5%-2.0 в/в ч/з 8ч"},{"$f":"IFERROR(INDEX(База!$B$1:$B$11,SMALL(IFERROR((SEARCH($B6,База!$B$2:$B$11)>0)*ROW(База!$B$2:$B$11),\"\"),COLUMN(D6))),\"\")","v":"S. Ranitidini 2.5%-2.0 в/в ч/з 12ч"},{"$f":"IFERROR(INDEX(База!$B$1:$B$11,SMALL(IFERROR((SEARCH($B6,База!$B$2:$B$11)>0)*ROW(База!$B$2:$B$11),\"\"),COLUMN(E6))),\"\")","v":"T. Aspicard 75мг   1р/сут"},{"$f":"IFERROR(INDEX(База!$B$1:$B$11,SMALL(IFERROR((SEARCH($B6,База!$B$2:$B$11)>0)*ROW(База!$B$2:$B$11),\"\"),COLUMN(F6))),\"\")","v":"T. АСК 300мг (разжевать)   однократно"},{"$f":"IFERROR(INDEX(База!$B$1:$B$11,SMALL(IFERROR((SEARCH($B6,База!$B$2:$B$11)>0)*ROW(База!$B$2:$B$11),\"\"),COLUMN(G6))),\"\")","v":"T. Atorvastatini 20мг п/о   1р/сут"},{"$f":"IFERROR(INDEX(База!$B$1:$B$11,SMALL(IFERROR((SEARCH($B6,База!$B$2:$B$11)>0)*ROW(База!$B$2:$B$11),\"\"),COLUMN(H6))),\"\")","v":""},{"$f":"IFERROR(INDEX(База!$B$1:$B$11,SMALL(IFERROR((SEARCH($B6,База!$B$2:$B$11)>0)*ROW(База!$B$2:$B$11),\"\"),COLUMN(I6))),\"\")","v":""},{"$f":"IFERROR(INDEX(База!$B$1:$B$11,SMALL(IFERROR((SEARCH($B6,База!$B$2:$B$11)>0)*ROW(База!$B$2:$B$11),\"\"),COLUMN(J6))),\"\")","v":""},{"$f":"IFERROR(INDEX(База!$B$1:$B$11,SMALL(IFERROR((SEARCH($B6,База!$B$2:$B$11)>0)*ROW(База!$B$2:$B$11),\"\"),COLUMN(K6))),\"\")","v":""},{"$f":"IFERROR(INDEX(База!$B$1:$B$11,SMALL(IFERROR((SEARCH($B6,База!$B$2:$B$11)>0)*ROW(База!$B$2:$B$11),\"\"),COLUMN(L6))),\"\")","v":""},{"$f":"IFERROR(INDEX(База!$B$1:$B$11,SMALL(IFERROR((SEARCH($B6,База!$B$2:$B$11)>0)*ROW(База!$B$2:$B$11),\"\"),COLUMN(M6))),\"\")","v":""},{"$f":"IFERROR(INDEX(База!$B$1:$B$11,SMALL(IFERROR((SEARCH($B6,База!$B$2:$B$11)>0)*ROW(База!$B$2:$B$11),\"\"),COLUMN(N6))),\"\")","v":""},{"$f":"IFERROR(INDEX(База!$B$1:$B$11,SMALL(IFERROR((SEARCH($B6,База!$B$2:$B$11)>0)*ROW(База!$B$2:$B$11),\"\"),COLUMN(O6))),\"\")","v":""},{"$f":"IFERROR(INDEX(База!$B$1:$B$11,SMALL(IFERROR((SEARCH($B6,База!$B$2:$B$11)>0)*ROW(База!$B$2:$B$11),\"\"),COLUMN(P6))),\"\")","v":""},{"$f":"IFERROR(INDEX(База!$B$1:$B$11,SMALL(IFERROR((SEARCH($B6,База!$B$2:$B$11)>0)*ROW(База!$B$2:$B$11),\"\"),COLUMN(Q6))),\"\")","v":""},{"$f":"IFERROR(INDEX(База!$B$1:$B$11,SMALL(IFERROR((SEARCH($B6,База!$B$2:$B$11)>0)*ROW(База!$B$2:$B$11),\"\"),COLUMN(R6))),\"\")","v":""},{"$f":"IFERROR(INDEX(База!$B$1:$B$11,SMALL(IFERROR((SEARCH($B6,База!$B$2:$B$11)>0)*ROW(База!$B$2:$B$11),\"\"),COLUMN(S6))),\"\")","v":""},{"$f":"IFERROR(INDEX(База!$B$1:$B$11,SMALL(IFERROR((SEARCH($B6,База!$B$2:$B$11)>0)*ROW(База!$B$2:$B$11),\"\"),COLUMN(T6))),\"\")","v":""},{"$f":"IFERROR(INDEX(База!$B$1:$B$11,SMALL(IFERROR((SEARCH($B6,База!$B$2:$B$11)>0)*ROW(База!$B$2:$B$11),\"\"),COLUMN(U6))),\"\")","v":""},{"$f":"IFERROR(INDEX(База!$B$1:$B$11,SMALL(IFERROR((SEARCH($B6,База!$B$2:$B$11)>0)*ROW(База!$B$2:$B$11),\"\"),COLUMN(V6))),\"\")","v":""},{"$f":"IFERROR(INDEX(База!$B$1:$B$11,SMALL(IFERROR((SEARCH($B6,База!$B$2:$B$11)>0)*ROW(База!$B$2:$B$11),\"\"),COLUMN(W6))),\"\")","v":""}]
[6,null,null,{"$f":"IFERROR(INDEX(База!$B$1:$B$11,SMALL(IFERROR((SEARCH($B7,База!$B$2:$B$11)>0)*ROW(База!$B$2:$B$11),\"\"),COLUMN(A7))),\"\")","v":"S. Omeprazoli 40мг в/в    1р/сут"},{"$f":"IFERROR(INDEX(База!$B$1:$B$11,SMALL(IFERROR((SEARCH($B7,База!$B$2:$B$11)>0)*ROW(База!$B$2:$B$11),\"\"),COLUMN(B7))),\"\")","v":"T. Lansoprazole 30мг п/о    1р/сут"},{"$f":"IFERROR(INDEX(База!$B$1:$B$11,SMALL(IFERROR((SEARCH($B7,База!$B$2:$B$11)>0)*ROW(База!$B$2:$B$11),\"\"),COLUMN(C7))),\"\")","v":"S. Ranitidini 2.5%-2.0 в/в ч/з 8ч"},{"$f":"IFERROR(INDEX(База!$B$1:$B$11,SMALL(IFERROR((SEARCH($B7,База!$B$2:$B$11)>0)*ROW(База!$B$2:$B$11),\"\"),COLUMN(D7))),\"\")","v":"S. Ranitidini 2.5%-2.0 в/в ч/з 12ч"},{"$f":"IFERROR(INDEX(База!$B$1:$B$11,SMALL(IFERROR((SEARCH($B7,База!$B$2:$B$11)>0)*ROW(База!$B$2:$B$11),\"\"),COLUMN(E7))),\"\")","v":"T. Aspicard 75мг   1р/сут"},{"$f":"IFERROR(INDEX(База!$B$1:$B$11,SMALL(IFERROR((SEARCH($B7,База!$B$2:$B$11)>0)*ROW(База!$B$2:$B$11),\"\"),COLUMN(F7))),\"\")","v":"T. АСК 300мг (разжевать)   однократно"},{"$f":"IFERROR(INDEX(База!$B$1:$B$11,SMALL(IFERROR((SEARCH($B7,База!$B$2:$B$11)>0)*ROW(База!$B$2:$B$11),\"\"),COLUMN(G7))),\"\")","v":"T. Atorvastatini 20мг п/о   1р/сут"},{"$f":"IFERROR(INDEX(База!$B$1:$B$11,SMALL(IFERROR((SEARCH($B7,База!$B$2:$B$11)>0)*ROW(База!$B$2:$B$11),\"\"),COLUMN(H7))),\"\")","v":""},{"$f":"IFERROR(INDEX(База!$B$1:$B$11,SMALL(IFERROR((SEARCH($B7,База!$B$2:$B$11)>0)*ROW(База!$B$2:$B$11),\"\"),COLUMN(I7))),\"\")","v":""},{"$f":"IFERROR(INDEX(База!$B$1:$B$11,SMALL(IFERROR((SEARCH($B7,База!$B$2:$B$11)>0)*ROW(База!$B$2:$B$11),\"\"),COLUMN(J7))),\"\")","v":""},{"$f":"IFERROR(INDEX(База!$B$1:$B$11,SMALL(IFERROR((SEARCH($B7,База!$B$2:$B$11)>0)*ROW(База!$B$2:$B$11),\"\"),COLUMN(K7))),\"\")","v":""},{"$f":"IFERROR(INDEX(База!$B$1:$B$11,SMALL(IFERROR((SEARCH($B7,База!$B$2:$B$11)>0)*ROW(База!$B$2:$B$11),\"\"),COLUMN(L7))),\"\")","v":""},{"$f":"IFERROR(INDEX(База!$B$1:$B$11,SMALL(IFERROR((SEARCH($B7,База!$B$2:$B$11)>0)*ROW(База!$B$2:$B$11),\"\"),COLUMN(M7))),\"\")","v":""},{"$f":"IFERROR(INDEX(База!$B$1:$B$11,SMALL(IFERROR((SEARCH($B7,База!$B$2:$B$11)>0)*ROW(База!$B$2:$B$11),\"\"),COLUMN(N7))),\"\")","v":""},{"$f":"IFERROR(INDEX(База!$B$1:$B$11,SMALL(IFERROR((SEARCH($B7,База!$B$2:$B$11)>0)*ROW(База!$B$2:$B$11),\"\"),COLUMN(O7))),\"\")","v":""},{"$f":"IFERROR(INDEX(База!$B$1:$B$11,SMALL(IFERROR((SEARCH($B7,База!$B$2:$B$11)>0)*ROW(База!$B$2:$B$11),\"\"),COLUMN(P7))),\"\")","v":""},{"$f":"IFERROR(INDEX(База!$B$1:$B$11,SMALL(IFERROR((SEARCH($B7,База!$B$2:$B$11)>0)*ROW(База!$B$2:$B$11),\"\"),COLUMN(Q7))),\"\")","v":""},{"$f":"IFERROR(INDEX(База!$B$1:$B$11,SMALL(IFERROR((SEARCH($B7,База!$B$2:$B$11)>0)*ROW(База!$B$2:$B$11),\"\"),COLUMN(R7))),\"\")","v":""},{"$f":"IFERROR(INDEX(База!$B$1:$B$11,SMALL(IFERROR((SEARCH($B7,База!$B$2:$B$11)>0)*ROW(База!$B$2:$B$11),\"\"),COLUMN(S7))),\"\")","v":""},{"$f":"IFERROR(INDEX(База!$B$1:$B$11,SMALL(IFERROR((SEARCH($B7,База!$B$2:$B$11)>0)*ROW(База!$B$2:$B$11),\"\"),COLUMN(T7))),\"\")","v":""},{"$f":"IFERROR(INDEX(База!$B$1:$B$11,SMALL(IFERROR((SEARCH($B7,База!$B$2:$B$11)>0)*ROW(База!$B$2:$B$11),\"\"),COLUMN(U7))),\"\")","v":""},{"$f":"IFERROR(INDEX(База!$B$1:$B$11,SMALL(IFERROR((SEARCH($B7,База!$B$2:$B$11)>0)*ROW(База!$B$2:$B$11),\"\"),COLUMN(V7))),\"\")","v":""},{"$f":"IFERROR(INDEX(База!$B$1:$B$11,SMALL(IFERROR((SEARCH($B7,База!$B$2:$B$11)>0)*ROW(База!$B$2:$B$11),\"\"),COLUMN(W7))),\"\")","v":""}]
[7,null,null,{"$f":"IFERROR(INDEX(База!$B$1:$B$11,SMALL(IFERROR((SEARCH($B8,База!$B$2:$B$11)>0)*ROW(База!$B$2:$B$11),\"\"),COLUMN(A8))),\"\")","v":"S. Omeprazoli 40мг в/в    1р/сут"},{"$f":"IFERROR(INDEX(База!$B$1:$B$11,SMALL(IFERROR((SEARCH($B8,База!$B$2:$B$11)>0)*ROW(База!$B$2:$B$11),\"\"),COLUMN(B8))),\"\")","v":"T. Lansoprazole 30мг п/о    1р/сут"},{"$f":"IFERROR(INDEX(База!$B$1:$B$11,SMALL(IFERROR((SEARCH($B8,База!$B$2:$B$11)>0)*ROW(База!$B$2:$B$11),\"\"),COLUMN(C8))),\"\")","v":"S. Ranitidini 2.5%-2.0 в/в ч/з 8ч"},{"$f":"IFERROR(INDEX(База!$B$1:$B$11,SMALL(IFERROR((SEARCH($B8,База!$B$2:$B$11)>0)*ROW(База!$B$2:$B$11),\"\"),COLUMN(D8))),\"\")","v":"S. Ranitidini 2.5%-2.0 в/в ч/з 12ч"},{"$f":"IFERROR(INDEX(База!$B$1:$B$11,SMALL(IFERROR((SEARCH($B8,База!$B$2:$B$11)>0)*ROW(База!$B$2:$B$11),\"\"),COLUMN(E8))),\"\")","v":"T. Aspicard 75мг   1р/сут"},{"$f":"IFERROR(INDEX(База!$B$1:$B$11,SMALL(IFERROR((SEARCH($B8,База!$B$2:$B$11)>0)*ROW(База!$B$2:$B$11),\"\"),COLUMN(F8))),\"\")","v":"T. АСК 300мг (разжевать)   однократно"},{"$f":"IFERROR(INDEX(База!$B$1:$B$11,SMALL(IFERROR((SEARCH($B8,База!$B$2:$B$11)>0)*ROW(База!$B$2:$B$11),\"\"),COLUMN(G8))),\"\")","v":"T. Atorvastatini 20мг п/о   1р/сут"},{"$f":"IFERROR(INDEX(База!$B$1:$B$11,SMALL(IFERROR((SEARCH($B8,База!$B$2:$B$11)>0)*ROW(База!$B$2:$B$11),\"\"),COLUMN(H8))),\"\")","v":""},{"$f":"IFERROR(INDEX(База!$B$1:$B$11,SMALL(IFERROR((SEARCH($B8,База!$B$2:$B$11)>0)*ROW(База!$B$2:$B$11),\"\"),COLUMN(I8))),\"\")","v":""},{"$f":"IFERROR(INDEX(База!$B$1:$B$11,SMALL(IFERROR((SEARCH($B8,База!$B$2:$B$11)>0)*ROW(База!$B$2:$B$11),\"\"),COLUMN(J8))),\"\")","v":""},{"$f":"IFERROR(INDEX(База!$B$1:$B$11,SMALL(IFERROR((SEARCH($B8,База!$B$2:$B$11)>0)*ROW(База!$B$2:$B$11),\"\"),COLUMN(K8))),\"\")","v":""},{"$f":"IFERROR(INDEX(База!$B$1:$B$11,SMALL(IFERROR((SEARCH($B8,База!$B$2:$B$11)>0)*ROW(База!$B$2:$B$11),\"\"),COLUMN(L8))),\"\")","v":""},{"$f":"IFERROR(INDEX(База!$B$1:$B$11,SMALL(IFERROR((SEARCH($B8,База!$B$2:$B$11)>0)*ROW(База!$B$2:$B$11),\"\"),COLUMN(M8))),\"\")","v":""},{"$f":"IFERROR(INDEX(База!$B$1:$B$11,SMALL(IFERROR((SEARCH($B8,База!$B$2:$B$11)>0)*ROW(База!$B$2:$B$11),\"\"),COLUMN(N8))),\"\")","v":""},{"$f":"IFERROR(INDEX(База!$B$1:$B$11,SMALL(IFERROR((SEARCH($B8,База!$B$2:$B$11)>0)*ROW(База!$B$2:$B$11),\"\"),COLUMN(O8))),\"\")","v":""},{"$f":"IFERROR(INDEX(База!$B$1:$B$11,SMALL(IFERROR((SEARCH($B8,База!$B$2:$B$11)>0)*ROW(База!$B$2:$B$11),\"\"),COLUMN(P8))),\"\")","v":""},{"$f":"IFERROR(INDEX(База!$B$1:$B$11,SMALL(IFERROR((SEARCH($B8,База!$B$2:$B$11)>0)*ROW(База!$B$2:$B$11),\"\"),COLUMN(Q8))),\"\")","v":""},{"$f":"IFERROR(INDEX(База!$B$1:$B$11,SMALL(IFERROR((SEARCH($B8,База!$B$2:$B$11)>0)*ROW(База!$B$2:$B$11),\"\"),COLUMN(R8))),\"\")","v":""},{"$f":"IFERROR(INDEX(База!$B$1:$B$11,SMALL(IFERROR((SEARCH($B8,База!$B$2:$B$11)>0)*ROW(База!$B$2:$B$11),\"\"),COLUMN(S8))),\"\")","v":""},{"$f":"IFERROR(INDEX(База!$B$1:$B$11,SMALL(IFERROR((SEARCH($B8,База!$B$2:$B$11)>0)*ROW(База!$B$2:$B$11),\"\"),COLUMN(T8))),\"\")","v":""},{"$f":"IFERROR(INDEX(База!$B$1:$B$11,SMALL(IFERROR((SEARCH($B8,База!$B$2:$B$11)>0)*ROW(База!$B$2:$B$11),\"\"),COLUMN(U8))),\"\")","v":""},{"$f":"IFERROR(INDEX(База!$B$1:$B$11,SMALL(IFERROR((SEARCH($B8,База!$B$2:$B$11)>0)*ROW(База!$B$2:$B$11),\"\"),COLUMN(V8))),\"\")","v":""},{"$f":"IFERROR(INDEX(База!$B$1:$B$11,SMALL(IFERROR((SEARCH($B8,База!$B$2:$B$11)>0)*ROW(База!$B$2:$B$11),\"\"),COLUMN(W8))),\"\")","v":""}]
{"$rows_left_out":4}
{"sheet":"База","index":1,"n_rows":8,"n_cols":5,"rows_kept":8,"cut":false,"hidden":false,"merged":[]}
[null,"даные",null,null,"отбор"]
[{"$f":"IF(ISNUMBER(SEARCH(Формулой!$B$2,База!B2)),MAX($A$1:A1)+1,0)","v":0},"S. Omeprazoli 40мг в/в    1р/сут",null,1,{"$f":"VLOOKUP(D2,A:B,2,0)","v":"T. Lansoprazole 30мг п/о    1р/сут"}]
[{"$f":"IF(ISNUMBER(SEARCH(Формулой!$B$2,База!B3)),MAX($A$1:A2)+1,0)","v":1},"T. Lansoprazole 30мг п/о    1р/сут",null,2,{"$f":"VLOOKUP(D3,A:B,2,0)","v":{"$error":"#N/A"}}]
[{"$f":"IF(ISNUMBER(SEARCH(Формулой!$B$2,База!B4)),MAX($A$1:A3)+1,0)","v":0},"S. Ranitidini 2.5%-2.0 в/в ч/з 8ч",null,3,{"$error":"#N/A"}]
[{"$f":"IF(ISNUMBER(SEARCH(Формулой!$B$2,База!B5)),MAX($A$1:A4)+1,0)","v":0},"S. Ranitidini 2.5%-2.0 в/в ч/з 12ч",null,4,{"$error":"#N/A"}]
[{"$f":"IF(ISNUMBER(SEARCH(Формулой!$B$2,База!B6)),MAX($A$1:A5)+1,0)","v":0},"T. Aspicard 75мг   1р/сут",null,5,{"$error":"#N/A"}]
[{"$f":"IF(ISNUMBER(SEARCH(Формулой!$B$2,База!B7)),MAX($A$1:A6)+1,0)","v":0},"T. АСК 300мг (разжевать)   однократно",null,6,{"$error":"#N/A"}]
[{"$f":"IF(ISNUMBER(SEARCH(Формулой!$B$2,База!B8)),MAX($A$1:A7)+1,0)","v":0},"T. Atorvastatini 20мг п/о   1р/сут",null,7,{"$error":"#N/A"}]
{"$rows_left_out":1}
{"sheet":"Макросом","index":2,"n_rows":2,"n_cols":2,"rows_kept":2,"cut":false,"hidden":false,"merged":[]}
[null,"ввод"]
[null,"S. Omeprazoli 40мг в/в    1р/сут"]