{"text_format":"1","workbook":"xlsx","n_sheets":2,"sheets":["1-Станок","В расчёт"],"not_rendered":{"charts":0,"images":0,"macros":1,"external_links":0,"defined_names":0,"comments":0,"pivot_tables":0},"unopened":[],"bounds":{"document_bytes":16777216,"sheet_cells":100000,"rows_first":2000,"rows_last":500,"rows_between":2000,"halvings":0,"cell_chars":16384,"cell_head_chars":4096},"cells_cut":0,"cells_raw":0,"read":"whole","date_system":"1900"}

{"sheet":"1-Станок","index":0,"n_rows":211,"n_cols":21,"rows_kept":211,"cut":false,"hidden":false,"merged":[[6,21,6,22],[8,20,8,21],[8,22,8,24],[8,27,8,31],[28,20,56,37]]}
[]
[]
[null,null,null,null,null,null,null,null,null,null,"40534"]
[]
[]
[]
[]
[]
[]
[null,null,null,null,"№","ДСЕ","Кол-во,шт","входимость\nв машин","Тр,ч","∑ Тр,ч","% загрузки","№","машина","Машины","Типов\nДСЕ","Столбец3","Столбец4","Столбец5","Столбец1"]
[null,null,null,null,{"$f":"IF(F11<>\"\",COUNTA(F$11:$F11),\"\")","v":1},"ПС 2,5.01.02.102 [1]",1204,null,0.36100000000000004,434.64400000000006,3.2160118386977437,null,"1100/58 2ПТС-5.00.00.000М-01 (Нигерия)",null,{"$f":"IFERROR(SUM(--(FREQUENCY(IF('В расчёт'!$B$2:$B$5000<>\"\",IF(('В расчёт'!$M$2:$M$5000=Таблица4[[#This Row],[машина]])*('В расчёт'!$F$2:$F$5000=$G$3),MATCH('В расчёт'!$B$2:$B$5000,'В расчёт'!$B$2:$B$5000,0))),ROW('В расчёт'!$B$2:$B$5000)-ROW('В расчёт'!B2)+1)> 0)),\"0\")","v":0},null,null,null,null,null,"ЕСЛИОШИБКА(СУММ(--(ЧАСТОТА(ЕСЛИ('В расчёт'!$B$2:$B$5000<>\"\";ЕСЛИ(('В расчёт'!$M$2:$M$5000=[@машина])*('В расчёт'!$F$2:$F$5000=$G$3);ПОИСКПОЗ('В расчёт'!$B$2:$B$5000;'В расчёт'!$B$2:$B$5000;0)));СТРОКА('В расчёт'!$B$2:$B$5000)-СТРОКА('В расчёт'!B2)+1)> 0));\"0\")"]
[null,null,null,null,{"$f":"IF(F12<>\"\",COUNTA(F$11:$F12),\"\")","v":2},"МТУ-24.02.01.302",108,null,1.42,153.35999999999999,1.1347391786903438,null,"МТУ-20.00.00.000-01 [18]",null,{"$f":"IFERROR(SUM(--(FREQUENCY(IF('В расчёт'!$B$2:$B$5000<>\"\",IF(('В расчёт'!$M$2:$M$5000=Таблица4[[#This Row],[машина]])*('В расчёт'!$F$2:$F$5000=$G$3),MATCH('В расчёт'!$B$2:$B$5000,'В расчёт'!$B$2:$B$5000,0))),ROW('В расчёт'!$B$2:$B$5000)-ROW('В расчёт'!B3)+1)> 0)),\"0\")","v":0}]
[null,null,null,null,{"$f":"IF(F13<>\"\",COUNTA(F$11:$F13),\"\")","v":3},"086СХ 12,8-07.101 [4]",276,null,0.33200000000000002,91.632000000000005,0.67800221975582686,null,"926/10 ПРФ-145М (КАИК)",null,{"$f":"IFERROR(SUM(--(FREQUENCY(IF('В расчёт'!$B$2:$B$5000<>\"\",IF(('В расчёт'!$M$2:$M$5000=Таблица4[[#This Row],[машина]])*('В расчёт'!$F$2:$F$5000=$G$3),MATCH('В расчёт'!$B$2:$B$5000,'В расчёт'!$B$2:$B$5000,0))),ROW('В расчёт'!$B$2:$B$5000)-ROW('В расчёт'!B4)+1)> 0)),\"0\")","v":0}]
[null,null,null,null,{"$f":"IF(F14<>\"\",COUNTA(F$11:$F14),\"\")","v":4},"086СХ 12,8-07.302 [8]",276,null,0.27700000000000002,76.452000000000012,0.56568257491675922,null,"ПСТ-12.00.00.000",null,{"$f":"IFERROR(SUM(--(FREQUENCY(IF('В расчёт'!$B$2:$B$5000<>\"\",IF(('В расчёт'!$M$2:$M$5000=Таблица4[[#This Row],[машина]])*('В расчёт'!$F$2:$F$5000=$G$3),MATCH('В расчёт'!$B$2:$B$5000,'В расчёт'!$B$2:$B$5000,0))),ROW('В расчёт'!$B$2:$B$5000)-ROW('В расчёт'!B5)+1)> 0)),\"0\")","v":0}]
[null,null,null,null,{"$f":"IF(F15<>\"\",COUNTA(F$11:$F15),\"\")","v":5},"МЖУ-16.07.01.301-02",102,null,0.48399999999999993,49.367999999999995,0.36528301886792447,null,"879/22 (эпоксидное покрытие РБ)",null,{"$f":"IFERROR(SUM(--(FREQUENCY(IF('В расчёт'!$B$2:$B$5000<>\"\",IF(('В расчёт'!$M$2:$M$5000=Таблица4[[#This Row],[машина]])*('В расчёт'!$F$2:$F$5000=$G$3),MATCH('В расчёт'!$B$2:$B$5000,'В расчёт'!$B$2:$B$5000,0))),ROW('В расчёт'!$B$2:$B$5000)-ROW('В расчёт'!B6)+1)> 0)),\"0\")","v":0}]
[null,null,null,null,{"$f":"IF(F16<>\"\",COUNTA(F$11:$F16),\"\")","v":6},"МЖУ-16.07.01.301 [2]",98,null,0.33300000000000002,32.634,0.24146503884572695,null,"РУ-7000-1.00.00.000",null,{"$f":"IFERROR(SUM(--(FREQUENCY(IF('В расчёт'!$B$2:$B$5000<>\"\",IF(('В расчёт'!$M$2:$M$5000=Таблица4[[#This Row],[машина]])*('В расчёт'!$F$2:$F$5000=$G$3),MATCH('В расчёт'!$B$2:$B$5000,'В расчёт'!$B$2:$B$5000,0))),ROW('В расчёт'!$B$2:$B$5000)-ROW('В расчёт'!B7)+1)> 0)),\"0\")","v":0}]
[null,null,null,null,{"$f":"IF(F17<>\"\",COUNTA(F$11:$F17),\"\")","v":7},"МЖУ-16.07.01.301-01",10,null,0.48299999999999998,4.83,3.5738068812430634E-2,null,"1034/10 ПР-Ф-180М",null,{"$f":"IFERROR(SUM(--(FREQUENCY(IF('В расчёт'!$B$2:$B$5000<>\"\",IF(('В расчёт'!$M$2:$M$5000=Таблица4[[#This Row],[машина]])*('В расчёт'!$F$2:$F$5000=$G$3),MATCH('В расчёт'!$B$2:$B$5000,'В расчёт'!$B$2:$B$5000,0))),ROW('В расчёт'!$B$2:$B$5000)-ROW('В расчёт'!B8)+1)> 0)),\"0\")","v":0}]
[null,null,null,null,{"$f":"IF(F18<>\"\",COUNTA(F$11:$F18),\"\")","v":""},"",0,null,"",0,0,null,"МТУ-15.00.00.000-01 [16]",null,{"$f":"IFERROR(SUM(--(FREQUENCY(IF('В расчёт'!$B$2:$B$5000<>\"\",IF(('В расчёт'!$M$2:$M$5000=Таблица4[[#This Row],[машина]])*('В расчёт'!$F$2:$F$5000=$G$3),MATCH('В расчёт'!$B$2:$B$5000,'В расчёт'!$B$2:$B$5000,0))),ROW('В расчёт'!$B$2:$B$5000)-ROW('В расчёт'!B9)+1)> 0)),\"0\")","v":0}]
[null,null,null,null,{"$f":"IF(F19<>\"\",COUNTA(F$11:$F19),\"\")","v":""},"",0,null,"",0,0,null,"МЖУ-20.00.00.000 [16]",null,{"$f":"IFERROR(SUM(--(FREQUENCY(IF('В расчёт'!$B$2:$B$5000<>\"\",IF(('В расчёт'!$M$2:$M$5000=Таблица4[[#This Row],[машина]])*('В расчёт'!$F$2:$F$5000=$G$3),MATCH('В расчёт'!$B$2:$B$5000,'В расчёт'!$B$2:$B$5000,0))),ROW('В расчёт'!$B$2:$B$5000)-ROW('В расчёт'!B10)+1)> 0)),\"0\")","v":0}]
[null,null,null,null,{"$f":"IF(F20<>\"\",COUNTA(F$11:$F20),\"\")","v":""},"",0,null,"",0,0,null,"МТТ-9.00.00.000",null,{"$f":"IFERROR(SUM(--(FREQUENCY(IF('В расчёт'!$B$2:$B$5000<>\"\",IF(('В расчёт'!$M$2:$M$5000=Таблица4[[#This Row],[машина]])*('В расчёт'!$F$2:$F$5000=$G$3),MATCH('В расчёт'!$B$2:$B$5000,'В расчёт'!$B$2:$B$5000,0))),ROW('В расчёт'!$B$2:$B$5000)-ROW('В расчёт'!B11)+1)> 0)),\"0\")","v":0}]
[null,null,null,null,{"$f":"IF(F21<>\"\",COUNTA(F$11:$F21),\"\")","v":""},"",0,null,"",0,0,null,"966/22 МЖТ-Ф-11 (ТД, Москва)",null,{"$f":"IFERROR(SUM(--(FREQUENCY(IF('В расчёт'!$B$2:$B$5000<>\"\",IF(('В расчёт'!$M$2:$M$5000=Таблица4[[#This Row],[машина]])*('В расчёт'!$F$2:$F$5000=$G$3),MATCH('В расчёт'!$B$2:$B$5000,'В расчёт'!$B$2:$B$5000,0))),ROW('В расчёт'!$B$2:$B$5000)-ROW('В расчёт'!B12)+1)> 0)),\"0\")","v":0},null,null,null,null,null,"ЕСЛИОШИБКА(СУММ(--(ЧАСТОТА(ЕСЛИ('В расчёт'!$M$2:$M$5000<>\"\";ЕСЛИ(('В расчёт'!$b$2:$b$5000=[@ДСЕ])*('В расчёт'!$f$2:$f$5000=$G$3)*('В расчёт'!$n$2:$n$5000>0);ПОИСКПОЗ('В расчёт'!$M$2:$M$5000;'В расчёт'!$M$2:$M$5000;0)));СТРОКА('В расчёт'!$M$2:$M$5000)-СТРОКА('В расчёт'!M2)+1)> 0));\"0\")"]
[null,null,null,null,{"$f":"IF(F22<>\"\",COUNTA(F$11:$F22),\"\")","v":""},"",0,null,"",0,0,null,"949/22 МЖТ-Ф-11 (РБ)",null,{"$f":"IFERROR(SUM(--(FREQUENCY(IF('В расчёт'!$B$2:$B$5000<>\"\",IF(('В расчёт'!$M$2:$M$5000=Таблица4[[#This Row],[машина]])*('В расчёт'!$F$2:$F$5000=$G$3),MATCH('В расчёт'!$B$2:$B$5000,'В расчёт'!$B$2:$B$5000,0))),ROW('В расчёт'!$B$2:$B$5000)-ROW('В расчёт'!B13)+1)> 0)),\"0\")","v":0}]
[null,null,null,null,{"$f":"IF(F23<>\"\",COUNTA(F$11:$F23),\"\")","v":""},"",0,null,"",0,0,null,"МШХ-9М.00.00.000",null,{"$f":"IFERROR(SUM(--(FREQUENCY(IF('В расчёт'!$B$2:$B$5000<>\"\",IF(('В расчёт'!$M$2:$M$5000=Таблица4[[#This Row],[машина]])*('В расчёт'!$F$2:$F$5000=$G$3),MATCH('В расчёт'!$B$2:$B$5000,'В расчёт'!$B$2:$B$5000,0))),ROW('В расчёт'!$B$2:$B$5000)-ROW('В расчёт'!B14)+1)> 0)),\"0\")","v":0}]
[null,null,null,null,{"$f":"IF(F24<>\"\",COUNTA(F$11:$F24),\"\")","v":""},"",0,null,"",0,0,null,"МЖТ Ф 11.00.00.000 [9]",null,{"$f":"IFERROR(SUM(--(FREQUENCY(IF('В расчёт'!$B$2:$B$5000<>\"\",IF(('В расчёт'!$M$2:$M$5000=Таблица4[[#This Row],[машина]])*('В расчёт'!$F$2:$F$5000=$G$3),MATCH('В расчёт'!$B$2:$B$5000,'В расчёт'!$B$2:$B$5000,0))),ROW('В расчёт'!$B$2:$B$5000)-ROW('В расчёт'!B15)+1)> 0)),\"0\")","v":0}]
[null,null,null,null,{"$f":"IF(F25<>\"\",COUNTA(F$11:$F25),\"\")","v":""},"",0,null,"",0,0,null,"1117/22 МЖУ-20",null,{"$f":"IFERROR(SUM(--(FREQUENCY(IF('В расчёт'!$B$2:$B$5000<>\"\",IF(('В расчёт'!$M$2:$M$5000=Таблица4[[#This Row],[машина]])*('В расчёт'!$F$2:$F$5000=$G$3),MATCH('В расчёт'!$B$2:$B$5000,'В расчёт'!$B$2:$B$5000,0))),ROW('В расчёт'!$B$2:$B$5000)-ROW('В расчёт'!B16)+1)> 0)),\"0\")","v":0}]
[null,null,null,null,{"$f":"IF(F26<>\"\",COUNTA(F$11:$F26),\"\")","v":""},"",0,null,"",0,0,null,"808-22 ПСТБ-12 (С элементами для агр. в составе автопоезда)",null,{"$f":"IFERROR(SUM(--(FREQUENCY(IF('В расчёт'!$B$2:$B$5000<>\"\",IF(('В расчёт'!$M$2:$M$5000=Таблица4[[#This Row],[машина]])*('В расчёт'!$F$2:$F$5000=$G$3),MATCH('В расчёт'!$B$2:$B$5000,'В расчёт'!$B$2:$B$5000,0))),ROW('В расчёт'!$B$2:$B$5000)-ROW('В расчёт'!B17)+1)> 0)),\"0\")","v":0}]
[null,null,null,null,{"$f":"IF(F27<>\"\",COUNTA(F$11:$F27),\"\")","v":""},"",0,null,"",0,0,null,"МЖУ-20А.00.00.000",null,{"$f":"IFERROR(SUM(--(FREQUENCY(IF('В расчёт'!$B$2:$B$5000<>\"\",IF(('В расчёт'!$M$2:$M$5000=Таблица4[[#This Row],[машина]])*('В расчёт'!$F$2:$F$5000=$G$3),MATCH('В расчёт'!$B$2:$B$5000,'В расчёт'!$B$2:$B$5000,0))),ROW('В расчёт'!$B$2:$B$5000)-ROW('В расчёт'!B18)+1)> 0)),\"0\")","v":0}]
[null,null,null,null,{"$f":"IF(F28<>\"\",COUNTA(F$11:$F28),\"\")","v":""},"",0,null,"",0,0,null,"МЖУ-20Б.00.00.000",null,{"$f":"IFERROR(SUM(--(FREQUENCY(IF('В расчёт'!$B$2:$B$5000<>\"\",IF(('В расчёт'!$M$2:$M$5000=Таблица4[[#This Row],[машина]])*('В расчёт'!$F$2:$F$5000=$G$3),MATCH('В расчёт'!$B$2:$B$5000,'В расчёт'!$B$2:$B$5000,0))),ROW('В расчёт'!$B$2:$B$5000)-ROW('В расчёт'!B19)+1)> 0)),\"0\")","v":0}]
[null,null,null,null,{"$f":"IF(F29<>\"\",COUNTA(F$11:$F29),\"\")","v":""},"",0,null,"",0,0,null,"960-22 (ПСТ-18 смотровой люк, надставные борта цельно металлические 560 мм - Москва)",null,{"$f":"IFERROR(SUM(--(FREQUENCY(IF('В расчёт'!$B$2:$B$5000<>\"\",IF(('В расчёт'!$M$2:$M$5000=Таблица4[[#This Row],[машина]])*('В расчёт'!$F$2:$F$5000=$G$3),MATCH('В расчёт'!$B$2:$B$5000,'В расчёт'!$B$2:$B$5000,0))),ROW('В расчёт'!$B$2:$B$5000)-ROW('В расчёт'!B20)+1)> 0)),\"0\")","v":0},null,null,null,null,null,"Добрый день. Необходима помощь в написании макроса вставки формул в H11 и O11. Нашёл несколько похожих вариантов, но что то не очень получается.\nПри использовании такого кода (смог написать только для одного столбца), почемуто добавляется знак \"@\" в некоторых местах, но не во всех, в связи с чем формула не работает.\n\nSub SetCellFormula()\n    Dim strFormula As String\nstrFormula = strFormula & \"=ЕСЛИОШИБКА(СУММ(--(ЧАСТОТА(ЕСЛИ('В расчёт'!$B$2:$B$5000<>\"\"\"\";\"\nstrFormula = strFormula & \"ЕСЛИ(('В расчёт'!$M$2:$M$5000=[@машина])*('В расчёт'!$F$2:$F$5000=$G$3);\"\nstrFormula = strFormula & \"ПОИСКПОЗ('В расчёт'!$B$2:$B$5000;'В расчёт'!$B$2:$B$5000;0)));СТРОКА('В расчёт'!$B$2:$B$5000)-СТРОКА('В расчёт'!B2)+1)> 0));\"\"0\"\")\"\n Range(\"o11\").FormulaLocal = strFormula\nEnd Sub\n\nВставляет в О11 следующее:\nЕСЛИОШИБКА(СУММ(--(ЧАСТОТА(ЕСЛИ(@'В расчёт'!$B$2:$B$5000<>\"\";ЕСЛИ((@'В расчёт'!$M$2:$M$5000=[@машина])*(@'В расчёт'!$F$2:$F$5000=$G$3);ПОИСКПОЗ(@'В расчёт'!$B$2:$B$5000;'В расчёт'!$B$2:$B$5000;0)));СТРОКА('В расчёт'!$B$2:$B$5000)-СТРОКА('В расчёт'!B2)+1)> 0));\"0\")"]
[null,null,null,null,{"$f":"IF(F30<>\"\",COUNTA(F$11:$F30),\"\")","v":""},"",0,null,"",0,0,null,"1032-22 (ПСТ-24 смотровой люк, петля 90+гайка, надставн. цельн. 560мм)",null,{"$f":"IFERROR(SUM(--(FREQUENCY(IF('В расчёт'!$B$2:$B$5000<>\"\",IF(('В расчёт'!$M$2:$M$5000=Таблица4[[#This Row],[машина]])*('В расчёт'!$F$2:$F$5000=$G$3),MATCH('В расчёт'!$B$2:$B$5000,'В расчёт'!$B$2:$B$5000,0))),ROW('В расчёт'!$B$2:$B$5000)-ROW('В расчёт'!B21)+1)> 0)),\"0\")","v":0}]
[null,null,null,null,{"$f":"IF(F31<>\"\",COUNTA(F$11:$F31),\"\")","v":""},"",0,null,"",0,0,null,"961-22 (ПСТ-18 смотровой люк, Москва)",null,{"$f":"IFERROR(SUM(--(FREQUENCY(IF('В расчёт'!$B$2:$B$5000<>\"\",IF(('В расчёт'!$M$2:$M$5000=Таблица4[[#This Row],[машина]])*('В расчёт'!$F$2:$F$5000=$G$3),MATCH('В расчёт'!$B$2:$B$5000,'В расчёт'!$B$2:$B$5000,0))),ROW('В расчёт'!$B$2:$B$5000)-ROW('В расчёт'!B22)+1)> 0)),\"0\")","v":0}]
[null,null,null,null,{"$f":"IF(F32<>\"\",COUNTA(F$11:$F32),\"\")","v":""},"",0,null,"",0,0,null,"826/58 МЖТ-Ф-11 (внутр.обработка резервуара)",null,{"$f":"IFERROR(SUM(--(FREQUENCY(IF('В расчёт'!$B$2:$B$5000<>\"\",IF(('В расчёт'!$M$2:$M$5000=Таблица4[[#This Row],[машина]])*('В расчёт'!$F$2:$F$5000=$G$3),MATCH('В расчёт'!$B$2:$B$5000,'В расчёт'!$B$2:$B$5000,0))),ROW('В расчёт'!$B$2:$B$5000)-ROW('В расчёт'!B23)+1)> 0)),\"0\")","v":0}]
[null,null,null,null,{"$f":"IF(F33<>\"\",COUNTA(F$11:$F33),\"\")","v":""},"",0,null,"",0,0,null,"990/22 (ДЛЯ ЦЕНЫ) ПСТ-12-01 (ТД)",null,{"$f":"IFERROR(SUM(--(FREQUENCY(IF('В расчёт'!$B$2:$B$5000<>\"\",IF(('В расчёт'!$M$2:$M$5000=Таблица4[[#This Row],[машина]])*('В расчёт'!$F$2:$F$5000=$G$3),MATCH('В расчёт'!$B$2:$B$5000,'В расчёт'!$B$2:$B$5000,0))),ROW('В расчёт'!$B$2:$B$5000)-ROW('В расчёт'!B24)+1)> 0)),\"0\")","v":0}]
[null,null,null,null,{"$f":"IF(F34<>\"\",COUNTA(F$11:$F34),\"\")","v":""},"",0,null,"",0,0,null,"770/58 МЖТ-3 (Зелёная)",null,{"$f":"IFERROR(SUM(--(FREQUENCY(IF('В расчёт'!$B$2:$B$5000<>\"\",IF(('В расчёт'!$M$2:$M$5000=Таблица4[[#This Row],[машина]])*('В расчёт'!$F$2:$F$5000=$G$3),MATCH('В расчёт'!$B$2:$B$5000,'В расчёт'!$B$2:$B$5000,0))),ROW('В расчёт'!$B$2:$B$5000)-ROW('В расчёт'!B25)+1)> 0)),\"0\")","v":0}]
[null,null,null,null,{"$f":"IF(F35<>\"\",COUNTA(F$11:$F35),\"\")","v":""},"",0,null,"",0,0,null,"ИСРВ-12.00.00.000-01",null,{"$f":"IFERROR(SUM(--(FREQUENCY(IF('В расчёт'!$B$2:$B$5000<>\"\",IF(('В расчёт'!$M$2:$M$5000=Таблица4[[#This Row],[машина]])*('В расчёт'!$F$2:$F$5000=$G$3),MATCH('В расчёт'!$B$2:$B$5000,'В расчёт'!$B$2:$B$5000,0))),ROW('В расчёт'!$B$2:$B$5000)-ROW('В расчёт'!B26)+1)> 0)),\"0\")","v":0}]
[null,null,null,null,{"$f":"IF(F36<>\"\",COUNTA(F$11:$F36),\"\")","v":""},"",0,null,"",0,0,null,"",null,{"$f":"IFERROR(SUM(--(FREQUENCY(IF('В расчёт'!$B$2:$B$5000<>\"\",IF(('В расчёт'!$M$2:$M$5000=Таблица4[[#This Row],[машина]])*('В расчёт'!$F$2:$F$5000=$G$3),MATCH('В расчёт'!$B$2:$B$5000,'В расчёт'!$B$2:$B$5000,0))),ROW('В расчёт'!$B$2:$B$5000)-ROW('В расчёт'!B27)+1)> 0)),\"0\")","v":0}]
[null,null,null,null,{"$f":"IF(F37<>\"\",COUNTA(F$11:$F37),\"\")","v":""},"",0,null,"",0,0,null,"",null,{"$f":"IFERROR(SUM(--(FREQUENCY(IF('В расчёт'!$B$2:$B$5000<>\"\",IF(('В расчёт'!$M$2:$M$5000=Таблица4[[#This Row],[машина]])*('В расчёт'!$F$2:$F$5000=$G$3),MATCH('В расчёт'!$B$2:$B$5000,'В расчёт'!$B$2:$B$5000,0))),ROW('В расчёт'!$B$2:$B$5000)-ROW('В расчёт'!B28)+1)> 0)),\"0\")","v":0}]
[null,null,null,null,{"$f":"IF(F38<>\"\",COUNTA(F$11:$F38),\"\")","v":""},"",0,null,"",0,0,null,"",null,{"$f":"IFERROR(SUM(--(FREQUENCY(IF('В расчёт'!$B$2:$B$5000<>\"\",IF(('В расчёт'!$M$2:$M$5000=Таблица4[[#This Row],[машина]])*('В расчёт'!$F$2:$F$5000=$G$3),MATCH('В расчёт'!$B$2:$B$5000,'В расчёт'!$B$2:$B$5000,0))),ROW('В расчёт'!$B$2:$B$5000)-ROW('В расчёт'!B29)+1)> 0)),\"0\")","v":0}]
[null,null,null,null,{"$f":"IF(F39<>\"\",COUNTA(F$11:$F39),\"\")","v":""},"",0,null,"",0,0,null,"",null,{"$f":"IFERROR(SUM(--(FREQUENCY(IF('В расчёт'!$B$2:$B$5000<>\"\",IF(('В расчёт'!$M$2:$M$5000=Таблица4[[#This Row],[машина]])*('В расчёт'!$F$2:$F$5000=$G$3),MATCH('В расчёт'!$B$2:$B$5000,'В расчёт'!$B$2:$B$5000,0))),ROW('В расчёт'!$B$2:$B$5000)-ROW('В расчёт'!B30)+1)> 0)),\"0\")","v":0}]
[null,null,null,null,{"$f":"IF(F40<>\"\",COUNTA(F$11:$F40),\"\")","v":""},"",0,null,"",0,0,null,"",null,{"$f":"IFERROR(SUM(--(FREQUENCY(IF('В расчёт'!$B$2:$B$5000<>\"\",IF(('В расчёт'!$M$2:$M$5000=Таблица4[[#This Row],[машина]])*('В расчёт'!$F$2:$F$5000=$G$3),MATCH('В расчёт'!$B$2:$B$5000,'В расчёт'!$B$2:$B$5000,0))),ROW('В расчёт'!$B$2:$B$5000)-ROW('В расчёт'!B31)+1)> 0)),\"0\")","v":0}]
{"$rows_left_out":172}
{"sheet":"В расчёт","index":1,"n_rows":37,"n_cols":14,"rows_kept":37,"cut":false,"hidden":false,"merged":[]}
[]
[null,"086СХ 12,8-07.302 [8]",null,null,null,"40534",null,null,null,null,null,null,"826/58 МЖТ-Ф-11 (внутр.обработка резервуара)",1]
[null,"086СХ 12,8-07.101 [4]",null,null,null,"40534",null,null,null,null,null,null,"826/58 МЖТ-Ф-11 (внутр.обработка резервуара)",1]
[null,"ПС 2,5.01.02.102 [1]",null,null,null,"40534",null,null,null,null,null,null,"770/58 МЖТ-3 (Зелёная)",2]
[null,"МТУ-24.02.01.302",null,null,null,"40534",null,null,null,null,null,null,"1117/22 МЖУ-20",2]
[null,"МЖУ-16.07.01.301-02",null,null,null,"40534",null,null,null,null,null,null,"РУ-7000-1.00.00.000",20]
[null,"086СХ 12,8-07.302 [8]",null,null,null,"40534",null,null,null,null,null,null,"ПСТ-12.00.00.000",20]
[null,"086СХ 12,8-07.101 [4]",null,null,null,"40534",null,null,null,null,null,null,"ПСТ-12.00.00.000",20]
[null,"МЖУ-16.07.01.301-01",null,null,null,"40534",null,null,null,null,null,null,"МШХ-9М.00.00.000",5]
[null,"МЖУ-16.07.01.301-02",null,null,null,"40534",null,null,null,null,null,null,"МШХ-9М.00.00.000",5]
[null,"МТУ-24.02.01.302",null,null,null,"40534",null,null,null,null,null,null,"МТУ-20.00.00.000-01 [18]",20]
[null,"МЖУ-16.07.01.301 [2]",null,null,null,"40534",null,null,null,null,null,null,"МТУ-15.00.00.000-01 [16]",15]
[null,"086СХ 12,8-07.302 [8]",null,null,null,"40534",null,null,null,null,null,null,"МТТ-9.00.00.000",6]
[null,"086СХ 12,8-07.101 [4]",null,null,null,"40534",null,null,null,null,null,null,"МТТ-9.00.00.000",6]
[null,"МТУ-24.02.01.302",null,null,null,"40534",null,null,null,null,null,null,"МЖУ-20Б.00.00.000",1]
[null,"МЖУ-16.07.01.301 [2]",null,null,null,"40534",null,null,null,null,null,null,"МЖУ-20А.00.00.000",1]
[null,"МТУ-24.02.01.302",null,null,null,"40534",null,null,null,null,null,null,"МЖУ-20А.00.00.000",1]
[null,"МТУ-24.02.01.302",null,null,null,"40534",null,null,null,null,null,null,"МЖУ-20.00.00.000 [16]",3]
[null,"086СХ 12,8-07.302 [8]",null,null,null,"40534",null,null,null,null,null,null,"МЖТ Ф 11.00.00.000 [9]",5]
[null,"086СХ 12,8-07.101 [4]",null,null,null,"40534",null,null,null,null,null,null,"МЖТ Ф 11.00.00.000 [9]",5]
[null,"МЖУ-16.07.01.301-02",null,null,null,"40534",null,null,null,null,null,null,"ИСРВ-12.00.00.000-01",1]
[null,"086СХ 12,8-07.302 [8]",null,null,null,"40534",null,null,null,null,null,null,"990/22 (ДЛЯ ЦЕНЫ) ПСТ-12-01 (ТД)",1]
[null,"086СХ 12,8-07.101 [4]",null,null,null,"40534",null,null,null,null,null,null,"990/22 (ДЛЯ ЦЕНЫ) ПСТ-12-01 (ТД)",1]
[null,"086СХ 12,8-07.302 [8]",null,null,null,"40534",null,null,null,null,null,null,"966/22 МЖТ-Ф-11 (ТД, Москва)",6]
[null,"086СХ 12,8-07.101 [4]",null,null,null,"40534",null,null,null,null,null,null,"966/22 МЖТ-Ф-11 (ТД, Москва)",6]
[null,"МЖУ-16.07.01.301 [2]",null,null,null,"40534",null,null,null,null,null,null,"961-22 (ПСТ-18 смотровой люк, Москва)",2]
[null,"МЖУ-16.07.01.301 [2]",null,null,null,"40534",null,null,null,null,null,null,"960-22 (ПСТ-18 смотровой люк, надставные борта цельно металлические 560 мм - Москва)",4]
[null,"086СХ 12,8-07.302 [8]",null,null,null,"40534",null,null,null,null,null,null,"949/22 МЖТ-Ф-11 (РБ)",6]
[null,"086СХ 12,8-07.101 [4]",null,null,null,"40534",null,null,null,null,null,null,"949/22 МЖТ-Ф-11 (РБ)",6]
[null,"ПС 2,5.01.02.102 [1]",null,null,null,"40534",null,null,null,null,null,null,"926/10 ПРФ-145М (КАИК)",90]
[null,"086СХ 12,8-07.302 [8]",null,null,null,"40534",null,null,null,null,null,null,"879/22 (эпоксидное покрытие РБ)",20]
[null,"086СХ 12,8-07.101 [4]",null,null,null,"40534",null,null,null,null,null,null,"879/22 (эпоксидное покрытие РБ)",20]
[null,"086СХ 12,8-07.302 [8]",null,null,null,"40534",null,null,null,null,null,null,"808-22 ПСТБ-12 (С элементами для агр. в составе автопоезда)",4]
[null,"086СХ 12,8-07.101 [4]",null,null,null,"40534",null,null,null,null,null,null,"808-22 ПСТБ-12 (С элементами для агр. в составе автопоезда)",4]
[null,"ПС 2,5.01.02.102 [1]",null,null,null,"40534",null,null,null,null,null,null,"1100/58 2ПТС-5.00.00.000М-01 (Нигерия)",240]
[null,"ПС 2,5.01.02.102 [1]",null,null,null,"40534",null,null,null,null,null,null,"1034/10 ПР-Ф-180М",30]
[null,"МЖУ-16.07.01.301 [2]",null,null,null,"40534",null,null,null,null,null,null,"1032-22 (ПСТ-24 смотровой люк, петля 90+гайка, надставн. цельн. 560мм)",2]