{"text_format":"1","workbook":"xlsx","n_sheets":3,"sheets":["Лист1","Лист2","Заявка"],"not_rendered":{"charts":0,"images":0,"macros":0,"external_links":0,"defined_names":2,"comments":0,"pivot_tables":0},"unopened":[],"bounds":{"document_bytes":16777216,"sheet_cells":100000,"rows_first":2000,"rows_last":500,"rows_between":2000,"halvings":0,"cell_chars":16384,"cell_head_chars":4096},"cells_cut":0,"cells_raw":0,"read":"whole","date_system":"1900"}

{"sheet":"Лист1","index":0,"n_rows":5,"n_cols":4,"rows_kept":5,"cut":false,"hidden":false,"merged":[[0,0,0,1]]}
["наименование",null,"стоимость","V"]
["3а",null,{"$f":"IFERROR(VLOOKUP(A2,Лист2!A1:B3,2,FALSE),\" \")","v":300},{"$f":"IFERROR(VLOOKUP(A2,Лист2!A1:C3,3,FALSE),\" \")","v":"V"}]
[null,"1а"]
[]
["1а"]

{"sheet":"Лист2","index":1,"n_rows":3,"n_cols":3,"rows_kept":3,"cut":false,"hidden":false,"merged":[]}
["1а",100,"V"]
["2а",200,"V"]
["3а",300,"V"]

{"sheet":"Заявка","index":2,"n_rows":17,"n_cols":10,"rows_kept":17,"cut":false,"hidden":false,"merged":[[0,0,0,10],[2,3,2,4],[2,5,2,6],[2,7,2,10],[4,5,4,7],[4,9,4,10],[4,0,4,4],[11,0,11,4],[12,0,12,4],[5,5,5,7],[5,9,5,10],[6,5,6,7],[7,5,7,7],[8,5,8,7],[9,5,9,7],[10,5,10,7],[11,5,11,7],[5,0,5,4],[6,0,6,4],[7,0,7,4],[8,0,8,4],[9,0,9,4],[10,0,10,4],[12,5,12,7],[6,9,6,10],[7,9,7,10],[8,9,8,10],[9,9,9,10],[10,9,10,10],[11,9,11,10],[12,9,12,10],[14,1,14,2],[14,5,14,6],[14,7,14,10],[16,2,16,10],[17,0,17,10]]}
["Заявка на приобретение заказных материалов, фурнитуры, бытовой техники."]
["Дата составления:"]
["Дата выполнения заказа:",null,null,null,null,"Ф.И.О Заказчика:"]
[]
["наименование",null,null,null,null,"артикул",null,null,"кол-во","стоимость"]
[{"$f":"INDEX(Лист1!$A$2:$B$3,SMALL(IF(Лист1!$C$3=\"v\",ROW(Лист1!$A$2:$B$3)-1),ROW()-5))","v":{"$error":"#REF!"}},null,null,null,null,null,null,null,null,{"$f":"INDEX(Лист1!$C$2,SMALL(IF(Лист1!$D$2=\"v\",ROW(Лист1!$C$2)-1),ROW()-5))","v":300}]
[]
[]
[]
[]
[]
[]
[]
[]
["Выставка:",null,null,null,null,"Продавец:"]
[]
["Примечание:"]