{"text_format":"1","workbook":"xlsx","n_sheets":2,"sheets":["СПИСОК","2026"],"not_rendered":{"charts":0,"images":0,"macros":1,"external_links":0,"defined_names":521,"comments":1,"pivot_tables":0},"unopened":[],"bounds":{"document_bytes":16777216,"sheet_cells":100000,"rows_first":2000,"rows_last":500,"rows_between":2000,"halvings":0,"cell_chars":16384,"cell_head_chars":4096},"cells_cut":0,"cells_raw":0,"read":"whole","date_system":"1900"}

{"sheet":"СПИСОК","index":0,"n_rows":14,"n_cols":18,"rows_kept":14,"cut":false,"hidden":false,"merged":[]}
["Иванов","ол",null,"Яблоко"]
["Петров","тг",null,"Груша"]
["Сидоров","пр",null,"Слива",null,null,null,null,null,null,null,null,null,null,null,null,null,{"$f":"SUMIFS('2026'!M:M,'2026'!B:B,\">=01.01.2026\",'2026'!B:B,\"<01.02.2026\",'2026'!J:J,СПИСОК!D1,'2026'!J:J,СПИСОК!D2,СПИСОК!D1,'2026'!E:E)","v":{"$error":"#VALUE!"}}]
["Соловьев","пр",null,"Томат"]
["Козлов","нд",null,"Черешня"]
["Лавреньтев","ам",null,"Клубника"]
["Игнатов","ам",null,"Персик"]
["Григорьев","ол",null,"Земляника"]
[null,null,null,"Банан"]
[null,null,null,"Апельсин"]
[null,null,null,"Мандарин"]
[null,null,null,"Картофель"]
[null,null,null,"Морковь"]
[null,null,null,"Лимон"]

{"sheet":"2026","index":1,"n_rows":192,"n_cols":22,"rows_kept":192,"cut":false,"hidden":false,"merged":[]}
["ЗАЯВКА №","ДАТА\nЗАЯВКИ","ДАТА\nПОГРУЗКИ",null,null,null,null,null,null,null,null,null,null,null,null,null,null,{"$f":"SUMPRODUCT(SUMIFS(M:M,E:E,{\"тг\";\"пр\"},J:J,{\"Груша\",\"Слива\"},B:B,\">=01/01/2026\",B:B,\"<\"&EOMONTH(\"01/01/2026\",0)))","v":210836.1},null,null,null,665678.89]
["26-0001","2026-01-14","2026-01-15","Сидоров",{"$f":"IFERROR(INDEX(СПИСОК!$B$1:$B$10,MATCH(D2,СПИСОК!$A$1:$A$10,0)),\"\")","v":"пр"},null,null,null,null,"Яблоко",{"$f":"AND(OR(J2=\"Слива\",J2=\"Груша\"),OR(E2=\"пр\",E2=\"тг\"),MONTH(B2)=1)","v":false},null,118933.5,null,null,null,null,{"$f":"SUMPRODUCT((MONTH(B2:B350)=1)*ISNUMBER(MATCH(E2:E350,СПИСОК!B2:B3,)*MATCH(J2:J350,СПИСОК!D2:D3,))*M2:M350)","v":210836.09999999998}]
["26-0002","2026-01-14","2026-01-16","Соловьев",{"$f":"IFERROR(INDEX(СПИСОК!$B$1:$B$10,MATCH(D3,СПИСОК!$A$1:$A$10,0)),\"\")","v":"пр"},null,null,null,null,"Груша",{"$f":"AND(OR(J3=\"Слива\",J3=\"Груша\"),OR(E3=\"пр\",E3=\"тг\"),MONTH(B3)=1)","v":true},null,177040.5,null,null,null,null,{"$f":"SUMIF(K:K,TRUE,M:M)","v":210836.09999999998}]
["26-0003","2026-01-15","2026-01-16","Петров",{"$f":"IFERROR(INDEX(СПИСОК!$B$1:$B$10,MATCH(D4,СПИСОК!$A$1:$A$10,0)),\"\")","v":"тг"},null,null,null,null,"Слива",true,null,16854.77]
["26-0004","2026-01-15","2025-12-19","Иванов",{"$f":"IFERROR(INDEX(СПИСОК!$B$1:$B$10,MATCH(D5,СПИСОК!$A$1:$A$10,0)),\"\")","v":"ол"},null,null,null,null,"Томат",false,null,66356.160000000003]
["26-0005","2026-01-16","2026-01-19","Иванов",{"$f":"IFERROR(INDEX(СПИСОК!$B$1:$B$10,MATCH(D6,СПИСОК!$A$1:$A$10,0)),\"\")","v":"ол"},null,null,null,null,"Черешня",false,null,13638.64]
["26-0006","2026-01-16","2026-01-20","Петров",{"$f":"IFERROR(INDEX(СПИСОК!$B$1:$B$10,MATCH(D7,СПИСОК!$A$1:$A$10,0)),\"\")","v":"тг"},null,null,null,null,"Клубника",false,null,30146.44]
["26-0007","2026-01-19","2026-01-20","Козлов",{"$f":"IFERROR(INDEX(СПИСОК!$B$1:$B$10,MATCH(D8,СПИСОК!$A$1:$A$10,0)),\"\")","v":"нд"},null,null,null,null,"Персик",false,null,47431.17]
["26-0008","2026-01-19","2026-01-20","Соловьев",{"$f":"IFERROR(INDEX(СПИСОК!$B$1:$B$10,MATCH(D9,СПИСОК!$A$1:$A$10,0)),\"\")","v":"пр"},null,null,null,null,"Земляника",false,null,19762.97]
["26-0009","2026-01-19","2026-01-30","Сидоров",{"$f":"IFERROR(INDEX(СПИСОК!$B$1:$B$10,MATCH(D10,СПИСОК!$A$1:$A$10,0)),\"\")","v":"пр"},null,null,null,null,"Банан",false,null,110633.12]
["26-0010","2026-01-19","2026-01-20","Иванов",{"$f":"IFERROR(INDEX(СПИСОК!$B$1:$B$10,MATCH(D11,СПИСОК!$A$1:$A$10,0)),\"\")","v":"ол"},null,null,null,null,"Персик",false,null,20553.5]
["26-0011","2026-01-20","2026-01-20","Лавреньтев",{"$f":"IFERROR(INDEX(СПИСОК!$B$1:$B$10,MATCH(D12,СПИСОК!$A$1:$A$10,0)),\"\")","v":"ам"},null,null,null,null,"Земляника",false,null,21344.01]
["26-0012","2026-01-20","2026-12-29","Игнатов",{"$f":"IFERROR(INDEX(СПИСОК!$B$1:$B$10,MATCH(D13,СПИСОК!$A$1:$A$10,0)),\"\")","v":"ам"},null,null,null,null,"Слива",false,null,47803.06]
["26-0013","2026-01-20","2026-01-22","Козлов",{"$f":"IFERROR(INDEX(СПИСОК!$B$1:$B$10,MATCH(D14,СПИСОК!$A$1:$A$10,0)),\"\")","v":"нд"},null,null,null,null,"Персик",false,null,190235.03]
["26-0014","2026-01-20","2026-01-21","Соловьев",{"$f":"IFERROR(INDEX(СПИСОК!$B$1:$B$10,MATCH(D15,СПИСОК!$A$1:$A$10,0)),\"\")","v":"пр"},null,null,null,null,"Яблоко",false,null,10553.42]
["26-0015","2026-01-21","2026-01-22","Иванов",{"$f":"IFERROR(INDEX(СПИСОК!$B$1:$B$10,MATCH(D16,СПИСОК!$A$1:$A$10,0)),\"\")","v":"ол"},null,null,null,null,"Слива",false,null,102767.47]
["26-0016","2026-01-21","2026-01-22","Соловьев",{"$f":"IFERROR(INDEX(СПИСОК!$B$1:$B$10,MATCH(D17,СПИСОК!$A$1:$A$10,0)),\"\")","v":"пр"},null,null,null,null,"Яблоко",false,null,47431.14]
["26-0017","2026-01-22","2026-01-22","Петров",{"$f":"IFERROR(INDEX(СПИСОК!$B$1:$B$10,MATCH(D18,СПИСОК!$A$1:$A$10,0)),\"\")","v":"тг"},null,null,null,null,"Груша",true,null,16940.830000000002]
["26-0018","2026-01-22","2026-01-23","Иванов",{"$f":"IFERROR(INDEX(СПИСОК!$B$1:$B$10,MATCH(D19,СПИСОК!$A$1:$A$10,0)),\"\")","v":"ол"},null,null,null,null,"Слива",false,null,11857.79]
["26-0019","2026-01-22","2026-01-19","Григорьев",{"$f":"IFERROR(INDEX(СПИСОК!$B$1:$B$10,MATCH(D20,СПИСОК!$A$1:$A$10,0)),\"\")","v":"ол"},null,null,null,null,"Томат",false,null,16940.830000000002]
["26-0020","2026-01-22","2026-01-23","Сидоров",{"$f":"IFERROR(INDEX(СПИСОК!$B$1:$B$10,MATCH(D21,СПИСОК!$A$1:$A$10,0)),\"\")","v":"пр"},null,null,null,null,"Черешня",false,null,26205.7]
["26-0021","2026-01-22","2026-01-16","Соловьев",{"$f":"IFERROR(INDEX(СПИСОК!$B$1:$B$10,MATCH(D22,СПИСОК!$A$1:$A$10,0)),\"\")","v":"пр"},null,null,null,null,"Клубника",false,null,23676.04]
["26-0022","2026-01-22","2026-01-23","Иванов",{"$f":"IFERROR(INDEX(СПИСОК!$B$1:$B$10,MATCH(D23,СПИСОК!$A$1:$A$10,0)),\"\")","v":"ол"},null,null,null,null,"Персик",false,null,47352.09]
["26-0023","2026-01-23","2026-01-26","Петров",{"$f":"IFERROR(INDEX(СПИСОК!$B$1:$B$10,MATCH(D24,СПИСОК!$A$1:$A$10,0)),\"\")","v":"тг"},null,null,null,null,"Земляника",false,null,15391.4]
["26-0024","2026-01-23","2026-01-26","Петров",{"$f":"IFERROR(INDEX(СПИСОК!$B$1:$B$10,MATCH(D25,СПИСОК!$A$1:$A$10,0)),\"\")","v":"тг"},null,null,null,null,"Банан",false,null,144270]
["26-0025","2026-01-23","2026-01-26","Григорьев",{"$f":"IFERROR(INDEX(СПИСОК!$B$1:$B$10,MATCH(D26,СПИСОК!$A$1:$A$10,0)),\"\")","v":"ол"},null,null,null,null,"Апельсин",false,null,24045]
["26-0026","2026-01-26","2026-01-27","Григорьев",{"$f":"IFERROR(INDEX(СПИСОК!$B$1:$B$10,MATCH(D27,СПИСОК!$A$1:$A$10,0)),\"\")","v":"ол"},null,null,null,null,"Мандарин",false,null,102767.47]
["26-0027","2026-01-26","2026-01-27","Григорьев",{"$f":"IFERROR(INDEX(СПИСОК!$B$1:$B$10,MATCH(D28,СПИСОК!$A$1:$A$10,0)),\"\")","v":"ол"},null,null,null,null,"Картофель",false,null,20553.5]
["26-0028","2026-01-26","2026-01-27","Петров",{"$f":"IFERROR(INDEX(СПИСОК!$B$1:$B$10,MATCH(D29,СПИСОК!$A$1:$A$10,0)),\"\")","v":"тг"},null,null,null,null,"Морковь",false,null,20553.5]
["26-0029","2026-01-26","2026-01-27","Петров",{"$f":"IFERROR(INDEX(СПИСОК!$B$1:$B$10,MATCH(D30,СПИСОК!$A$1:$A$10,0)),\"\")","v":"тг"},null,null,null,null,"Лимон",false,null,75099.3]
["26-0030","2026-01-26","2026-01-27","Петров",{"$f":"IFERROR(INDEX(СПИСОК!$B$1:$B$10,MATCH(D31,СПИСОК!$A$1:$A$10,0)),\"\")","v":"тг"},null,null,null,null,"Клубника",false,null,63201.99]
["26-0031","2026-01-26","2026-01-22","Козлов",{"$f":"IFERROR(INDEX(СПИСОК!$B$1:$B$10,MATCH(D32,СПИСОК!$A$1:$A$10,0)),\"\")","v":"нд"},null,null,null,null,"Земляника",false,null,207154.5]
["26-0032","2026-01-27","2026-01-28","Сидоров",{"$f":"IFERROR(INDEX(СПИСОК!$B$1:$B$10,MATCH(D33,СПИСОК!$A$1:$A$10,0)),\"\")","v":"пр"},null,null,null,null,"Яблоко",false,null,41423.19]
["26-0033","2026-01-27","2026-01-27","Григорьев",{"$f":"IFERROR(INDEX(СПИСОК!$B$1:$B$10,MATCH(D34,СПИСОК!$A$1:$A$10,0)),\"\")","v":"ол"},null,null,null,null,"Персик",false,null,47352.09]
["26-0034","2026-01-28","2026-01-29","Петров",{"$f":"IFERROR(INDEX(СПИСОК!$B$1:$B$10,MATCH(D35,СПИСОК!$A$1:$A$10,0)),\"\")","v":"тг"},null,null,null,null,"Черешня",false,null,245000]
["26-0035","2026-01-28","2026-01-29","Игнатов",{"$f":"IFERROR(INDEX(СПИСОК!$B$1:$B$10,MATCH(D36,СПИСОК!$A$1:$A$10,0)),\"\")","v":"ам"},null,null,null,null,"Персик",false,null,19762.97]
["26-0036","2026-01-28","2026-01-29","Иванов",{"$f":"IFERROR(INDEX(СПИСОК!$B$1:$B$10,MATCH(D37,СПИСОК!$A$1:$A$10,0)),\"\")","v":"ол"},null,null,null,null,"Яблоко",false,null,67693.5]
["26-0037","2026-01-28","2026-01-29","Соловьев",{"$f":"IFERROR(INDEX(СПИСОК!$B$1:$B$10,MATCH(D38,СПИСОК!$A$1:$A$10,0)),\"\")","v":"пр"},null,null,null,null,"Яблоко",false,null,27628.639999999999]
["26-0038","2026-01-28","2025-12-26","Лавреньтев",{"$f":"IFERROR(INDEX(СПИСОК!$B$1:$B$10,MATCH(D39,СПИСОК!$A$1:$A$10,0)),\"\")","v":"ам"},null,null,null,null,"Томат",false,null,30146.44]
["26-0039","2026-01-28","2026-01-30","Лавреньтев",{"$f":"IFERROR(INDEX(СПИСОК!$B$1:$B$10,MATCH(D40,СПИСОК!$A$1:$A$10,0)),\"\")","v":"ам"},null,null,null,null,"Персик",false,null,24798.59]
["26-0040","2026-01-28","2026-01-13","Петров",{"$f":"IFERROR(INDEX(СПИСОК!$B$1:$B$10,MATCH(D41,СПИСОК!$A$1:$A$10,0)),\"\")","v":"тг"},null,null,null,null,"Черешня",false,null,11991.38]
["26-0041","2026-01-28","2026-01-30","Петров",{"$f":"IFERROR(INDEX(СПИСОК!$B$1:$B$10,MATCH(D42,СПИСОК!$A$1:$A$10,0)),\"\")","v":"тг"},null,null,null,null,"Яблоко",false,null,20553.5]
["26-0042","2026-01-29","2026-01-30","Соловьев",{"$f":"IFERROR(INDEX(СПИСОК!$B$1:$B$10,MATCH(D43,СПИСОК!$A$1:$A$10,0)),\"\")","v":"пр"},null,null,null,null,"Яблоко",false,null,133597.71]
["26-0043","2026-01-29","2026-01-30","Петров",{"$f":"IFERROR(INDEX(СПИСОК!$B$1:$B$10,MATCH(D44,СПИСОК!$A$1:$A$10,0)),\"\")","v":"тг"},null,null,null,null,"Томат",false,null,10616.68]
["26-0044","2026-01-29","2026-02-02","Иванов",{"$f":"IFERROR(INDEX(СПИСОК!$B$1:$B$10,MATCH(D45,СПИСОК!$A$1:$A$10,0)),\"\")","v":"ол"},null,null,null,null,"Яблоко",false,null,10553.42]
["26-0045","2026-01-29","2026-01-30","Григорьев",{"$f":"IFERROR(INDEX(СПИСОК!$B$1:$B$10,MATCH(D46,СПИСОК!$A$1:$A$10,0)),\"\")","v":"ол"},null,null,null,null,"Груша",false,null,28809.52]
["26-0046","2026-01-30","2026-01-30","Соловьев",{"$f":"IFERROR(INDEX(СПИСОК!$B$1:$B$10,MATCH(D47,СПИСОК!$A$1:$A$10,0)),\"\")","v":"пр"},null,null,null,null,"Яблоко",false,null,19762.97]
["26-0047","2026-02-02","2026-01-30","Козлов",{"$f":"IFERROR(INDEX(СПИСОК!$B$1:$B$10,MATCH(D48,СПИСОК!$A$1:$A$10,0)),\"\")","v":"нд"},null,null,null,null,"Яблоко",false,null,16942.919999999998]
["26-0048","2026-02-02","2026-01-30","Петров",{"$f":"IFERROR(INDEX(СПИСОК!$B$1:$B$10,MATCH(D49,СПИСОК!$A$1:$A$10,0)),\"\")","v":"тг"},null,null,null,null,"Банан",false,null,15652.28]
["26-0049","2026-02-03","2026-01-30","Сидоров",{"$f":"IFERROR(INDEX(СПИСОК!$B$1:$B$10,MATCH(D50,СПИСОК!$A$1:$A$10,0)),\"\")","v":"пр"},null,null,null,null,"Персик",false,null,31249.22]
["26-0050","2026-02-03","2026-03-03","Иванов",{"$f":"IFERROR(INDEX(СПИСОК!$B$1:$B$10,MATCH(D51,СПИСОК!$A$1:$A$10,0)),\"\")","v":"ол"},null,null,null,null,"Земляника",false,null,41423.19]
["26-0051","2026-02-03","2026-01-30","Лавреньтев",{"$f":"IFERROR(INDEX(СПИСОК!$B$1:$B$10,MATCH(D52,СПИСОК!$A$1:$A$10,0)),\"\")","v":"ам"},null,null,null,null,"Томат",false,null,23636.52]
["26-0052","2026-01-22","2026-01-29","Соловьев",{"$f":"IFERROR(INDEX(СПИСОК!$B$1:$B$10,MATCH(D53,СПИСОК!$A$1:$A$10,0)),\"\")","v":"пр"},null,null,null,null,"Клубника",false,null,46178.400000000001]
["26-0053","2026-02-04","2026-02-03","Григорьев",{"$f":"IFERROR(INDEX(СПИСОК!$B$1:$B$10,MATCH(D54,СПИСОК!$A$1:$A$10,0)),\"\")","v":"ол"},null,null,null,null,"Черешня",false,null,13494.16]
["26-0054","2026-02-04","2026-02-05","Петров",{"$f":"IFERROR(INDEX(СПИСОК!$B$1:$B$10,MATCH(D55,СПИСОК!$A$1:$A$10,0)),\"\")","v":"тг"},null,null,null,null,"Яблоко",false,null,19762.97]
["26-0055","2026-02-04","2026-02-06","Козлов",{"$f":"IFERROR(INDEX(СПИСОК!$B$1:$B$10,MATCH(D56,СПИСОК!$A$1:$A$10,0)),\"\")","v":"нд"},null,null,null,null,"Земляника",false,null,55671]
["26-0056","2026-02-04","2026-02-05","Игнатов",{"$f":"IFERROR(INDEX(СПИСОК!$B$1:$B$10,MATCH(D57,СПИСОК!$A$1:$A$10,0)),\"\")","v":"ам"},null,null,null,null,"Груша",false,null,314622]
["26-0057","2026-02-03","2026-02-03","Игнатов",{"$f":"IFERROR(INDEX(СПИСОК!$B$1:$B$10,MATCH(D58,СПИСОК!$A$1:$A$10,0)),\"\")","v":"ам"},null,null,null,null,"Банан",false,null,22134.54]
["26-0058","2026-02-04","2026-02-05","Петров",{"$f":"IFERROR(INDEX(СПИСОК!$B$1:$B$10,MATCH(D59,СПИСОК!$A$1:$A$10,0)),\"\")","v":"тг"},null,null,null,null,"Томат",false,null,114625.25]
["26-0059","2026-02-05","2026-02-03","Петров",{"$f":"IFERROR(INDEX(СПИСОК!$B$1:$B$10,MATCH(D60,СПИСОК!$A$1:$A$10,0)),\"\")","v":"тг"},null,null,null,null,"Черешня",false,null,52885.72]
["26-0060","2026-02-05","2026-01-19","Петров",{"$f":"IFERROR(INDEX(СПИСОК!$B$1:$B$10,MATCH(D61,СПИСОК!$A$1:$A$10,0)),\"\")","v":"тг"},null,null,null,null,"Яблоко",false,null,15019.86]
["26-0061","2026-02-05","2026-02-06","Сидоров",{"$f":"IFERROR(INDEX(СПИСОК!$B$1:$B$10,MATCH(D62,СПИСОК!$A$1:$A$10,0)),\"\")","v":"пр"},null,null,null,null,"Банан",false,null,15019.86]
["26-0062","2026-02-06","2026-02-09","Петров",{"$f":"IFERROR(INDEX(СПИСОК!$B$1:$B$10,MATCH(D63,СПИСОК!$A$1:$A$10,0)),\"\")","v":"тг"},null,null,null,null,"Яблоко",false,null,41423.19]
["26-0063","2026-02-05","2026-02-09","Лавреньтев",{"$f":"IFERROR(INDEX(СПИСОК!$B$1:$B$10,MATCH(D64,СПИСОК!$A$1:$A$10,0)),\"\")","v":"ам"},null,null,null,null,"Банан",false,null,8484.36]
["26-0064","2026-02-09","2026-02-10","Козлов",{"$f":"IFERROR(INDEX(СПИСОК!$B$1:$B$10,MATCH(D65,СПИСОК!$A$1:$A$10,0)),\"\")","v":"нд"},null,null,null,null,"Груша",false,null,116996.81]
["26-0065","2026-02-06","2026-02-10","Петров",{"$f":"IFERROR(INDEX(СПИСОК!$B$1:$B$10,MATCH(D66,СПИСОК!$A$1:$A$10,0)),\"\")","v":"тг"},null,null,null,null,"Банан",false,null,15652.28]
["26-0066","2026-02-06","2026-02-10","Иванов",{"$f":"IFERROR(INDEX(СПИСОК!$B$1:$B$10,MATCH(D67,СПИСОК!$A$1:$A$10,0)),\"\")","v":"ол"},null,null,null,null,"Банан",{"$f":"AND(OR(J67=\"Слива\",J67=\"Груша\"),OR(E67=\"пр\",E67=\"тг\"),MONTH(B67)=1)","v":false},null,15019.86]
["26-0067","2026-02-09","2026-02-10","Соловьев",{"$f":"IFERROR(INDEX(СПИСОК!$B$1:$B$10,MATCH(D68,СПИСОК!$A$1:$A$10,0)),\"\")","v":"пр"},null,null,null,null,"Банан",false,null,39257.17]
["26-0068","2026-02-09","2026-02-11","Игнатов",{"$f":"IFERROR(INDEX(СПИСОК!$B$1:$B$10,MATCH(D69,СПИСОК!$A$1:$A$10,0)),\"\")","v":"ам"},null,null,null,null,"Черешня",false,null,15652.28]
["26-0069","2026-02-10","2026-02-11","Григорьев",{"$f":"IFERROR(INDEX(СПИСОК!$B$1:$B$10,MATCH(D70,СПИСОК!$A$1:$A$10,0)),\"\")","v":"ол"},null,null,null,null,"Банан",false,null,76089.42]
["26-0070","2026-02-11","2026-02-12","Соловьев",{"$f":"IFERROR(INDEX(СПИСОК!$B$1:$B$10,MATCH(D71,СПИСОК!$A$1:$A$10,0)),\"\")","v":"пр"},null,null,null,null,"Томат",false,null,36142.519999999997]
["26-0071","2026-02-11","2026-02-12","Соловьев",{"$f":"IFERROR(INDEX(СПИСОК!$B$1:$B$10,MATCH(D72,СПИСОК!$A$1:$A$10,0)),\"\")","v":"пр"},null,null,null,null,"Клубника",false,null,18925.02]
["26-0072","2026-02-12","2026-02-16","Иванов",{"$f":"IFERROR(INDEX(СПИСОК!$B$1:$B$10,MATCH(D73,СПИСОК!$A$1:$A$10,0)),\"\")","v":"ол"},null,null,null,null,"Персик",false,null,30039.72]
["26-0073","2026-02-12","2026-02-13","Петров",{"$f":"IFERROR(INDEX(СПИСОК!$B$1:$B$10,MATCH(D74,СПИСОК!$A$1:$A$10,0)),\"\")","v":"тг"},null,null,null,null,"Груша",false,null,55324.92]
["26-0074","2026-02-13","2026-02-03","Сидоров",{"$f":"IFERROR(INDEX(СПИСОК!$B$1:$B$10,MATCH(D75,СПИСОК!$A$1:$A$10,0)),\"\")","v":"пр"},null,null,null,null,"Персик",false,null,26442.05]
["26-0075","2026-02-17","2026-02-18","Петров",{"$f":"IFERROR(INDEX(СПИСОК!$B$1:$B$10,MATCH(D76,СПИСОК!$A$1:$A$10,0)),\"\")","v":"тг"},null,null,null,null,"Земляника",false,null,6324.15]
["26-0076","2026-02-18","2026-02-19","Козлов",{"$f":"IFERROR(INDEX(СПИСОК!$B$1:$B$10,MATCH(D77,СПИСОК!$A$1:$A$10,0)),\"\")","v":"нд"},null,null,null,null,"Черешня",false,null,15547.94]
["26-0077","2026-02-17","2026-02-20","Петров",{"$f":"IFERROR(INDEX(СПИСОК!$B$1:$B$10,MATCH(D78,СПИСОК!$A$1:$A$10,0)),\"\")","v":"тг"},null,null,null,null,"Банан",false,null,19762.97]
["26-0078","2026-02-18","2026-02-20","Иванов",{"$f":"IFERROR(INDEX(СПИСОК!$B$1:$B$10,MATCH(D79,СПИСОК!$A$1:$A$10,0)),\"\")","v":"ол"},null,null,null,null,"Банан",false,null,11087.01]
["26-0079","2026-02-17","2026-02-16","Лавреньтев",{"$f":"IFERROR(INDEX(СПИСОК!$B$1:$B$10,MATCH(D80,СПИСОК!$A$1:$A$10,0)),\"\")","v":"ам"},null,null,null,null,"Томат",false,null,288907.5]
["26-0080","2026-02-19","2026-02-20","Игнатов",{"$f":"IFERROR(INDEX(СПИСОК!$B$1:$B$10,MATCH(D81,СПИСОК!$A$1:$A$10,0)),\"\")","v":"ам"},null,null,null,null,"Земляника",false,null,88798.5]
["26-0081","2026-02-19","2026-02-20","Григорьев",{"$f":"IFERROR(INDEX(СПИСОК!$B$1:$B$10,MATCH(D82,СПИСОК!$A$1:$A$10,0)),\"\")","v":"ол"},null,null,null,null,"Слива",false,null,106720.06]
["26-0082","2026-02-19","2026-02-20","Григорьев",{"$f":"IFERROR(INDEX(СПИСОК!$B$1:$B$10,MATCH(D83,СПИСОК!$A$1:$A$10,0)),\"\")","v":"ол"},null,null,null,null,"Слива",false,null,14310.48]
["26-0083","2026-02-24","2026-02-25","Петров",{"$f":"IFERROR(INDEX(СПИСОК!$B$1:$B$10,MATCH(D84,СПИСОК!$A$1:$A$10,0)),\"\")","v":"тг"},null,null,null,null,"Клубника",false,null,45771.05]
["26-0084","2026-02-24","2026-02-25","Иванов",{"$f":"IFERROR(INDEX(СПИСОК!$B$1:$B$10,MATCH(D85,СПИСОК!$A$1:$A$10,0)),\"\")","v":"ол"},null,null,null,null,"Банан",false,null,20553.5]
["26-0085","2026-02-24","2026-02-25","Григорьев",{"$f":"IFERROR(INDEX(СПИСОК!$B$1:$B$10,MATCH(D86,СПИСОК!$A$1:$A$10,0)),\"\")","v":"ол"},null,null,null,null,"Слива",false,null,30000.19]
["26-0086","2026-02-24","2026-02-25","Петров",{"$f":"IFERROR(INDEX(СПИСОК!$B$1:$B$10,MATCH(D87,СПИСОК!$A$1:$A$10,0)),\"\")","v":"тг"},null,null,null,null,"Груша",false,null,75250.559999999998]
["26-0087","2026-02-20","2026-02-25","Сидоров",{"$f":"IFERROR(INDEX(СПИСОК!$B$1:$B$10,MATCH(D88,СПИСОК!$A$1:$A$10,0)),\"\")","v":"пр"},null,null,null,null,"Томат",false,null,22134.54]
["26-0088","2026-02-24","2026-02-27","Петров",{"$f":"IFERROR(INDEX(СПИСОК!$B$1:$B$10,MATCH(D89,СПИСОК!$A$1:$A$10,0)),\"\")","v":"тг"},null,null,null,null,"Черешня",false,null,180103.34]
["26-0089","2026-02-25","2026-02-24","Соловьев",{"$f":"IFERROR(INDEX(СПИСОК!$B$1:$B$10,MATCH(D90,СПИСОК!$A$1:$A$10,0)),\"\")","v":"пр"},null,null,null,null,"Слива",false,null,120225,null,null,null,null,null,null,"Е:Е - тг+пр"]
["26-0090","2026-02-25",null,"Иванов",{"$f":"IFERROR(INDEX(СПИСОК!$B$1:$B$10,MATCH(D91,СПИСОК!$A$1:$A$10,0)),\"\")","v":"ол"},null,null,null,null,"Черешня",false,null,19560]
["26-0091","2026-02-25","2026-02-24","Лавреньтев",{"$f":"IFERROR(INDEX(СПИСОК!$B$1:$B$10,MATCH(D92,СПИСОК!$A$1:$A$10,0)),\"\")","v":"ам"},null,null,null,null,"Персик",false,null,8115.34]
["26-0092","2026-02-26","2026-02-27","Лавреньтев",{"$f":"IFERROR(INDEX(СПИСОК!$B$1:$B$10,MATCH(D93,СПИСОК!$A$1:$A$10,0)),\"\")","v":"ам"},null,null,null,null,"Слива",false,null,23676.04]
["26-0093","2026-02-26","2026-02-27","Григорьев",{"$f":"IFERROR(INDEX(СПИСОК!$B$1:$B$10,MATCH(D94,СПИСОК!$A$1:$A$10,0)),\"\")","v":"ол"},null,null,null,null,"Клубника",false,null,12348]
["26-0094","2026-02-26","2026-02-16","Петров",{"$f":"IFERROR(INDEX(СПИСОК!$B$1:$B$10,MATCH(D95,СПИСОК!$A$1:$A$10,0)),\"\")","v":"тг"},null,null,null,null,"Черешня",false,null,19762.97]
["26-0095","2026-02-26","2026-02-27","Игнатов",{"$f":"IFERROR(INDEX(СПИСОК!$B$1:$B$10,MATCH(D96,СПИСОК!$A$1:$A$10,0)),\"\")","v":"ам"},null,null,null,null,"Черешня",false,null,59447.03]
["26-0096","2026-02-26","2026-03-03","Козлов",{"$f":"IFERROR(INDEX(СПИСОК!$B$1:$B$10,MATCH(D97,СПИСОК!$A$1:$A$10,0)),\"\")","v":"нд"},null,null,null,null,"Томат",false,null,26205.7]
["26-0097","2026-02-27","2026-03-03","Игнатов",{"$f":"IFERROR(INDEX(СПИСОК!$B$1:$B$10,MATCH(D98,СПИСОК!$A$1:$A$10,0)),\"\")","v":"ам"},null,null,null,null,"Черешня",false,null,25102.93]
["26-0098","2026-02-27","2026-02-25","Иванов",{"$f":"IFERROR(INDEX(СПИСОК!$B$1:$B$10,MATCH(D99,СПИСОК!$A$1:$A$10,0)),\"\")","v":"ол"},null,null,null,null,"Слива",false,null,121213.82]
["26-0099","2026-02-27","2026-03-02","Петров",{"$f":"IFERROR(INDEX(СПИСОК!$B$1:$B$10,MATCH(D100,СПИСОК!$A$1:$A$10,0)),\"\")","v":"тг"},null,null,null,null,"Слива",false,null,19525.810000000001,null,null,null,null,null,null,"J:J - груша + слива"]
["26-0100","2026-03-02","2026-02-27","Лавреньтев",{"$f":"IFERROR(INDEX(СПИСОК!$B$1:$B$10,MATCH(D101,СПИСОК!$A$1:$A$10,0)),\"\")","v":"ам"},null,null,null,null,"Томат",false,null,19951.25]
["26-0101","2026-03-02","2026-03-03","Григорьев",{"$f":"IFERROR(INDEX(СПИСОК!$B$1:$B$10,MATCH(D102,СПИСОК!$A$1:$A$10,0)),\"\")","v":"ол"},null,null,null,null,"Груша",false,null,63803.91]
["26-0102","2026-03-02","2026-03-02","Сидоров",{"$f":"IFERROR(INDEX(СПИСОК!$B$1:$B$10,MATCH(D103,СПИСОК!$A$1:$A$10,0)),\"\")","v":"пр"},null,null,null,null,"Слива",false,null,36067.5]
["26-0103","2026-03-02","2026-03-02","Иванов",{"$f":"IFERROR(INDEX(СПИСОК!$B$1:$B$10,MATCH(D104,СПИСОК!$A$1:$A$10,0)),\"\")","v":"ол"},null,null,null,null,"Картофель",false,null,15770.85]
["26-0104","2026-03-02","2026-03-02","Лавреньтев",{"$f":"IFERROR(INDEX(СПИСОК!$B$1:$B$10,MATCH(D105,СПИСОК!$A$1:$A$10,0)),\"\")","v":"ам"},null,null,null,null,"Клубника",false,null,19762.97]
["26-0105","2026-03-02","2026-03-03","Петров",{"$f":"IFERROR(INDEX(СПИСОК!$B$1:$B$10,MATCH(D106,СПИСОК!$A$1:$A$10,0)),\"\")","v":"тг"},null,null,null,null,"Картофель",false,null,59288.92]
["26-0106","2026-03-02","2026-03-03","Григорьев",{"$f":"IFERROR(INDEX(СПИСОК!$B$1:$B$10,MATCH(D107,СПИСОК!$A$1:$A$10,0)),\"\")","v":"ол"},null,null,null,null,"Картофель",false,null,27835.5]
["26-0107","2026-03-03","2026-03-04","Игнатов",{"$f":"IFERROR(INDEX(СПИСОК!$B$1:$B$10,MATCH(D108,СПИСОК!$A$1:$A$10,0)),\"\")","v":"ам"},null,null,null,null,"Томат",false,null,31249.22]
["26-0108","2026-03-03","2026-03-03","Игнатов",{"$f":"IFERROR(INDEX(СПИСОК!$B$1:$B$10,MATCH(D109,СПИСОК!$A$1:$A$10,0)),\"\")","v":"ам"},null,null,null,null,"Картофель",false,null,15652.28]
["26-0109","2026-03-04","2026-03-04","Петров",{"$f":"IFERROR(INDEX(СПИСОК!$B$1:$B$10,MATCH(D110,СПИСОК!$A$1:$A$10,0)),\"\")","v":"тг"},null,null,null,null,"Черешня",false,null,20553.5]
["26-0110","2026-02-18","2026-03-05","Петров",{"$f":"IFERROR(INDEX(СПИСОК!$B$1:$B$10,MATCH(D111,СПИСОК!$A$1:$A$10,0)),\"\")","v":"тг"},null,null,null,null,"Черешня",false,null,13913.13]
["26-0111","2026-03-04","2026-03-05","Сидоров",{"$f":"IFERROR(INDEX(СПИСОК!$B$1:$B$10,MATCH(D112,СПИСОК!$A$1:$A$10,0)),\"\")","v":"пр"},null,null,null,null,"Груша",false,null,148449]
["26-0112","2026-03-05","2026-03-05","Петров",{"$f":"IFERROR(INDEX(СПИСОК!$B$1:$B$10,MATCH(D113,СПИСОК!$A$1:$A$10,0)),\"\")","v":"тг"},null,null,null,null,"Картофель",false,null,346783.5]
["26-0113","2026-03-05","2026-03-10","Игнатов",{"$f":"IFERROR(INDEX(СПИСОК!$B$1:$B$10,MATCH(D114,СПИСОК!$A$1:$A$10,0)),\"\")","v":"ам"},null,null,null,null,"Груша",false,null,10122]
["26-0114","2026-03-04","2026-03-05","Григорьев",{"$f":"IFERROR(INDEX(СПИСОК!$B$1:$B$10,MATCH(D115,СПИСОК!$A$1:$A$10,0)),\"\")","v":"ол"},null,null,null,null,"Груша",false,null,33913.269999999997]
["26-0115","2026-03-05","2026-03-06",null,null,null,null,null,null,null,false]
["26-0116","2026-03-05","2026-03-06",null,null,null,null,null,null,null,false]
["26-0117","2026-03-05","2026-03-06",null,null,null,null,null,null,null,false]
["26-0118","2026-03-05","2026-03-06",null,null,null,null,null,null,null,false]
["26-0119","2026-03-06","2026-03-10",null,null,null,null,null,null,null,false]
{"$rows_left_out":72}