{"text_format":"1","workbook":"xlsx","n_sheets":3,"sheets":["вариант 1","Результаты жеребьевки","вариант 2"],"not_rendered":{"charts":0,"images":0,"macros":1,"external_links":1,"defined_names":2,"comments":0,"pivot_tables":0},"unopened":[],"bounds":{"document_bytes":16777216,"sheet_cells":100000,"rows_first":2000,"rows_last":500,"rows_between":2000,"halvings":0,"cell_chars":16384,"cell_head_chars":4096},"cells_cut":0,"cells_raw":0,"read":"whole","date_system":"1900"}

{"sheet":"вариант 1","index":0,"n_rows":27,"n_cols":9,"rows_kept":27,"cut":false,"hidden":false,"merged":[]}
["номер","фамилия","ДР","город",null,"Чтоб было примерно так. Наименьшее совпадение городов. Если делить по 3 города или по 4. Совпадение возможно , но чтоб было наименьшее совпадение, если можно , то и по 5,6,7 городов."]
[346,"а",null,"Пенза",null,346,"а",null,"Пенза"]
[283,"в",null,"Тула",null,283,"в",null,"Тула"]
[345,"с",null,"Калуга",null,345,"с",null,"Калуга"]
[141,"д",null,{"$f":"IFERROR(VLOOKUP(A5,[1]Муж!$C$5:$X$855,7,0),\"\")","v":"Качканар"},null,141,"д",null,{"$f":"IFERROR(VLOOKUP(F5,[1]Муж!$C$5:$X$855,7,0),\"\")","v":"Качканар"}]
[264,"а",null,{"$f":"IFERROR(VLOOKUP(A6,[1]Муж!$C$5:$X$855,7,0),\"\")","v":"Серов"},null,264,"а",null,{"$f":"IFERROR(VLOOKUP(F6,[1]Муж!$C$5:$X$855,7,0),\"\")","v":"Серов"}]
[367,"в",null,{"$f":"IFERROR(VLOOKUP(A7,[1]Муж!$C$5:$X$855,7,0),\"\")","v":"Екатеринбург"},null,367,"в",null,{"$f":"IFERROR(VLOOKUP(F7,[1]Муж!$C$5:$X$855,7,0),\"\")","v":"Екатеринбург"}]
[136,"с",null,{"$f":"IFERROR(VLOOKUP(A8,[1]Муж!$C$5:$X$855,7,0),\"\")","v":"Качканар"},null,136,"с",null,{"$f":"IFERROR(VLOOKUP(F8,[1]Муж!$C$5:$X$855,7,0),\"\")","v":"Качканар"}]
[368,"д",null,{"$f":"IFERROR(VLOOKUP(A9,[1]Муж!$C$5:$X$855,7,0),\"\")","v":"Екатеринбург"},null,368,"д",null,{"$f":"IFERROR(VLOOKUP(F9,[1]Муж!$C$5:$X$855,7,0),\"\")","v":"Екатеринбург"}]
[380,"а",null,"Пенза",null,380,"а",null,"Пенза"]
[226,"в",null,"Калуга",null,226,"в",null,"Калуга"]
[72,"с",null,"Курск",null,72,"с",null,"Курск"]
[341,"д",null,"Курск",null,34,"в",null,"Тула"]
[82,"а",null,"Курск",null,82,"а",null,"Курск"]
[34,"в",null,"Тула",null,381,"в",null,"Пенза"]
[384,"с",null,"Пенза",null,384,"с",null,"Пенза"]
[225,"д",null,"Калуга",null,225,"д",null,"Калуга"]
[57,"а",null,"Курск",null,57,"а",null,"Курск"]
[343,"в",null,"Калуга",null,343,"в",null,"Калуга"]
[379,"с",null,"Пенза",null,379,"с",null,"Пенза"]
[200,"д",null,{"$f":"IFERROR(VLOOKUP(A21,[1]Муж!$C$5:$X$855,7,0),\"\")","v":"Лесной"},null,200,"д",null,"Саратов"]
[318,"а",null,{"$f":"IFERROR(VLOOKUP(A22,[1]Муж!$C$5:$X$855,7,0),\"\")","v":"Новоуральск"},null,73,"с",null,"Курск"]
[381,"в",null,"Пенза",null,316,"д",null,"Калуга"]
[73,"с",null,"Курск",null,342,"в",null,"Калуга"]
[316,"д",null,"Калуга",null,341,"д",null,"Курск"]
[340,"а",null,"Калуга",null,318,"а",null,"Саратов"]
[342,"в",null,"Калуга",null,340,"а",null,"Калуга"]

{"sheet":"Результаты жеребьевки","index":1,"n_rows":33,"n_cols":1,"rows_kept":33,"cut":false,"hidden":false,"merged":[]}
["КОМАНДА №1"]
["346 а (Пенза)"]
["283 в (Тула)"]
["345 с (Калуга)"]
["141 д (Качканар)"]
["264 а (Серов)"]
["367 в (Екатеринбург)"]
["72 с (Курск)"]
["200 д (Лесной)"]
[]
["КОМАНДА №2"]
["380 а (Пенза)"]
["34 в (Тула)"]
["226 в (Калуга)"]
["136 с (Качканар)"]
["368 д (Екатеринбург)"]
["341 д (Курск)"]
["318 а (Новоуральск)"]
["384 с (Пенза)"]
[]
["КОМАНДА №3"]
["379 с (Пенза)"]
["225 д (Калуга)"]
["82 а (Курск)"]
["381 в (Пенза)"]
["343 в (Калуга)"]
["57 а (Курск)"]
["316 д (Калуга)"]
["73 с (Курск)"]
[]
["КОМАНДА №4"]
["340 а (Калуга)"]
["342 в (Калуга)"]

{"sheet":"вариант 2","index":2,"n_rows":27,"n_cols":7,"rows_kept":27,"cut":false,"hidden":false,"merged":[]}
["номер","город",null,"Группа","Номер","Город","Состав Группы"]
[34,"Тула",null,1,225,"Калуга","Калуга:1, Курск:1, Пенза:1"]
[57,"Курск",null,1,57,"Курск","Калуга:1, Курск:1, Пенза:1"]
[72,"Курск",null,1,346,"Пенза","Калуга:1, Курск:1, Пенза:1"]
[73,"Курск",null,2,226,"Калуга","Калуга:1, Курск:1, Пенза:1"]
[82,"Курск",null,2,72,"Курск","Калуга:1, Курск:1, Пенза:1"]
[136,{"$f":"IFERROR(VLOOKUP(A7,[1]Муж!$C$5:$X$855,7,0),\"\")","v":"Качканар"},null,2,379,"Пенза","Калуга:1, Курск:1, Пенза:1"]
[141,{"$f":"IFERROR(VLOOKUP(A8,[1]Муж!$C$5:$X$855,7,0),\"\")","v":"Качканар"},null,3,316,"Калуга","Калуга:1, Курск:1, Пенза:1"]
[200,{"$f":"IFERROR(VLOOKUP(A9,[1]Муж!$C$5:$X$855,7,0),\"\")","v":"Лесной"},null,3,73,"Курск","Калуга:1, Курск:1, Пенза:1"]
[225,"Калуга",null,3,380,"Пенза","Калуга:1, Курск:1, Пенза:1"]
[226,"Калуга",null,4,340,"Калуга","Калуга:1, Курск:1, Пенза:1"]
[264,{"$f":"IFERROR(VLOOKUP(A12,[1]Муж!$C$5:$X$855,7,0),\"\")","v":"Серов"},null,4,82,"Курск","Калуга:1, Курск:1, Пенза:1"]
[283,"Тула",null,4,381,"Пенза","Калуга:1, Курск:1, Пенза:1"]
[316,"Калуга",null,5,342,"Калуга","Калуга:1, Тула:1, Качканар:1"]
[318,{"$f":"IFERROR(VLOOKUP(A15,[1]Муж!$C$5:$X$855,7,0),\"\")","v":"Новоуральск"},null,5,34,"Тула","Калуга:1, Тула:1, Качканар:1"]
[340,"Калуга",null,5,136,"Качканар","Калуга:1, Тула:1, Качканар:1"]
[341,"Курск",null,6,343,"Калуга","Калуга:1, Екатеринбург:1, Курск:1"]
[342,"Калуга",null,6,367,"Екатеринбург","Калуга:1, Екатеринбург:1, Курск:1"]
[343,"Калуга",null,6,341,"Курск","Калуга:1, Екатеринбург:1, Курск:1"]
[345,"Калуга",null,7,345,"Калуга","Калуга:1, Пенза:1, Тула:1"]
[346,"Пенза",null,7,384,"Пенза","Калуга:1, Пенза:1, Тула:1"]
[367,{"$f":"IFERROR(VLOOKUP(A22,[1]Муж!$C$5:$X$855,7,0),\"\")","v":"Екатеринбург"},null,7,283,"Тула","Калуга:1, Пенза:1, Тула:1"]
[368,{"$f":"IFERROR(VLOOKUP(A23,[1]Муж!$C$5:$X$855,7,0),\"\")","v":"Екатеринбург"},null,8,141,"Качканар","Качканар:1, Екатеринбург:1, Новоуральск:1"]
[379,"Пенза",null,8,368,"Екатеринбург","Качканар:1, Екатеринбург:1, Новоуральск:1"]
[380,"Пенза",null,8,318,"Новоуральск","Качканар:1, Екатеринбург:1, Новоуральск:1"]
[381,"Пенза",null,9,200,"Лесной","Лесной:1, Серов:1"]
[384,"Пенза",null,9,264,"Серов","Лесной:1, Серов:1"]