{"text_format":"1","workbook":"xlsx","n_sheets":2,"sheets":["Доход_Расход","Условия"],"not_rendered":{"charts":0,"images":1,"macros":1,"external_links":0,"defined_names":5,"comments":0,"pivot_tables":0},"unopened":[],"bounds":{"document_bytes":16777216,"sheet_cells":100000,"rows_first":2000,"rows_last":500,"rows_between":2000,"halvings":0,"cell_chars":16384,"cell_head_chars":4096},"cells_cut":0,"cells_raw":0,"read":"whole","date_system":"1900"}

{"sheet":"Доход_Расход","index":0,"n_rows":10,"n_cols":10,"rows_kept":10,"cut":false,"hidden":false,"merged":[]}
[null,null,null,null,null,"ДОХОДЫ/РАСХОДЫ"]
["МЕСЯЦ","ДАТА","ВИД","СТАТЬИ","ФИО","СУММА, ВАЛ.","ВАЛ.","КУРС","СУММА, ГРН","ПРИМЕЧАНИЯ"]
[{"$f":"IF(ISBLANK(ДАННЫЕ[[#This Row],[ДАТА]]),\"\",VLOOKUP(MONTH(ДАННЫЕ[[#This Row],[ДАТА]]),Условия!$G$1:$H$13,2,0))","v":"Октябрь"},"2013-10-21","ДОХОД","продали валюту","АЛЕЙНИКОВ",1000,"UAH",1,{"$f":"ДАННЫЕ[[#This Row],[КУРС]]*ДАННЫЕ[[#This Row],[СУММА, ВАЛ.]]","v":1000}]
[{"$f":"IF(ISBLANK(ДАННЫЕ[[#This Row],[ДАТА]]),\"\",VLOOKUP(MONTH(ДАННЫЕ[[#This Row],[ДАТА]]),Условия!$G$1:$H$13,2,0))","v":"Октябрь"},"2013-10-21","РАСХОД","купили остров","ЕВТУШЕНКО",2000,"UAH",1,{"$f":"ДАННЫЕ[[#This Row],[КУРС]]*ДАННЫЕ[[#This Row],[СУММА, ВАЛ.]]","v":2000}]
[{"$f":"IF(ISBLANK(ДАННЫЕ[[#This Row],[ДАТА]]),\"\",VLOOKUP(MONTH(ДАННЫЕ[[#This Row],[ДАТА]]),Условия!$G$1:$H$13,2,0))","v":"Октябрь"},"2013-10-16","ДОХОД","продали валюту","Менеджер 2",112,"USD",12,{"$f":"ДАННЫЕ[[#This Row],[КУРС]]*ДАННЫЕ[[#This Row],[СУММА, ВАЛ.]]","v":1344}]
[]
[]
[]
[]
["тимур"]

{"sheet":"Условия","index":1,"n_rows":13,"n_cols":10,"rows_kept":13,"cut":false,"hidden":false,"merged":[]}
["ФИО",null,"ДОХОД",null,"РАСХОД",null,"№","Месяц",null,"ВИД"]
["Менеджер 1",null,"продали валюту",null,"купили машину",null,1,"Январь",null,"ДОХОД"]
["Менеджер 2",null,"продали тачку",null,"купили остров",null,2,"Февраль",null,"РАСХОД"]
["Менеджер 3",null,null,null,null,null,3,"Март"]
[null,null,null,null,null,null,4,"Апрель"]
[null,null,null,null,null,null,5,"Май"]
[null,null,null,null,null,null,6,"Июнь"]
[null,null,null,null,null,null,7,"Июль"]
[null,null,null,null,null,null,8,"Август"]
[null,null,null,null,null,null,9,"Сентябрь"]
[null,null,null,null,null,null,10,"Октябрь"]
[null,null,null,null,null,null,11,"Ноябрь"]
[null,null,null,null,null,null,12,"Декабрь"]