{"text_format":"1","workbook":"xlsx","n_sheets":3,"sheets":["ЗАКАЗЫ","Растаможка","СПИСОК"],"not_rendered":{"charts":0,"images":0,"macros":1,"external_links":0,"defined_names":1,"comments":0,"pivot_tables":0},"unopened":[],"bounds":{"document_bytes":16777216,"sheet_cells":100000,"rows_first":2000,"rows_last":500,"rows_between":2000,"halvings":0,"cell_chars":16384,"cell_head_chars":4096},"cells_cut":0,"cells_raw":0,"read":"whole","date_system":"1900"}

{"sheet":"ЗАКАЗЫ","index":0,"n_rows":21,"n_cols":11,"rows_kept":21,"cut":false,"hidden":false,"merged":[]}
["ЛИМИТ закупки",120,null,"ДАТА НА ТАМОЖНЕ","наименование","описание"," цена прайса","цена по договору","Оформлено на ","растаможено","ПОИСК ПОСЫЛКИ В РБ "]
["Evro",1.359,null,{"$f":"NOW()","v":"2013-10-31T01:14:54.570"},null,"$$$$$ Итго:",{"$f":"SUM(G5:G77)","v":207.45999999999998},{"$f":"SUM(H5:H77)","v":138.66}]
["$$$$$",9160,null,null,null,"Evro Итго:",{"$f":"G2/B2","v":152.65636497424575},{"$f":"H2/B2","v":102.03090507726269}]
[]
[null,null,null,"2013-10-30",null,"регистратор",90.35,54.98,{"$f":"IF(H5=\"\",\"\",IF(I4=\"\",СПИСОК!$A$2,IF(SUMIF($I$3:I4,I4,$H$3:H4)+H5>$B$1,INDEX(СПИСОК!$A$2:$A$100,MATCH(I4,СПИСОК!$A$2:$A$100,)+1),I4)))","v":"Я"}]
[null,null,null,null,null,"камера",40.11,25,{"$f":"IF(H6=\"\",\"\",IF(I5=\"\",СПИСОК!$A$2,IF(SUMIF($I$3:I5,I5,$H$3:H5)+H6>$B$1,INDEX(СПИСОК!$A$2:$A$100,MATCH(I5,СПИСОК!$A$2:$A$100,)+1),I5)))","v":"Я"}]
[null,null,null,null,5555555,"конектора RJ45",4.16,4.16,{"$f":"IF(H7=\"\",\"\",IF(I6=\"\",СПИСОК!$A$2,IF(SUMIF($I$3:I6,I6,$H$3:H6)+H7>$B$1,INDEX(СПИСОК!$A$2:$A$100,MATCH(I6,СПИСОК!$A$2:$A$100,)+1),I6)))","v":"Я"}]
[null,null,null,null,null,"ДОЖДЕВЕКИ НА ЗЕРКАЛО",null,null,{"$f":"IF(H8=\"\",\"\",IF(I7=\"\",СПИСОК!$A$2,IF(SUMIF($I$3:I7,I7,$H$3:H7)+H8>$B$1,INDEX(СПИСОК!$A$2:$A$100,MATCH(I7,СПИСОК!$A$2:$A$100,)+1),I7)))","v":""}]
[null,null,null,null,1,3,2,5,{"$f":"IF(H9=\"\",\"\",IF(I8=\"\",СПИСОК!$A$2,IF(SUMIF($I$3:I8,I8,$H$3:H8)+H9>$B$1,INDEX(СПИСОК!$A$2:$A$100,MATCH(I8,СПИСОК!$A$2:$A$100,)+1),I8)))","v":"Я"}]
[null,null,null,null,null,"сигналка",61.43,40.11,{"$f":"IF(H10=\"\",\"\",IF(I9=\"\",СПИСОК!$A$2,IF(SUMIF($I$3:I9,I9,$H$3:H9)+H10>$B$1,INDEX(СПИСОК!$A$2:$A$100,MATCH(I9,СПИСОК!$A$2:$A$100,)+1),I9)))","v":"Мама"},null,"http://search.belpost.by/#RB533992418CN"]
[null,null,null,null,5,5,5,5,{"$f":"IF(H11=\"\",\"\",IF(I10=\"\",СПИСОК!$A$2,IF(SUMIF($I$3:I10,I10,$H$3:H10)+H11>$B$1,INDEX(СПИСОК!$A$2:$A$100,MATCH(I10,СПИСОК!$A$2:$A$100,)+1),I10)))","v":"Мама"}]
[null,null,null,null,null,"конектора RJ11",2.41,2.41,{"$f":"IF(H12=\"\",\"\",IF(I11=\"\",СПИСОК!$A$2,IF(SUMIF($I$3:I11,I11,$H$3:H11)+H12>$B$1,INDEX(СПИСОК!$A$2:$A$100,MATCH(I11,СПИСОК!$A$2:$A$100,)+1),I11)))","v":"Мама"}]
[null,null,null,null,null,null,null,null,{"$f":"IF(H13=\"\",\"\",IF(I12=\"\",СПИСОК!$A$2,IF(SUMIF($I$3:I12,I12,$H$3:H12)+H13>$B$1,INDEX(СПИСОК!$A$2:$A$100,MATCH(I12,СПИСОК!$A$2:$A$100,)+1),I12)))","v":""},null,"http://search.belpost.by/#RB836195654CN"]
[null,null,null,null,"CY-3","VGA АДАПТЕР",2,2,{"$f":"IF(H14=\"\",\"\",IF(I13=\"\",СПИСОК!$A$2,IF(SUMIF($I$3:I13,I13,$H$3:H13)+H14>$B$1,INDEX(СПИСОК!$A$2:$A$100,MATCH(I13,СПИСОК!$A$2:$A$100,)+1),I13)))","v":"Я"}]
[null,null,null,null,null,"СЕТЕВАЯ ЗАЧИСТКА",null,null,{"$f":"IF(H15=\"\",\"\",IF(I14=\"\",СПИСОК!$A$2,IF(SUMIF($I$3:I14,I14,$H$3:H14)+H15>$B$1,INDEX(СПИСОК!$A$2:$A$100,MATCH(I14,СПИСОК!$A$2:$A$100,)+1),I14)))","v":""}]
[null,null,null,null,null,null,null,null,{"$f":"IF(H16=\"\",\"\",IF(I15=\"\",СПИСОК!$A$2,IF(SUMIF($I$3:I15,I15,$H$3:H15)+H16>$B$1,INDEX(СПИСОК!$A$2:$A$100,MATCH(I15,СПИСОК!$A$2:$A$100,)+1),I15)))","v":""}]
[null,null,null,null,null,null,null,null,{"$f":"IF(H17=\"\",\"\",IF(I16=\"\",СПИСОК!$A$2,IF(SUMIF($I$3:I16,I16,$H$3:H16)+H17>$B$1,INDEX(СПИСОК!$A$2:$A$100,MATCH(I16,СПИСОК!$A$2:$A$100,)+1),I16)))","v":""}]
[null,null,null,null,null,null,null,null,{"$f":"IF(H18=\"\",\"\",IF(I17=\"\",СПИСОК!$A$2,IF(SUMIF($I$3:I17,I17,$H$3:H17)+H18>$B$1,INDEX(СПИСОК!$A$2:$A$100,MATCH(I17,СПИСОК!$A$2:$A$100,)+1),I17)))","v":""}]
[null,null,null,null,null,null,null,null,{"$f":"IF(H19=\"\",\"\",IF(I18=\"\",СПИСОК!$A$2,IF(SUMIF($I$3:I18,I18,$H$3:H18)+H19>$B$1,INDEX(СПИСОК!$A$2:$A$100,MATCH(I18,СПИСОК!$A$2:$A$100,)+1),I18)))","v":""}]
[null,null,null,null,null,null,null,null,{"$f":"IF(H20=\"\",\"\",IF(I19=\"\",СПИСОК!$A$2,IF(SUMIF($I$3:I19,I19,$H$3:H19)+H20>$B$1,INDEX(СПИСОК!$A$2:$A$100,MATCH(I19,СПИСОК!$A$2:$A$100,)+1),I19)))","v":""}]
[null,null,null,null,null,null,null,null,{"$f":"IF(H21=\"\",\"\",IF(I20=\"\",СПИСОК!$A$2,IF(SUMIF($I$3:I20,I20,$H$3:H20)+H21>$B$1,INDEX(СПИСОК!$A$2:$A$100,MATCH(I20,СПИСОК!$A$2:$A$100,)+1),I20)))","v":""}]

{"sheet":"Растаможка","index":1,"n_rows":1,"n_cols":7,"rows_kept":1,"cut":false,"hidden":false,"merged":[]}
["дата оформления","на кого","наименование","описание","кол-во шт.","цена оплаты по договору","растаможка"]

{"sheet":"СПИСОК","index":2,"n_rows":5,"n_cols":1,"rows_kept":5,"cut":false,"hidden":false,"merged":[]}
["На кого оформлять"]
["Я"]
["Мама"]
["Муж"]
["Катюха"]