{"text_format":"1","workbook":"xlsx","n_sheets":3,"sheets":["Форма","320G","Параметры"],"not_rendered":{"charts":0,"images":0,"macros":1,"external_links":0,"defined_names":22,"comments":0,"pivot_tables":0},"unopened":[],"bounds":{"document_bytes":16777216,"sheet_cells":100000,"rows_first":2000,"rows_last":500,"rows_between":2000,"halvings":0,"cell_chars":16384,"cell_head_chars":4096},"cells_cut":0,"cells_raw":0,"read":"whole","date_system":"1900"}

{"sheet":"Форма","index":0,"n_rows":11,"n_cols":10,"rows_kept":11,"cut":false,"hidden":false,"merged":[[8,9,8,12],[9,9,9,12],[0,3,0,13],[2,5,2,6],[4,9,4,13],[5,9,5,13],[9,5,9,6],[8,5,8,6],[3,5,3,6],[4,5,4,6],[5,5,5,6],[7,5,7,6],[6,0,6,2],[11,9,11,10],[10,5,10,6],[8,1,8,3],[15,11,15,14]]}
[null,null,null,{"$f":"'320G'!A2","v":0}]
[]
[null,null,null,null,null,"Город",null,null,"Батайск"]
[null,null,null,null,null,"Предприятияе",null,"ООО","Резметкон"]
[null,null,null,null,null,"Должность",null,null,"Генеральному директору","Имя и Отчество в Имительном подеже"]
[null,null,null,null,null,"ФИО",null,null,"Петрову И.А.","Игорь Анатольевич"]
["Если нужно изменить число:",null,null,"2013-11-25","до",null,{"$f":"IF(F7=\"\",30,\"\")","v":30}]
[null,null,"№ ТКП","04",null,null,null,null,"Модель станка"]
[null,null,null,null,null,"Срок поставки",null,{"$f":"IF(H10=\"\",VLOOKUP(I9,#REF!,14,0),\"\")","v":{"$error":"#REF!"}},"230G"]
[null,null,"Курс Евро =",44.8,null,"изменить",null,null,"Город доставки"]
[null,null,"Кол-во станков",1,null,null,null,null,{"$f":"I3","v":"Батайск"}]

{"sheet":"320G","index":1,"n_rows":8,"n_cols":42,"rows_kept":8,"cut":false,"hidden":false,"merged":[[1,0,1,39],[11,1,30,38],[3,0,4,0],[45,29,45,38],[4,23,4,39],[5,23,5,39],[7,23,7,39],[9,7,9,29],[32,1,37,17],[6,18,6,39]]}
[]
[]
[]
[]
[null,null,null,null,null,null,null,null,null,null,null,null,null,null,null,null,null,null,null,null,null,null,null,{"$f":"IF(I2=\"\",\"\",\"г.\"&Форма!$I$3)","v":""}]
[]
[]
[null,null,null,null,null,null,null,null,null,null,null,null,null,null,null,null,null,null,null,null,null,null,null,null,null,null,null,null,null,null,null,null,null,null,null,null,null,null,null,null,null,{"$f":"IF(Форма!D7=\"\",TEXT(SUM(TODAY(),IF(Форма!F7=\"\",Форма!G7,Форма!F7)),\"ДД.ММ.ГГГГ\"),TEXT(SUM(Форма!D7,IF(Форма!F7=\"\",Форма!G7,Форма!F7)),\"ДД.ММ.ГГГГ\"))","v":"25.12.2013"}]

{"sheet":"Параметры","index":2,"n_rows":28,"n_cols":23,"rows_kept":28,"cut":false,"hidden":false,"merged":[]}
[null,null,1,2,3,4,5,6,7,8,9,10,11,12,13,14,15,16,17,18,19,20,21]
[null,null,"Модели","Ø30°  (налево)","██ 30° (налево)","Ø45°     (налево)","██ 45° (налево)","Ø90°","██ 90°","Ø45° (направо)","██ 45° (направо)","Ø30°  (направо)","██ 30° (направо)","Скорость пиления","Мощность привода пилы","Подача рамы","Натяжение пилы","Размер полотна","Минимальный диаметр пиления","Остаточная длина заготовки","Рабочая высота","Вес станка","Размеры (ДхШхВ)"]
[null,1,"230G",110,"120х80",180,"200х180",230,"300х150","-","-","-","-","28/56","1/1,5","Под собственным весом","Механическое","2720х27х0,9",5,20,735,310,"840х1420х1230"]
[null,2,"230DG",110,"120х80",180,"200х180",230,"300х150",170,"200х70","-","-","28/57","1/1,5","Под собственным весом","Механическое","2720х27х0,10",5,20,735,330,"840х1420х1231"]
[null,3,"260DG",130,"120х120",200,"180х180",260,"300х260",200,"180х180",130,"120х120","35/75","1/1,8","Под собственным весом","Механическое","3350х27х0,9",5,25,900,600,"800х1720х1450"]
[null,4,"260GA","-","-","-","-",260,"300х260",200,"180х180",130,"120х120","35/75","1/1,8","Автоматическая","Механическое","3700х27х0,9",5,10,750,900,"1330х1840х1830"]
[null,5,"260GP","-","-","-","-",260,"300х260",240,"220х260",140,"140х200","15-150","1/1,8","Полуавтоматическая","Механическое","3350х27х0,9",5,20,750,625,"2000х1650х1850"]
[null,6,"Plus 260GP",null,null,null,null,null,null,null,null,null,null,null,"1/1,9"]
[null,7,"260AP","-","-","-","-",260,"300х260","-","-","-","-","15-150",1.5,"Автоматическая","Механическое","3700х27х0,9",5,"20-в ручном режиме, 100-в автоматическом",750,1050,"2150х1650х1850"]
[null,8,"320G","-","-","-","-",325,"500х300",300,"300х300",200,"200х200","37/50","0,75/1,1","Под собственным весом","Механическое","4200х27х0,9",5,60,750,820,"1250х2050х1280"]
[null,9,"320G-H","-","-","-","-",325,"500х300",300,"300х300",200,"200х200","37/50","0,75/1,1","Под собственным весом","Механическое","4200х27х0,9",5,60,750,820,"1250х2050х1280"]
[null,10,"320G-HSS","-","-","-","-",325,"500х300",300,"300х300",200,"200х200","15-150","3 (ас.двигатель)","Полуавтоматическая","Механическое","4200х34х1,1",5,60,750,840,"1250х2050х1280"]
[null,11,"320DG","-","-",300,"300х300",325,"500х325",360,"420х360",300,"300х300","15-150","3 (ас.двигатель)","Полуавтоматическая","Механическое","4200х34х1,1",5,60,751,1100,"1450х2350х1350"]
[null,12,"405DG","-","-",300,"420х360",410,"620х410",360,"420х360",null,null,"15-150","3 (ас.двигатель)","Полуавтоматическая","Механическое","5000х34х1,1",5,105,752,1200,"1450х2450хз1420"]
[null,13,335,"-","-","-","-",335,"500х335","-","-","-","-","15-150","3 (ас.двигатель)","Полуавтоматическая","Механическое","4400х34х1,1",5,"25-в ручном режиме",750,1020,"1200x2150x1900"]
[null,14,"335G","-","-","-","-",335,"500х336",330,"320х335",200,"200х335","15-150","3 (ас.двигатель)","Полуавтоматическая","Механическое","4400х34х1,1",5,"65-в ручном режиме",750,1020,"1250x2200x1900"]
[null,15,"335DG",330,"320х335",200,"200х335",335,"500х337",330,"320х335",200,"200х335","15-150","3 (ас.двигатель)","Полуавтоматическая","Механическое","4400х34х1,1",5,"75-в ручном режиме",750,1320,"1450x2300x1900"]
[null,16,"335A","-","-","-","-",335,"500х338","-","-","-","-","15-150","3 (ас.двигатель)","Автоматическая","Механическое","4400х34х1,1",5,"65-в ручном режиме, 115-в автоматическом",750,1550,"2000x2200x1900"]
[null,17,"335GA","-","-","-","-",5556583,"500х339",330,"320х335",200,"200х335","15-150","3 (ас.двигатель)","Автоматическая","Механическое","4400х34х1,1",5,"65-в ручном режиме, 120-в автоматическом",750,1510,"2350x2200x1900"]
[null,18,"335DGA-600",330,"320х335",200,"200х335",335,"500х337",330,"320х335",200,"200х335","15-150","3 (ас.двигатель)","Автоматическая","Механическое","4400х34х1,1",5,"80-в ручном режиме, 300-в автоматическом",750,2020,"2480x2300x1900"]
[null,19,"335DGA-1000",330,"320х335",200,"200х335",335,"500х337",330,"320х335",200,"200х335","15-150","3 (ас.двигатель)","Автоматическая","Механическое","4400х34х1,1",5,"80-в ручном режиме, 300-в автоматическом",750,2220,"2880x2300x1900"]
[null,20,"335DGA-2300",330,"320х335",200,"200х335",335,"500х337",330,"320х335",200,"200х335","15-150","3 (ас.двигатель)","Автоматическая","Механическое","4400х34х1,1",5,"80-в ручном режиме, 300-в автоматическом",750,2550,"4350x2800x2000"]
[null,21,"335DGA-3300",330,"320х335",200,"200х335",335,"500х337",330,"320х335",200,"200х335","15-150","3 (ас.двигатель)","Автоматическая","Механическое","4400х34х1,1",5,"80-в ручном режиме, 300-в автоматическом",750,2880,"5350x2800x2000"]
[null,22,400,"-","-","-","-",400,"500х400","-","-","-","-","15-150","5,5 (ас.двигатель)","Полуавтоматическая","Механическое","6220x41x1,3",5,25,750,1250,"960x3100x2150"]
[null,23,"400A","-","-","-","-",400,"500х400","-","-","-","-","15-150","5,5 (ас.двигатель)","Автоматическая","Механическое","6220x41x1,3",5,"25-в ручном режиме, 110-в автоматическом",750,1950,"1620x3100x2150"]
[null,24,500,"-","-","-","-",500,"500х500","-","-","-","-","15-150","7,5 (ас.двигатель)","Полуавтоматическая","Механическое","6220x41x1,3",5,25,750,1350,"960x3100x2150"]
[null,25,"500А","-","-","-","-",500,"500х500","-","-","-","-","15-150","7,5 (ас.двигатель)","Автоматическая","Механическое","6220x41x1,3",5,"25-в ручном режиме, 110-в автоматическом",750,2150,"1620x3100x2150"]
[null,26,410,"-","-","-","-",410,"700х410","-","-","-","-","15-150","5,5 (ас.двигатель)","Полуавтоматическая","Механическое","5800x41x1,3",5,25,750,1850,"1200x2800x2000"]